<svg xmlns="http://www.w3.org/2000/svg" width="259.219" height="109.407" viewBox="0 0 259.219 109.407">
  <defs>
    <style>
      .cls-1 {
        fill: #8e0db3;
        fill-rule: evenodd;
      }
    </style>
  </defs>
  <path id="Rectangle_5_copy_2" data-name="Rectangle 5 copy 2" class="cls-1" d="M680.848,260.78l245.894,43.172L893.5,370.185,667.535,347.35Z" transform="translate(-667.531 -260.781)"/>
</svg>
