<svg width="16" height="16" viewBox="0 0 16 16" fill="none" xmlns="http://www.w3.org/2000/svg">
<path d="M12 4L4 12" stroke="#4B5A73" stroke-width="2" stroke-linecap="round" stroke-linejoin="round"/>
<path d="M4 4L12 12" stroke="#4B5A73" stroke-width="2" stroke-linecap="round" stroke-linejoin="round"/>
</svg>
