<svg width="24" height="24" viewBox="0 0 24 24" fill="none" xmlns="http://www.w3.org/2000/svg">
<path fill-rule="evenodd" clip-rule="evenodd" d="M11.111 0.0925474C11.0601 0.143437 11.0073 0.233032 10.9936 0.2917C10.98 0.350321 10.915 0.651346 10.8492 0.960619C10.7834 1.26989 10.715 1.53488 10.6971 1.5495C10.6791 1.56417 10.55 1.60395 10.4102 1.63793L10.156 1.69978L9.96479 1.49421C9.85965 1.38114 9.64387 1.14211 9.48534 0.962962C9.10446 0.532651 9.06738 0.533261 8.2972 0.982034C7.97492 1.1698 7.67434 1.35578 7.6292 1.39529C7.50535 1.50377 7.52842 1.70587 7.73467 2.31954C7.8378 2.62638 7.92218 2.9111 7.92218 2.95215C7.92218 3.04601 7.5909 3.37388 7.49612 3.37388C7.4573 3.37388 7.1744 3.28953 6.86745 3.18644C6.17049 2.95238 6.04275 2.94779 5.89274 3.1513C5.6788 3.44155 5.15645 4.40207 5.15645 4.50521C5.15645 4.60277 5.24978 4.69888 6.06534 5.44095L6.25135 5.61016L6.17447 5.88039C6.13219 6.02903 6.09024 6.15794 6.08128 6.16694C6.07233 6.17589 5.8131 6.23657 5.50526 6.3018C5.19737 6.36698 4.8975 6.43127 4.83886 6.44467C4.6417 6.48961 4.54705 6.63352 4.54705 6.88834V7.12264H3.7793C3.12242 7.12264 3.00232 7.13384 2.94724 7.2001C2.89403 7.26425 2.87889 8.08705 2.85949 11.968L2.83605 16.6585L1.68757 16.682C0.593648 16.7043 0.53088 16.7105 0.366624 16.8126C0.26537 16.8755 0.154084 17.0026 0.0970819 17.1202C0.0020157 17.3166 0 17.3824 0 20.3065C0 22.8873 0.00979725 23.3155 0.0720965 23.4647C0.169225 23.697 0.269167 23.8015 0.492207 23.9039C0.666682 23.984 0.854939 23.9901 3.20084 23.991C5.94037 23.9921 5.89949 23.9958 6.14958 23.7284C6.35345 23.5104 6.37525 23.3861 6.37525 22.4405C6.37525 21.5587 6.37426 21.5501 6.26016 21.4361C6.19688 21.3728 6.11353 21.3211 6.07491 21.3211C5.96175 21.3211 5.7741 21.4212 5.73379 21.5031C5.7133 21.5447 5.68578 21.9583 5.67261 22.4223L5.64866 23.2657H3.18762H0.726591V20.337V17.4083L2.44505 17.396L4.16346 17.3837L4.17949 17.8684C4.1943 18.3183 4.20518 18.3658 4.33067 18.5301C4.53004 18.7912 4.76976 18.8821 5.26192 18.8833L5.67209 18.8844V19.5191C5.67209 20.1305 5.67631 20.158 5.78718 20.2688C5.93479 20.4164 6.13819 20.4192 6.27334 20.2754C6.36976 20.1728 6.37525 20.1239 6.37525 19.3647C6.37525 18.9201 6.35331 18.5036 6.32607 18.4305C6.26973 18.2794 4.86938 16.8504 4.67831 16.7491C4.59154 16.7031 4.39615 16.682 4.05719 16.682H3.56264V12.2537V7.82553H4.05484H4.54705V8.0364C4.54705 8.26638 4.64863 8.41287 4.83886 8.45715C5.04015 8.50396 6.04552 8.71586 6.06642 8.71586C6.08967 8.71586 6.23462 9.19425 6.23462 9.27096C6.23462 9.29767 6.00356 9.52433 5.72113 9.7746C5.36571 10.0895 5.19864 10.2707 5.17834 10.3629C5.15434 10.4723 5.21355 10.6078 5.50793 11.1173C5.91239 11.8173 5.99053 11.914 6.15132 11.914C6.21366 11.914 6.53041 11.827 6.85517 11.7207C7.17989 11.6144 7.47095 11.5274 7.50193 11.5274C7.57408 11.5274 7.92218 11.8739 7.92218 11.9456C7.92218 11.9755 7.8378 12.2593 7.73467 12.5761C7.50123 13.2935 7.49715 13.4072 7.69952 13.5556C8.00553 13.7801 8.94382 14.2921 9.04924 14.2921C9.15256 14.2921 9.23642 14.2112 9.99001 13.3836L10.1593 13.1976L10.4296 13.2745C10.5783 13.3168 10.7067 13.3581 10.715 13.3664C10.7233 13.3747 10.7838 13.6338 10.8494 13.9422C10.9151 14.2507 10.98 14.551 10.9936 14.6096C11.0379 14.7998 11.1844 14.9013 11.4145 14.9013H11.6255V15.7916V16.682L10.5121 16.6827C9.4469 16.6835 9.39083 16.688 9.21481 16.7882C9.1001 16.8534 8.98975 16.9706 8.92183 17.0993L8.81284 17.3059V20.3224C8.81284 22.75 8.82522 23.3686 8.87617 23.4906C8.97157 23.7188 9.24303 23.9338 9.47887 23.968C9.58954 23.9841 10.8014 23.9908 12.1719 23.9829L14.6638 23.9686L14.8439 23.8247C15.2012 23.5392 15.1879 23.6494 15.188 20.9609C15.188 19.4024 15.1709 18.5162 15.1389 18.4305C15.0826 18.2794 13.6822 16.8504 13.4911 16.7491C13.4044 16.7031 13.209 16.682 12.87 16.682H12.3755V15.7916V14.9013H12.5864C12.8165 14.9013 12.963 14.7998 13.0073 14.6096C13.021 14.551 13.0859 14.2507 13.1515 13.9422C13.2172 13.6338 13.2777 13.3747 13.2859 13.3664C13.2942 13.3581 13.4226 13.3168 13.5713 13.2745L13.8416 13.1976L14.0109 13.3836C14.7684 14.2154 14.8479 14.2921 14.9534 14.2921C15.0606 14.2921 15.9956 13.7816 16.3014 13.5562C16.5038 13.407 16.4997 13.2934 16.2663 12.5761C16.1631 12.2593 16.0787 11.9755 16.0787 11.9456C16.0787 11.8739 16.4269 11.5274 16.499 11.5274C16.53 11.5274 16.821 11.6144 17.1458 11.7207C17.4705 11.827 17.7873 11.914 17.8496 11.914C18.0104 11.914 18.0885 11.8173 18.493 11.1173C18.7874 10.6078 18.8466 10.4723 18.8226 10.3629C18.8023 10.2707 18.6352 10.0895 18.2798 9.7746C17.9974 9.52433 17.7663 9.29767 17.7663 9.27096C17.7663 9.20854 17.9091 8.71586 17.9272 8.71586C18.01 8.71586 19.135 8.46793 19.233 8.42809C19.398 8.36104 19.4539 8.25682 19.4539 8.01606V7.82553H19.9461H20.4383V12.2515V16.6774L19.2781 16.6914C18.1486 16.705 18.1138 16.7083 17.9645 16.8148C17.6612 17.031 17.6257 17.1766 17.6257 18.203C17.6257 19.0562 17.6321 19.125 17.7194 19.2124C17.859 19.3519 18.1099 19.3374 18.2317 19.1826C18.3218 19.0682 18.3288 18.998 18.3288 18.222V17.3849H20.0633H21.7977V17.8324C21.7977 18.3196 21.8387 18.4462 22.0666 18.6627C22.2461 18.8332 22.441 18.8844 22.9112 18.8844H23.2987L23.2865 21.075L23.2743 23.2657H20.8133H18.3523L18.3288 21.8765C18.3072 20.5949 18.2985 20.4796 18.2161 20.3887C18.0996 20.2601 17.8457 20.2576 17.7194 20.3839C17.6298 20.4735 17.6257 20.54 17.6257 21.9038C17.6257 22.7975 17.6443 23.3792 17.6756 23.4618C17.7434 23.6413 17.9457 23.8495 18.1281 23.9275C18.3647 24.0287 23.2294 24.0218 23.4734 23.92C23.7058 23.8229 23.8103 23.723 23.9128 23.5C23.9927 23.326 23.999 23.1415 23.9999 20.9326C24.0009 18.677 23.9962 18.5436 23.911 18.3787C23.7911 18.1469 22.3698 16.7437 22.2196 16.709C22.1552 16.694 21.8915 16.6766 21.6337 16.6702L21.1649 16.6585L21.1414 11.968C21.122 8.08705 21.1069 7.26425 21.0537 7.2001C20.9986 7.13384 20.8785 7.12264 20.2216 7.12264H19.4539V6.90868C19.4539 6.51464 19.4132 6.48835 18.5197 6.30433C18.1993 6.23831 17.9295 6.17673 17.9202 6.1675C17.9109 6.15822 17.8687 6.02903 17.8265 5.88039L17.7496 5.61016L17.9342 5.44095C18.0358 5.34784 18.2759 5.13205 18.4676 4.96139C18.9234 4.55582 18.9236 4.52728 18.4728 3.74876C18.2862 3.4266 18.1005 3.12609 18.0599 3.08101C17.9488 2.95739 17.7473 2.98031 17.1335 3.18644C16.8265 3.28953 16.5417 3.37388 16.5006 3.37388C16.4067 3.37388 16.0787 3.04273 16.0787 2.94798C16.0787 2.90918 16.1631 2.62638 16.2663 2.31954C16.4725 1.70597 16.4954 1.50456 16.3717 1.39346C16.3266 1.35293 16.026 1.16722 15.7037 0.980722C14.9325 0.534479 14.8953 0.533917 14.5156 0.962962C14.3571 1.14211 14.1413 1.38114 14.0361 1.49421L13.845 1.69978L13.5907 1.63793C13.4509 1.60395 13.3218 1.56417 13.3039 1.5495C13.286 1.53488 13.2175 1.26989 13.1517 0.960619C13.0859 0.651346 13.021 0.350321 13.0073 0.2917C12.9936 0.233032 12.9409 0.143437 12.89 0.0925474C12.805 0.00763809 12.7315 0 12.0005 0C11.2695 0 11.1959 0.00763809 11.111 0.0925474ZM12.3977 0.808326C12.4109 0.866338 12.4749 1.1668 12.5398 1.47607C12.6715 2.10343 12.7184 2.17339 13.0436 2.22704C13.1531 2.24508 13.4041 2.31045 13.6014 2.37231C13.8599 2.45333 13.9909 2.47296 14.0702 2.4426C14.1307 2.4194 14.3672 2.18721 14.5957 1.92653C14.8242 1.6659 15.0317 1.45264 15.0568 1.45264C15.0986 1.45264 15.7037 1.77607 15.7037 1.79837C15.7037 1.80367 15.6088 2.09092 15.4928 2.43669C15.3768 2.78247 15.2818 3.09558 15.2818 3.13246C15.2818 3.22374 16.1696 4.12129 16.2885 4.1502C16.3407 4.1629 16.6673 4.0778 17.0143 3.96103C17.3613 3.8443 17.6495 3.74876 17.6548 3.74876C17.6769 3.74876 18.0007 4.35338 18.0007 4.39448C18.0007 4.41913 17.7809 4.63407 17.5123 4.87221C17.2437 5.1103 17.0119 5.35304 16.9972 5.41152C16.9825 5.47005 17.0115 5.63701 17.0616 5.7825C17.1117 5.92805 17.1777 6.17453 17.2083 6.33024C17.2902 6.74603 17.3294 6.77569 17.9773 6.91154C18.2866 6.97644 18.5872 7.04035 18.6453 7.05352C18.7438 7.07597 18.7507 7.10211 18.7507 7.45065C18.7507 7.79905 18.7437 7.82539 18.6453 7.84826C18.5872 7.86175 18.2866 7.92595 17.9773 7.99094C17.3498 8.12276 17.2794 8.16981 17.226 8.49342C17.208 8.60288 17.1426 8.85377 17.0807 9.051C16.9996 9.30943 16.98 9.44031 17.0104 9.51959C17.0336 9.58009 17.2659 9.81649 17.5266 10.0449C17.7874 10.2733 18.0007 10.4808 18.0007 10.5059C18.0007 10.5476 17.6772 11.1526 17.6548 11.1526C17.6495 11.1526 17.3613 11.057 17.0143 10.9403C16.6673 10.8235 16.3407 10.7384 16.2885 10.7511C16.1696 10.78 15.2818 11.6776 15.2818 11.7688C15.2818 11.8057 15.3765 12.1182 15.4923 12.4632C15.6081 12.8081 15.6939 13.0992 15.6832 13.11C15.6724 13.1207 15.5254 13.2102 15.3566 13.3089L15.0495 13.4883L14.6008 12.9809C14.354 12.7019 14.1029 12.4613 14.043 12.4462C13.983 12.4312 13.8148 12.4598 13.6692 12.5099C13.5236 12.56 13.2771 12.626 13.1213 12.6566C12.7054 12.7384 12.6757 12.7776 12.5398 13.4252C12.4749 13.7345 12.4109 14.035 12.3977 14.093C12.3753 14.1915 12.3491 14.1984 12.0005 14.1984C11.6518 14.1984 11.6256 14.1915 11.6032 14.093C11.59 14.035 11.5261 13.7345 11.4611 13.4252C11.3253 12.7776 11.2956 12.7384 10.8796 12.6566C10.7239 12.626 10.4773 12.56 10.3317 12.5099C10.1861 12.4598 10.018 12.4312 9.95795 12.4462C9.89799 12.4613 9.64697 12.7019 9.40016 12.9809L8.95141 13.4883L8.64437 13.3089C8.47552 13.2102 8.32851 13.1207 8.31778 13.11C8.30699 13.0992 8.39287 12.8081 8.50861 12.4632C8.6244 12.1182 8.71909 11.8057 8.71909 11.7688C8.71909 11.6776 7.83134 10.78 7.71246 10.7511C7.66023 10.7384 7.33425 10.8233 6.98807 10.9398C6.64188 11.0563 6.34984 11.1428 6.33906 11.132C6.32828 11.1212 6.2386 10.9741 6.13974 10.805L5.96001 10.4975L6.45381 10.0654C6.72542 9.82765 6.96679 9.58285 6.99018 9.52137C7.02107 9.44017 7.00194 9.31149 6.92024 9.051C6.85836 8.85377 6.79297 8.60288 6.77492 8.49342C6.72064 8.16456 6.65159 8.11812 6.02367 7.98832C5.71428 7.92436 5.41366 7.86119 5.35568 7.84788C5.25724 7.82534 5.2502 7.7991 5.2502 7.45295V7.08215L5.6135 7.00399C6.76747 6.75559 6.69874 6.79598 6.79737 6.30845C6.82803 6.15705 6.893 5.91722 6.94175 5.77557C6.99051 5.63387 7.01802 5.46855 7.00288 5.40814C6.98769 5.34779 6.75589 5.10529 6.48775 4.86926C6.21962 4.63328 6.00023 4.41983 6.00023 4.39495C6.00023 4.35352 6.32392 3.74876 6.34609 3.74876C6.35139 3.74876 6.63963 3.8443 6.98662 3.96103C7.3336 4.0778 7.66023 4.1629 7.71246 4.1502C7.83134 4.12129 8.71909 3.22374 8.71909 3.13246C8.71909 3.09558 8.62416 2.78247 8.50814 2.43669C8.39212 2.09092 8.2972 1.80367 8.2972 1.79837C8.2972 1.77607 8.90238 1.45264 8.9441 1.45264C8.96922 1.45264 9.17675 1.6659 9.40522 1.92653C9.63375 2.18721 9.87024 2.4194 9.93076 2.4426C10.0101 2.47296 10.141 2.45333 10.3995 2.37231C10.5968 2.31045 10.8478 2.24508 10.9573 2.22704C11.2825 2.17339 11.3295 2.10343 11.4611 1.47607C11.5261 1.1668 11.59 0.866338 11.6032 0.808326C11.6256 0.709827 11.6518 0.702892 12.0005 0.702892C12.3491 0.702892 12.3753 0.709827 12.3977 0.808326ZM11.1151 3.02178C9.40804 3.40762 8.16838 4.55315 7.65531 6.21881C7.53798 6.59978 7.52846 6.692 7.52846 7.45065C7.52846 8.21207 7.5377 8.30059 7.65714 8.68873C8.11058 10.1621 9.15682 11.2496 10.5894 11.7367C11.096 11.9089 11.5515 11.9647 12.2221 11.9366C13.1143 11.8991 13.7285 11.7045 14.4618 11.2267C15.365 10.6381 16.0118 9.76471 16.3459 8.6825C16.4638 8.30031 16.4729 8.21175 16.4718 7.45065C16.4707 6.69284 16.4609 6.59884 16.3427 6.21178C16.1891 5.70931 15.8332 5.00201 15.669 4.87282C15.5142 4.75113 15.4093 4.75525 15.2537 4.88899C15.0975 5.02324 15.0901 5.23237 15.2343 5.43481C15.289 5.51156 15.3963 5.71236 15.4728 5.881C15.9699 6.97695 15.8888 8.41362 15.2736 9.40868L15.1727 9.57189L15.068 9.36646C14.8385 8.91595 14.3728 8.51268 13.906 8.36029C13.7732 8.31695 13.659 8.27702 13.6522 8.27154C13.6454 8.26606 13.7303 8.1266 13.8408 7.96156C14.4625 7.03323 14.3427 5.84633 13.5511 5.09156C12.6397 4.22255 11.2514 4.24865 10.3905 5.15089C9.64781 5.92927 9.55139 7.0546 10.1508 7.94811C10.2664 8.12051 10.3555 8.26606 10.3487 8.27154C10.3419 8.27702 10.2277 8.31695 10.095 8.36029C9.62817 8.51268 9.16245 8.91595 8.93289 9.36646L8.82822 9.57189L8.72734 9.40868C8.11433 8.41713 8.03112 6.97662 8.52417 5.88967C9.00888 4.82109 9.97792 4.02246 11.1227 3.7481C11.9987 3.53817 12.9277 3.65949 13.8033 4.09814C14.3373 4.36576 14.4275 4.37545 14.5798 4.18183C14.7767 3.9317 14.6504 3.74993 14.0724 3.45157C13.3899 3.09919 12.9454 2.98977 12.1177 2.97051C11.6211 2.95894 11.3265 2.97398 11.1151 3.02178ZM12.6181 5.28336C12.9264 5.42 13.242 5.72801 13.3915 6.03817C13.4965 6.25602 13.5194 6.36881 13.5215 6.67832C13.5237 7.01074 13.5063 7.08993 13.3706 7.36546C13.0971 7.92108 12.6173 8.22051 12.0005 8.22051C11.3836 8.22051 10.9038 7.92108 10.6303 7.36546C10.4939 7.08843 10.4774 7.01257 10.4811 6.67832C10.4873 6.11703 10.7347 5.664 11.1881 5.38387C11.5895 5.13589 12.1902 5.09367 12.6181 5.28336ZM13.8193 9.09345C14.2196 9.2934 14.4787 9.62728 14.5569 10.0437C14.5979 10.2622 14.5389 10.3355 14.0789 10.6376C12.8265 11.4602 11.1744 11.4602 9.92199 10.6376C9.46204 10.3355 9.40302 10.2622 9.44404 10.0437C9.52218 9.62728 9.78132 9.2934 10.1816 9.09345L10.4685 8.95016H12.0005H13.5324L13.8193 9.09345ZM12.9849 17.8035C12.9849 18.2556 13.0277 18.4237 13.1872 18.5977C13.3733 18.8006 13.627 18.8822 14.0752 18.8833L14.4859 18.8844L14.4737 21.075L14.4615 23.2657H12.0005H9.53943L9.52729 20.3839C9.52059 18.7988 9.52518 17.4757 9.53751 17.4434C9.5549 17.3981 9.94562 17.3849 11.2724 17.3849H12.9849V17.8035ZM1.67327 18.2335C1.45688 18.3593 1.48328 18.7252 1.71639 18.8314C1.8702 18.9015 3.00565 18.9012 3.15964 18.831C3.31878 18.7585 3.38118 18.5663 3.30463 18.3843C3.27181 18.3063 3.20923 18.2287 3.16554 18.2119C3.03448 18.1616 1.76529 18.18 1.67327 18.2335ZM10.4227 18.3017C10.3257 18.3987 10.308 18.4508 10.3312 18.5712C10.3854 18.8517 10.4789 18.8844 11.2259 18.8844C11.8309 18.8844 11.9057 18.8752 12.0176 18.7872C12.1724 18.6655 12.1869 18.4147 12.0473 18.2752C11.9619 18.1898 11.8911 18.1815 11.2483 18.1815C10.5537 18.1815 10.5412 18.1833 10.4227 18.3017ZM19.2408 18.2965C19.1775 18.3598 19.1257 18.4661 19.1257 18.5329C19.1257 18.5997 19.1775 18.7061 19.2408 18.7693C19.3523 18.8808 19.3767 18.8844 20.0314 18.8844C20.6438 18.8844 20.7184 18.8753 20.8304 18.7872C20.9919 18.6603 20.9988 18.4274 20.8455 18.2833C20.7442 18.1883 20.6909 18.1815 20.0464 18.1815C19.3757 18.1815 19.3525 18.1848 19.2408 18.2965ZM1.70261 19.7357C1.47714 19.8469 1.46453 20.2177 1.68222 20.3341C1.74199 20.3661 2.29359 20.3839 3.22803 20.3839H4.68088L4.77801 20.2604C4.89914 20.1065 4.90167 19.9584 4.78561 19.815L4.69607 19.7044L3.25039 19.6948C2.2949 19.6885 1.77012 19.7023 1.70261 19.7357ZM10.5175 19.7358C10.4148 19.7855 10.3129 19.9587 10.3129 20.0836C10.3129 20.1222 10.3647 20.2056 10.428 20.2688L10.543 20.3839H12.0005H13.4579L13.5729 20.2688C13.6362 20.2056 13.688 20.1222 13.688 20.0836C13.688 19.952 13.5842 19.7851 13.4697 19.733C13.3193 19.6645 10.6596 19.667 10.5175 19.7358ZM19.328 19.7282C19.1177 19.8129 19.0681 20.0637 19.2229 20.2604L19.32 20.3839H20.7729C21.7073 20.3839 22.2589 20.3661 22.3187 20.3341C22.5435 20.2139 22.5224 19.8422 22.2845 19.7339C22.1442 19.67 19.4853 19.6648 19.328 19.7282ZM1.62817 21.3093C1.48914 21.4636 1.48276 21.6237 1.60975 21.7713L1.72633 21.9068H3.18762H4.64891L4.76208 21.7753C4.90064 21.6143 4.90453 21.5115 4.77801 21.3508L4.68088 21.2273H3.19147C1.83241 21.2273 1.69563 21.2345 1.62817 21.3093ZM10.4101 21.3508C10.2836 21.5115 10.2874 21.6143 10.426 21.7753L10.5392 21.9068H12.0005H13.4618L13.5749 21.7753C13.7135 21.6143 13.7174 21.5115 13.5909 21.3508L13.4937 21.2273H12.0005H10.5072L10.4101 21.3508ZM19.2229 21.3508C19.1113 21.4927 19.1045 21.5511 19.1804 21.7176C19.2707 21.9158 19.4551 21.9374 20.9229 21.9215L22.2747 21.9068L22.3912 21.7713C22.5182 21.6237 22.5118 21.4636 22.3728 21.3093C22.3053 21.2345 22.1685 21.2273 20.8095 21.2273H19.32L19.2229 21.3508Z"/>
</svg>
