<svg width="24" height="24" viewBox="0 0 24 24" fill="none" xmlns="http://www.w3.org/2000/svg">
<path fill-rule="evenodd" clip-rule="evenodd" d="M4.41195 0.0655609C4.12172 0.158484 3.96207 0.276537 3.78943 0.526051C3.66213 0.710023 3.63552 0.805853 3.61293 1.16203L3.58632 1.58135L2.56286 1.59945C1.67014 1.61525 1.50413 1.6303 1.26278 1.71727C0.716012 1.91427 0.287521 2.30655 0.10257 2.77937C0.00234685 3.03564 0.000364324 3.2288 0.000364324 12.7852C0.000364324 23.5445 -0.0242609 22.7679 0.331398 23.2338C0.566121 23.5412 0.94964 23.7949 1.34928 23.907C1.67525 23.9984 1.85572 24 12 24C22.1443 24 22.3247 23.9984 22.6507 23.907C23.0504 23.7949 23.4339 23.5412 23.6686 23.2338C24.0243 22.7679 23.9996 23.5445 23.9996 12.7852C23.9996 3.2415 23.9975 3.03535 23.8978 2.78035C23.7674 2.44682 23.4913 2.12262 23.1698 1.92553C22.719 1.64905 22.5636 1.61994 21.4301 1.59964L20.3997 1.58117L20.3985 1.29241C20.3968 0.900886 20.3304 0.671484 20.153 0.444474C19.9522 0.187364 19.635 0.0366807 19.2345 0.00808168C18.8091 -0.022252 18.5102 0.0565124 18.2496 0.267723C17.9413 0.517519 17.8458 0.737778 17.8444 1.20286L17.8433 1.58965H12H6.1567L6.15555 1.20286C6.15477 0.930375 6.12634 0.760657 6.05935 0.628539C5.93716 0.38737 5.59334 0.109444 5.33869 0.0458698C5.06578 -0.0222051 4.6592 -0.0135785 4.41195 0.0655609ZM5.23664 0.796054C5.36311 0.885414 5.37411 0.921092 5.37411 1.24145V1.58965H4.87848H4.38284V1.30526C4.38284 0.86652 4.51854 0.702896 4.88448 0.700364C5.02466 0.69938 5.1469 0.732574 5.23664 0.796054ZM19.413 0.758969C19.5595 0.86005 19.6172 1.01434 19.6172 1.30526V1.58965H19.1215H18.6259V1.24145C18.6259 0.921092 18.6369 0.885414 18.7634 0.796054C18.9185 0.686346 19.278 0.665858 19.413 0.758969ZM3.60959 2.961C3.62613 3.53841 3.64429 3.65553 3.74342 3.8238C3.94298 4.16267 4.36886 4.40267 4.77058 4.40267C4.97286 4.40267 5.09463 4.33056 5.15494 4.17509C5.24765 3.93608 5.09833 3.77968 4.67088 3.66809C4.43423 3.6063 4.38446 3.46354 4.38362 2.84379L4.38284 2.29291H11.1131H17.8433L17.8444 2.93755C17.8454 3.46195 17.8634 3.61718 17.9413 3.76974C18.206 4.28813 18.9567 4.57843 19.2804 4.28757C19.3508 4.22427 19.4085 4.11785 19.4085 4.05104C19.4085 3.89829 19.1925 3.69941 19.0266 3.69941C18.9574 3.69941 18.839 3.65567 18.7634 3.60222C18.6275 3.50621 18.6259 3.49791 18.6259 2.89897V2.29291H20.3766C21.4808 2.29291 22.2119 2.31203 22.3562 2.34467C22.6436 2.40969 22.9932 2.67496 23.1187 2.92321C23.2064 3.09691 23.2149 3.26461 23.2159 4.85936L23.2171 6.60535L14.8128 6.61749L6.40853 6.62964L6.28259 6.76119C6.12837 6.92233 6.12404 7.0251 6.26485 7.18591L6.37295 7.30945H14.795H23.2171V11.9767C23.2171 17.0574 23.2344 16.761 22.9217 17.0197C22.665 17.2321 22.519 17.2488 20.9156 17.2488C19.5066 17.2488 19.3937 17.255 19.1135 17.3492C18.7558 17.4695 18.393 17.7766 18.2075 18.1161C18.0816 18.3465 18.079 18.3764 18.0527 19.8508C18.0339 20.9002 18.0069 21.3808 17.9627 21.4501C17.8543 21.62 17.5402 21.8375 17.3618 21.8663C17.2679 21.8814 13.6813 21.8878 9.39138 21.8803L1.59162 21.8668L1.34349 21.7357C1.17137 21.6448 1.04767 21.5299 0.939675 21.3606L0.783941 21.1167L0.783419 14.2131L0.782949 7.30945H2.97419C5.09588 7.30945 5.16871 7.30649 5.26977 7.21568C5.40161 7.09721 5.4037 6.88384 5.27441 6.74033L5.17471 6.62964L2.97883 6.61599L0.782949 6.6023L0.784097 4.85786C0.78514 3.26457 0.793593 3.09687 0.881346 2.92321C0.999725 2.68898 1.35361 2.4095 1.60925 2.34832C1.71433 2.32315 2.20308 2.30041 2.69538 2.29773L3.59045 2.29291L3.60959 2.961ZM2.9481 8.7574C2.697 8.81521 2.55822 8.89918 2.44986 9.05886C2.35767 9.19468 2.34848 9.30101 2.34833 10.2326C2.34812 11.3766 2.3764 11.497 2.68588 11.6689C2.84329 11.7563 2.94387 11.7634 4.02379 11.7632C5.10277 11.7631 5.20461 11.7558 5.3641 11.6685C5.68595 11.4921 5.73687 11.3006 5.73817 10.2613C5.73927 9.40317 5.73191 9.33215 5.62193 9.1372C5.41611 8.77226 5.30013 8.7408 4.12198 8.73039C3.56243 8.72547 3.03419 8.73761 2.9481 8.7574ZM8.26968 8.7574C8.01857 8.81521 7.87979 8.89918 7.77143 9.05886C7.67904 9.19506 7.67006 9.30111 7.67006 10.2631C7.67006 11.8022 7.61815 11.7551 9.32893 11.767C10.6233 11.7761 10.7175 11.7564 10.9286 11.4336C11.0265 11.2838 11.0348 11.1925 11.0348 10.2631C11.0348 9.33374 11.0265 9.24246 10.9286 9.09266C10.7195 8.77282 10.5871 8.74052 9.44356 8.73039C8.88401 8.72547 8.35576 8.73761 8.26968 8.7574ZM13.5795 8.75942C13.338 8.81394 13.1636 8.92881 13.0576 9.10317C12.9773 9.23524 12.9652 9.38705 12.9652 10.2631C12.9652 11.1925 12.9735 11.2838 13.0714 11.4336C13.2825 11.7564 13.3767 11.7761 14.6711 11.767C15.9443 11.7581 16.0443 11.739 16.228 11.4681C16.3211 11.331 16.3299 11.2269 16.3299 10.2631C16.3299 8.73204 16.3442 8.74605 14.7651 8.73105C14.2056 8.72575 13.6721 8.73851 13.5795 8.75942ZM18.9011 8.75942C18.6596 8.81394 18.4852 8.92881 18.3792 9.10317C18.2989 9.23524 18.2868 9.38705 18.2868 10.2631C18.2868 11.7875 18.2591 11.763 19.9762 11.7632C21.6879 11.7635 21.652 11.7963 21.6517 10.2326C21.6514 8.73682 21.661 8.74601 20.0867 8.73105C19.5272 8.72575 18.9936 8.73851 18.9011 8.75942ZM4.94494 10.2514L4.95919 11.0601H4.04497H3.1307V10.2385V9.417L4.03068 9.4298L4.93065 9.44265L4.94494 10.2514ZM10.2665 10.2514L10.2808 11.0601H9.36655H8.45228V10.2385V9.417L9.35225 9.4298L10.2522 9.44265L10.2665 10.2514ZM15.5477 10.2397V11.0601H14.6347H13.7217V10.2709C13.7217 9.83685 13.7373 9.46764 13.7565 9.45048C13.7756 9.43327 14.1864 9.41921 14.6695 9.41921H15.5477V10.2397ZM20.8693 10.2397V11.0601H19.9563H19.0433V10.2709C19.0433 9.83685 19.0589 9.46764 19.0781 9.45048C19.0972 9.43327 19.508 9.41921 19.9911 9.41921H20.8693V10.2397ZM2.7655 13.1614C2.66507 13.21 2.5289 13.3209 2.4629 13.4077C2.34494 13.5631 2.34316 13.5843 2.35855 14.6534C2.37421 15.7402 2.37431 15.7412 2.50464 15.8665C2.7595 16.1114 2.83165 16.1236 4.0289 16.1236C5.2777 16.1236 5.40777 16.0961 5.60889 15.7901C5.70478 15.6441 5.71323 15.5471 5.71323 14.5915C5.71323 13.6146 5.70677 13.544 5.60566 13.4224C5.3426 13.1058 5.32043 13.1009 4.0792 13.0863C3.05365 13.0743 2.93104 13.0813 2.7655 13.1614ZM8.1728 13.1231C8.09078 13.1458 7.97684 13.2026 7.9196 13.2491C7.68712 13.4382 7.6697 13.5342 7.6697 14.6254C7.6697 15.7528 7.68222 15.8095 7.97407 16.0063C8.10174 16.0924 8.20832 16.1013 9.27332 16.1143C10.5867 16.1304 10.705 16.1079 10.9166 15.8021C11.0299 15.6384 11.0348 15.5892 11.0348 14.6233C11.0348 13.6996 11.0261 13.602 10.9305 13.4561C10.8731 13.3685 10.7599 13.2525 10.679 13.1983C10.5414 13.1059 10.4602 13.099 9.42686 13.0906C8.81911 13.0856 8.25476 13.1003 8.1728 13.1231ZM13.4303 13.1411C13.2228 13.2245 13.0585 13.4143 12.9868 13.6536C12.9517 13.7709 12.9366 14.1866 12.9475 14.7376C12.964 15.5697 12.9733 15.6431 13.0834 15.8021C13.2884 16.0984 13.4117 16.1236 14.6608 16.1236C15.8966 16.1236 16.0348 16.0967 16.2251 15.82C16.3224 15.6786 16.3303 15.5882 16.3301 14.6178C16.3299 13.6603 16.321 13.5553 16.2283 13.4186C16.022 13.1145 15.9591 13.1008 14.7154 13.088C13.8499 13.079 13.5542 13.0913 13.4303 13.1411ZM18.9011 13.2134C18.631 13.2744 18.4669 13.3975 18.3563 13.622C18.2624 13.8129 18.2546 13.9174 18.2699 14.7784C18.2958 16.2351 18.2743 16.217 19.9824 16.2169C21.0446 16.2167 21.1704 16.2083 21.3054 16.1283C21.6383 15.9311 21.6512 15.8784 21.6514 14.7171C21.6516 13.186 21.6659 13.2 20.0867 13.185C19.5272 13.1797 18.9936 13.1924 18.9011 13.2134ZM4.95674 14.5998V15.4203H4.04372H3.1307V14.5998V13.7794H4.04372H4.95674V14.5998ZM10.2665 14.6116L10.2808 15.4203H9.36655H8.45228V14.5987V13.7772L9.35225 13.79L10.2522 13.8028L10.2665 14.6116ZM15.5477 14.5998V15.4203H14.6347H13.7217V14.6311C13.7217 14.197 13.7373 13.8278 13.7565 13.8107C13.7756 13.7934 14.1864 13.7794 14.6695 13.7794H15.5477V14.5998ZM20.8693 14.6936V15.5141H19.9563H19.0433V14.7249C19.0433 14.2908 19.0589 13.9216 19.0781 13.9044C19.0972 13.8872 19.508 13.8731 19.9911 13.8731H20.8693V14.6936ZM2.7259 17.5298C2.37081 17.7244 2.34848 17.8089 2.34848 18.96C2.34848 19.9067 2.35704 20.004 2.4522 20.1442C2.66804 20.4624 2.76508 20.4834 4.02295 20.4835C5.106 20.4837 5.15671 20.4796 5.32246 20.3782C5.70932 20.1417 5.71323 20.1274 5.71323 18.96C5.71323 17.7926 5.70932 17.7784 5.32246 17.5418C5.15671 17.4404 5.106 17.4363 4.02295 17.4365C2.99041 17.4366 2.88169 17.4445 2.7259 17.5298ZM8.11316 17.5025C8.02708 17.5369 7.89795 17.6221 7.82621 17.692L7.69578 17.8189V18.96V20.1011L7.82621 20.2281C8.06579 20.4615 8.20144 20.4837 9.38199 20.4837C10.4261 20.4837 10.4788 20.4793 10.644 20.3782C11.0309 20.1417 11.0348 20.1274 11.0348 18.96C11.0348 17.7926 11.0309 17.7784 10.644 17.5418C10.4784 17.4405 10.4282 17.4364 9.37062 17.4381C8.56998 17.4395 8.227 17.457 8.11316 17.5025ZM13.356 17.5418C13.0264 17.7433 12.9655 17.8656 12.9653 18.3254C12.9651 18.8184 13.0407 18.9366 13.3565 18.9366C13.6415 18.9366 13.7217 18.8302 13.7217 18.4523V18.1396H14.6347H15.5477V18.96V19.7805H14.6461H13.7445L13.6864 19.6419C13.5789 19.386 13.1418 19.3897 13.0211 19.6476C12.8945 19.9183 13.0678 20.2536 13.4191 20.4179C13.5268 20.4682 13.8132 20.4837 14.6338 20.4837C15.7974 20.4837 15.9347 20.4609 16.1738 20.2281L16.3042 20.1011V18.96V17.8189L16.1738 17.6919C15.9342 17.4586 15.7986 17.4363 14.618 17.4363C13.5739 17.4363 13.5212 17.4407 13.356 17.5418ZM22.6953 17.9171C22.6953 17.9237 21.8208 18.7148 20.7519 19.6751L18.8085 21.4211L18.8346 19.9562C18.8719 17.8579 18.7345 17.9868 20.9736 17.9507C21.8201 17.937 22.5538 17.9212 22.604 17.9155C22.6542 17.9098 22.6953 17.9105 22.6953 17.9171ZM4.95674 18.96V19.7805H4.04372H3.1307V18.96V18.1396H4.04372H4.95674V18.96ZM10.2783 18.96V19.7805H9.3653H8.45228V18.96V18.1396H9.3653H10.2783V18.96ZM23.0686 22.753C22.9678 22.914 22.8371 23.0379 22.6678 23.1327L22.4166 23.2733H12.0041H1.59162L1.35121 23.1463C1.0291 22.9762 0.782949 22.6413 0.782949 22.3733V22.2577L0.952509 22.3511C1.41611 22.6066 1.0004 22.596 9.99549 22.5825L18.289 22.5701L18.627 22.4195C18.9235 22.2874 19.2244 22.0356 21.078 20.3681L23.191 18.4673L23.2046 20.4906L23.2181 22.514L23.0686 22.753Z"/>
</svg>
