<svg width="24" height="24" viewBox="0 0 24 24" fill="none" xmlns="http://www.w3.org/2000/svg">
<path d="M12 21C16.9706 21 21 16.9706 21 12C21 7.02944 16.9706 3 12 3C7.02944 3 3 7.02944 3 12C3 16.9706 7.02944 21 12 21Z" stroke="current" stroke-width="2" stroke-miterlimit="10"/>
<path d="M12.5719 15.1781L15.75 12L12.5719 8.8219" stroke="current" stroke-width="2" stroke-linecap="round" stroke-linejoin="round"/>
<path d="M8.25 12H15.75" stroke="current" stroke-width="2" stroke-linecap="round" stroke-linejoin="round"/>
</svg>
