<svg width="16" height="16" viewBox="0 0 16 16" fill="none" xmlns="http://www.w3.org/2000/svg">
<g>
<path d="M10.6666 14V12.6667C10.6666 11.9594 10.3857 11.2811 9.88558 10.781C9.38548 10.281 8.7072 10 7.99996 10H3.33329C2.62605 10 1.94777 10.281 1.44767 10.781C0.947578 11.2811 0.666626 11.9594 0.666626 12.6667V14" stroke="#4B5A73" stroke-width="2" stroke-linecap="round" stroke-linejoin="round"/>
<path d="M5.66667 7.33333C7.13943 7.33333 8.33333 6.13943 8.33333 4.66667C8.33333 3.19391 7.13943 2 5.66667 2C4.19391 2 3 3.19391 3 4.66667C3 6.13943 4.19391 7.33333 5.66667 7.33333Z" stroke="#4B5A73" stroke-width="2" stroke-linecap="round" stroke-linejoin="round"/>
<path d="M13.3334 5.33331V9.33331" stroke="#4B5A73" stroke-width="2" stroke-linecap="round" stroke-linejoin="round"/>
<path d="M15.3334 7.33331H11.3334" stroke="#4B5A73" stroke-width="2" stroke-linecap="round" stroke-linejoin="round"/>
</g>
</svg>
