[
  {
    "name": "BacklogState",
    "url": "https://gitlab.com/protopiahome/inner-projects/protopia-community/react-views/BacklogState"
  },
  {
    "name": "CirclesState",
    "url": "https://gitlab.com/protopiahome/inner-projects/protopia-community/react-views/CirclesState"
  },
  {
    "name": "DataTableState",
    "url": "https://gitlab.com/protopiahome/inner-projects/protopia-community/react-views/DataTableState"
  },
  {
    "name": "ExternalLoginState",
    "url": "https://gitlab.com/protopiahome/inner-projects/protopia-community/react-views/ExternalLoginState"
  },
  {
    "name": "HTMLState",
    "url": "https://gitlab.com/protopiahome/inner-projects/protopia-community/react-views/HTMLState"
  },
  {
    "name": "MainAdminState",
    "url": "https://gitlab.com/protopiahome/inner-projects/protopia-community/react-views/MainAdminState"
  },
  {
    "name": "NewProfileState",
    "url": "https://gitlab.com/protopiahome/inner-projects/protopia-community/react-views/NewProfileState"
  },
  {
    "name": "OldProfileState",
    "url": "https://gitlab.com/protopiahome/inner-projects/protopia-community/react-views/OldProfileState"
  },
  {
    "name": "QuizesState",
    "url": "https://gitlab.com/protopiahome/inner-projects/protopia-community/react-views/QuizesState"
  },
  {
    "name": "ScopeState",
    "url": "https://gitlab.com/protopiahome/inner-projects/protopia-community/react-views/ScopeState"
  },
  {
    "name": "SocialsState",
    "url": "https://gitlab.com/protopiahome/inner-projects/protopia-community/react-views/SocialsState"
  },
  {
    "name": "VotesState",
    "url": "https://gitlab.com/protopiahome/inner-projects/protopia-community/react-views/VotesState"
  },
  {
    "name": "BasicStateFunctional",
    "url": "https://gitlab.com/protopiahome/inner-projects/protopia-community/react-views/BasicStateFunctional"
  },
  {
    "name": "CompetencesMapState",
    "url": "https://gitlab.com/protopiahome/inner-projects/protopia-community/react-views/CompetencesMapState"
  },
  {
    "name": "DomainState",
    "url": "https://gitlab.com/protopiahome/inner-projects/protopia-community/react-views/DomainState"
  },
  {
    "name": "FormEditState",
    "url": "https://gitlab.com/protopiahome/inner-projects/protopia-community/react-views/FormEditState"
  },
  {
    "name": "JitsiState",
    "url": "https://gitlab.com/protopiahome/inner-projects/protopia-community/react-views/JitsiState"
  },
  {
    "name": "MapState",
    "url": "https://gitlab.com/protopiahome/inner-projects/protopia-community/react-views/MapState"
  },
  {
    "name": "NewsListState",
    "url": "https://gitlab.com/protopiahome/inner-projects/protopia-community/react-views/NewsListState"
  },
  {
    "name": "PageState",
    "url": "https://gitlab.com/protopiahome/inner-projects/protopia-community/react-views/PageState"
  },
  {
    "name": "QuizState",
    "url": "https://gitlab.com/protopiahome/inner-projects/protopia-community/react-views/QuizState"
  },
  {
    "name": "SearchState",
    "url": "https://gitlab.com/protopiahome/inner-projects/protopia-community/react-views/SearchState"
  },
  {
    "name": "TeamsMindState",
    "url": "https://gitlab.com/protopiahome/inner-projects/protopia-community/react-views/TeamsMindState"
  },
  {
    "name": "CalendarState",
    "url": "https://gitlab.com/protopiahome/inner-projects/protopia-community/react-views/CalendarState"
  },
  {
    "name": "ContextChatState",
    "url": "https://gitlab.com/protopiahome/inner-projects/protopia-community/react-views/ContextChatState"
  },
  {
    "name": "DriversState",
    "url": "https://gitlab.com/protopiahome/inner-projects/protopia-community/react-views/DriversState"
  },
  {
    "name": "HTMLSourceState",
    "url": "https://gitlab.com/protopiahome/inner-projects/protopia-community/react-views/HTMLSourceState"
  },
  {
    "name": "LoginState",
    "url": "https://gitlab.com/protopiahome/inner-projects/protopia-community/react-views/LoginState"
  },
  {
    "name": "MeetingState",
    "url": "https://gitlab.com/protopiahome/inner-projects/protopia-community/react-views/MeetingState"
  },
  {
    "name": "NoMatchState",
    "url": "https://gitlab.com/protopiahome/inner-projects/protopia-community/react-views/NoMatchState"
  },
  {
    "name": "ProfileState",
    "url": "https://gitlab.com/protopiahome/inner-projects/protopia-community/react-views/ProfileState"
  },
  {
    "name": "RegisterState",
    "url": "https://gitlab.com/protopiahome/inner-projects/protopia-community/react-views/RegisterState"
  },
  {
    "name": "SettingsState",
    "url": "https://gitlab.com/protopiahome/inner-projects/protopia-community/react-views/SettingsState"
  }
]