[
    {
        "name": "_SearchBlock",
        "url": "https://gitlab.com/protopiahome/inner-projects/protopia-community/react-widgets/_SearchBlock"
    },
    {
        "name": "Aside",
        "url": "https://gitlab.com/protopiahome/inner-projects/protopia-community/react-widgets/Aside"
    },
    {
        "name": "AsideLeft",
        "url": "https://gitlab.com/protopiahome/inner-projects/protopia-community/react-widgets/AsideLeft"
    },
    {
        "name": "AsideRight",
        "url": "https://gitlab.com/protopiahome/inner-projects/protopia-community/react-widgets/AsideRight"
    },
    {
        "name": "CourseFilesWidget",
        "url": "https://gitlab.com/protopiahome/inner-projects/protopia-community/react-widgets/CourseFilesWidget"
    },
    {
        "name": "CourseTypeSelector",
        "url": "https://gitlab.com/protopiahome/inner-projects/protopia-community/react-widgets/CourseTypeSelector"
    },
    {
        "name": "SearchBlock",
        "url": "https://gitlab.com/protopiahome/inner-projects/protopia-community/react-widgets/SearchBlock"
    }
]