[
    { "role": "user", "resource": "*", "action": "changeOrder", "attributes": ["*"] },
    { "role": "user", "resource": "*", "action": "getOrders", "attributes": ["*"] },
    { "role": "user", "resource": "*", "action": "getOrder", "attributes": ["*"] }
]