{
  "event":{
    "metaData":{
      "ID":"",
      "DetectTime":""
    },
    "payloadData":{
      "Category":"",
      "AggrID":"",
      "TopAssetCriticality":1,
      "Rule":2,
      "Source_Asset":"",
      "Source_MaxAssetCriticality":1,
      "Source_IP4":"",
      "Source_Proto":"",
      "Source_Hostname":"",
      "Target_Asset":"",
      "Target_MaxAssetCriticality":1,
      "Target_IP4":"",
      "Target_Proto":"",
      "Target_Hostname":""
    }
  }
}
