{
    "name": "Hawat",
    "disable_component_resolution_regex_fallback": 1,

    "database": "mentat",
    "collection": "alerts",
    "database_name": "mentat",

    "devel": 1,
    "log_threshold": "debug",
    "log_file": "/var/mentat/log/hawat.log",

    "briefs_dir": "/var/mentat/reports/briefer",
    "reports_dir": "/var/mentat/reports/reporter-ng",
    "stats_dir": "/var/mentat/reports/statistician",

    "result_limit": 30,

    "roles": [
        {"id":"user","title":"User","desc":"General system user, no extra permissions"},
        {"id":"developer","title":"Developer","desc":"System developer"},
        {"id":"maintainer","title":"Maintainer","desc":"System maintainer"},
        {"id":"admin","title":"Admin","desc":"System poweruser"}
    ],

    "authentication": false,
    "authorization": false,
    "acl": {
        "base_role": "admin",
        "acl_url": {
            "/accesslog/list": ["admin"],
            "/admin/dashboard": ["admin"],
            "/admin/db": ["admin"],
            "/alert/delete": ["admin"],
            "/alert/report": ["admin"],
            "/devel/dashboard": ["developer"],
            "/changelog/list": ["admin"],
            "/event/list" : ["admin","maintainer"],
            "/event/view" : ["admin","maintainer"],
            "/event/import" : ["admin"],
            "/event/export" : ["admin","maintainer"],
            "/event/create" : ["admin","maintainer"],
            "/event/update" : ["admin","maintainer"],
            "/event/rename" : ["admin","maintainer"],
            "/event/delete" : ["admin"],
            "/event/remove" : ["admin","maintainer"],
            "/event/enable" : ["admin","maintainer"],
            "/event/disable" : ["admin","maintainer"],
            "/event/validate" : ["admin","maintainer"],
            "/filter/list" : ["admin"],
            "/filter/remove" : ["admin"],
            "/filter/import" : ["admin"],
            "/filter/export" : ["admin"],
            "/group/list": ["admin"],
            "/group/create": ["admin"],
            "/group/rename": ["admin"],
            "/group/delete": ["admin"],
            "/log/list": ["admin"],
            "/log/view": ["admin"],
            "/log/delete": ["admin"],
            "/runlog/reporter_list": ["admin"],
            "/runlog/reporter_view": ["admin"],
            "/network/list": ["admin"],
            "/network/bulkadd": ["admin"],
            "/network/bulkrem": ["admin"],
            "/report/delete": ["admin"],
            "/user/list": ["admin"],
            "/user/create": ["admin"],
            "/user/rename": ["admin"],
            "/user/delete": ["admin"],
            "/user/lock": ["admin"],
            "/user/unlock": ["admin"],
            "/user/addRole": ["admin"],
            "/user/removeRole": ["admin"],
        },
        "acl_custom": {
            "/group/view": { "role": ["admin"], "group": ["manager", "member"] },
            "/group/update": { "role": ["admin"], "group": ["manager"] },
            "/group/addManager": { "role": ["admin"], "group": ["manager"] },
            "/group/removeManager": { "role": ["admin"], "group": ["manager"] },
            "/group/addFilter": { "role": ["admin"], "group": ["manager"] },
            "/group/updateFilter": { "role": ["admin"], "group": ["manager"] },
            "/group/removeFilter": { "role": ["admin"], "group": ["manager"] },
            "/group/addNetwork": { "role": ["admin"], "group": ["manager"] },
            "/group/updateNetwork": { "role": ["admin"], "group": ["manager"] },
            "/group/removeNetwork": { "role": ["admin"], "group": ["manager"] },
            "/group/enableFilter": { "role": ["admin"], "group": ["manager"] },
            "/group/disableFilter": { "role": ["admin"], "group": ["manager"] },
            "/group/mute": { "role": ["admin"], "group": ["manager"] },
            "/group/unmute": { "role": ["admin"], "group": ["manager"] },
            "/group/redirect": { "role": ["admin"], "group": ["manager"] },
            "/group/unredirect": { "role": ["admin"], "group": ["manager"] },
            "/group/set_compression": { "role": ["admin"], "group": ["manager"] },
            "/group/unset_compression": { "role": ["admin"], "group": ["manager"] },
            "/group/testFilters": { "role": ["admin"], "group": ["manager"] },
            "/group/checkNetworks": { "role": ["admin"], "group": ["manager"] },
            "/report/remail": { "role": ["admin"], "group": ["member"] },
            "/report/view": { "role": ["admin"], "group": ["member"] },
            "/user/view": { "role": ["admin"], "user": ["me"] },
            "/user/update": { "role": ["admin"], "user": ["me"] },
            "/user/addGroup": { "role": ["admin"], "group": ["manager"] },
            "/user/removeGroup": { "role": ["admin"], "group": ["manager","member"] },
            "/user/removeQuery": { "role": ["admin"], "user": ["me"] },
        }
    },

    "Plugin::Authentication": {
        "default_realm": "eduid",
        "realms": {
            "eduid": {
                "credential": {
                    "class": "RemoteAdv",
                    "source": "eppn",
                },
                "store": {
                    "class": "FromSub::Hash",
                    "model_class": "Users",
                },
            },
        },
    },

    "Model::Alerts": {
        "devel": 0,
        "database_name": "mentat",
        "collection_name": "alerts",
        "filter_grammar": "/etc/mentat/.core/filter-grammar.conf",
        "cache_dir": "/var/mentat/cache",
        "cache_ttl": 806400,
    },

    "Model::Groups": {
        "devel": 0,
        "database_name": "mentat",
        "collection_name": "groups",
    },

    "Model::Reports": {
        "devel": 0,
        "database_name": "mentat",
        "collection_name": "reports_ng",
        "mail_from" : "CESNET-CERTS Reporting <reporting@cesnet.cz>",
        "mail_devel" : "reporter-test@mentat-hub.cesnet.cz",
        "mail_admin" : "mentat-admin@mentat-hub.cesnet.cz",
        "mail_bcc" : "mentat-admin@mentat-hub.cesnet.cz",
        "mail_test": "reporter-test-data@mentat-hub.cesnet.cz",
        "reply_to" : "abuse@cesnet.cz",
        "test_mode": 0,
        "reports_dir": "/var/mentat/reports/reporter-ng",
        "charts_dir": "/var/mentat/charts",
    },

    "Model::Briefs": {
        "devel": 0,
        "database_name": "mentat",
        "collection_name": "reports",
        "mail_to" : "mentat-admin@mentat.cesnet.cz",
        "mail_from" : "CESNET-CERTS Reporting <reporting@cesnet.cz>",
        "mail_devel" : "reporter-test@mentat-hub.cesnet.cz",
        "mail_admin" : "mentat-admin@mentat-hub.cesnet.cz",
        "mail_bcc" : "mentat-admin@mentat-hub.cesnet.cz",
        "mail_test": "reporter-test-data@mentat-hub.cesnet.cz",
        "reply_to" : "abuse@cesnet.cz",
        "test_mode": 0,
        "charts_dir": "/var/mentat/charts",
    },

    "Model::Logs": {
        "devel": 0,
        "database_name": "mentat",
        "collection_name": "logs",
        "test_mode": 1,
        "charts_dir": "/var/mentat/charts",
    },

    "Model::Changelogs": {
        "devel": 0,
        "database_name": "mentat",
        "collection_name": "changelogs",
        "test_mode": 1,
        "charts_dir": "/var/mentat/charts",
    },

    "Model::Accesslogs": {
        "devel": 0,
        "database_name": "mentat",
        "collection_name": "accesslogs",
        "test_mode": 1,
        "charts_dir": "/var/mentat/charts",
    },

    "Model::Runlogs": {
        "devel": 0,
        "database_name": "mentat",
        "collection_name": "runlogs_reporter_ng",
        "test_mode": 1,
        "charts_dir": "/var/mentat/charts",
    },

    "Model::Events": {
        "devel": 0,
        "database_name": "mentat",
        "collection_name": "events",
        "template_dir": "/etc/mentat/formater-templates",
        "template_file": "/etc/mentat/msgtmplts.json",
        "schema_file_idea": "/etc/mentat/schema-idea.json",
    },

    "Model::Users": {
        "devel": 0,
        "database_name": "mentat",
        "collection_name": "users",
        "default_roles": []
    },

    "Model::Whois": {
        "devel": 0,
        "database_name": "mentat",
        "collection_name": "groups",
        "test_mode": 1,
        "whois_dump_file": "/var/mentat/whois-negistry.json",
        "whois_exceptions": {
            "/var/mentat/iplist-cesnet": "abuse@cesnet.cz",
            "/var/mentat/iplist-pasnet": "abuse@cuni.cz",
            "/var/mentat/iplist-grid": "kouril@ics.muni.cz,michalp@ics.muni.cz",
        },
    },
}
