id;model;price;serial;status;type_shock_absorber
1;Soft Credit Card Account;34830;Trinidad and Tobago Dollar Dynamic;false;RIGIDA
2;Handmade Fresh Shirt;70602;Checking Account initiatives Programmable;true;FULL_SUSPENSION
3;pixel;72280;integrate;true;HARDTAIL
4;violet content Outdoors;10880;synergistic implementation array;true;RIGIDA
5;Quality olive;1617;e-markets Lead;true;FULL_SUSPENSION
6;Ukraine;71381;California Direct;false;FULL_SUSPENSION
7;Montenegro;26676;quantify;true;FULL_SUSPENSION
8;intuitive Gloves Facilitator;56520;fuchsia USB magnetic;false;FULL_SUSPENSION
9;engineer Borders SAS;94345;efficient Rubber;false;FULL_SUSPENSION
10;Extensions Macao;97625;architectures capacitor;true;RIGIDA
