{
"In": {
        "rocket": "Rockets/birkeland.json", 
        "engine": "Rockets/cesaroni21062O3400-P.json", 
        "parachute": "Rockets/IrisUltra96.json", 
        "stochastics": "stochastics.json", 
        "init_time": 0.0, 
        "init_altitude": 0.0, 
        "init_temperature": 20, 
        "init_pressure": 101325, 
        "water_pressure": 0.0, 
        "atmospheric_model": "ISA", 
        "launchrod_length": 4.0, 
        "launchrod_pitch": 0.0, 
        "launchrod_yaw": 4.0, 
        "parachute_release_diff": 400
    }, 
    "stochastic": true,
    "complete": true, 
    "num_sim": 10, 
    "events_only": false, 
    "ascent_method": "RK4", 
    "step_size_ascent": 0.01, 
    "descent_method": "RK4", 
    "step_size_descent": 0.1, 
    "aero_type": "Lookup1D", 
    "aero_hybrid": false, 
    "aero_tabfile": "AeroCoeffs/Cd_values_Birkeland_RPy_adjusted.txt", 
    "debug_mode": false, 
    
    "Out": {
        "step_data": false, 
        "avg_and_singles": false, 
        "sims_per_avg": 10, 
        "sample_rate": 1, 
        "sim_name": "simulation", 
        "overwrite_event_files": true}}