<?xml version="1.0" encoding="utf-8"?>
<!-- Generator: Adobe Illustrator 21.0.2, SVG Export Plug-In . SVG Version: 6.00 Build 0)  -->
<svg version="1.1" baseProfile="basic" id="Layer_1"
	 xmlns="http://www.w3.org/2000/svg" xmlns:xlink="http://www.w3.org/1999/xlink" x="0px" y="0px" viewBox="0 0 50 50"
	 xml:space="preserve">
<style type="text/css">
	.st0{fill:#010101;}
</style>
<path class="st0" d="M34.257,32.7672l0.6946-0.8272c2.7044-3.2159,4.1945-7.2978,4.1945-11.4928
	c0-9.8584-8.0205-17.8783-17.8783-17.8783c-9.8584,0-17.8783,8.0199-17.8783,17.8783c0,9.8573,8.0199,17.8778,17.8783,17.8778
	c3.6888,0,7.2297-1.1181,10.2403-3.2335l0.8436-0.5925l12.046,12.5282c0.481,0.5033,1.3211,0.5151,1.8186,0.0364
	c0.2476-0.2382,0.3872-0.5585,0.3942-0.9034c0.007-0.3438-0.1208-0.6699-0.3578-0.9163L34.257,32.7672z M21.2677,35.7508
	c-8.4388,0-15.3042-6.8648-15.3042-15.3036S12.8289,5.143,21.2677,5.143c8.4382,0,15.3042,6.8654,15.3042,15.3042
	S29.7059,35.7508,21.2677,35.7508z"/>
</svg>
