{
  "project_info": {
    "project_number": "262343551226",
    "firebase_url": "https://pixorax.firebaseio.com",
    "project_id": "pixorax",
    "storage_bucket": "pixorax.appspot.com"
  },
  "client": [
    {
      "client_info": {
        "mobilesdk_app_id": "1:262343551226:android:e6a36ca6ea5f52471b0143",
        "android_client_info": {
          "package_name": "com.example.pixorax"
        }
      },
      "oauth_client": [
        {
          "client_id": "262343551226-9gmti3cc1paqlefun94k22fl6jb8g834.apps.googleusercontent.com",
          "client_type": 1,
          "android_info": {
            "package_name": "com.example.pixorax",
            "certificate_hash": "c73cddaf465f8dccde25511cfaf48961e89f23b7"
          }
        },
        {
          "client_id": "262343551226-2pfcla992gkncofoj2fla6ek1j7e017j.apps.googleusercontent.com",
          "client_type": 3
        }
      ],
      "api_key": [
        {
          "current_key": "AIzaSyAd-p4yEZ9D0g4CnlHNDM2uYtFmH6SZb9w"
        }
      ],
      "services": {
        "appinvite_service": {
          "other_platform_oauth_client": [
            {
              "client_id": "262343551226-2pfcla992gkncofoj2fla6ek1j7e017j.apps.googleusercontent.com",
              "client_type": 3
            }
          ]
        }
      }
    }
  ],
  "configuration_version": "1"
}