<?xml version="1.0" encoding="utf-8"?>
<!-- Generator: Adobe Illustrator 21.0.2, SVG Export Plug-In . SVG Version: 6.00 Build 0)  -->
<svg version="1.1" baseProfile="basic" id="Layer_1"
	 xmlns="http://www.w3.org/2000/svg" xmlns:xlink="http://www.w3.org/1999/xlink" x="0px" y="0px" viewBox="0 0 50 50"
	 xml:space="preserve">
<style type="text/css">
	.st0{fill:#010101;}
</style>
<g>
	<path class="st0" d="M40.8547,9.136c-4.2346-4.2352-9.8657-6.5671-15.855-6.5671c-5.9893,0-11.6204,2.332-15.855,6.5671
		c-4.2352,4.2347-6.5672,9.8658-6.5672,15.855s2.332,11.6204,6.5672,15.855c4.2346,4.2346,9.8657,6.5677,15.855,6.5677
		c5.9893,0,11.6204-2.3331,15.8539-6.5677c4.2358-4.2347,6.5689-9.8658,6.5689-15.855S45.0894,13.3707,40.8547,9.136z
		 M33.1266,26.1011h-7.0157v7.0146c0,0.6135-0.4982,1.1129-1.1112,1.1129c-0.6129,0-1.1118-0.4994-1.1118-1.1129v-7.0146h-7.0151
		c-0.6129,0-1.1118-0.4988-1.1118-1.1118c0-0.6129,0.4988-1.1118,1.1118-1.1118h7.0151v-7.0151c0-0.613,0.4988-1.1118,1.1118-1.1118
		c0.613,0,1.1112,0.4988,1.1112,1.1118v7.0151h7.0157c0.6124,0,1.1118,0.4988,1.1118,1.1118
		C34.2384,25.6023,33.739,26.1011,33.1266,26.1011z"/>
</g>
</svg>
