<?xml version="1.0" encoding="utf-8"?>
<!-- Generator: Adobe Illustrator 21.0.2, SVG Export Plug-In . SVG Version: 6.00 Build 0)  -->
<svg version="1.1" baseProfile="basic" id="Layer_1"
	 xmlns="http://www.w3.org/2000/svg" xmlns:xlink="http://www.w3.org/1999/xlink" x="0px" y="0px" viewBox="0 0 50 50"
	 xml:space="preserve">
<g>
	<path d="M24.7121,23.7462c2.909,0,5.4281-1.0436,7.4861-3.1021c2.059-2.059,3.1026-4.5775,3.1026-7.4866
		S34.2572,7.7294,32.1982,5.67c-2.059-2.0575-4.578-3.1011-7.4861-3.1011c-2.909,0-5.4281,1.0436-7.487,3.1016
		c-2.058,2.059-3.1016,4.578-3.1016,7.487s1.0436,5.4281,3.1016,7.487C19.2841,22.7026,21.8031,23.7462,24.7121,23.7462z
		 M15.9792,13.1575c0-2.4329,0.8374-4.4525,2.5579-6.174c1.7215-1.7215,3.7416-2.5579,6.175-2.5579
		c2.4315,0,4.4516,0.8364,6.175,2.5579c1.7205,1.7225,2.5579,3.7421,2.5579,6.174c0,2.4315-0.8374,4.4511-2.5579,6.1736
		c-1.7234,1.7215-3.7435,2.5584-6.175,2.5584s-4.4516-0.8369-6.175-2.5584C16.8166,17.6101,15.9792,15.5905,15.9792,13.1575z"/>
	<path d="M43.5474,37.3017l-0.0992,0.0068l0.0992-0.0078c-0.0593-0.8714-0.1819-1.8275-0.3638-2.8419
		c-0.1819-1.0134-0.4163-1.9715-0.6964-2.8478c-0.2889-0.8977-0.6789-1.7818-1.1603-2.6289
		c-0.496-0.8724-1.0767-1.6301-1.7244-2.2496c-0.6721-0.6419-1.4968-1.1593-2.4509-1.5377c-0.9522-0.3769-2.0113-0.568-3.1473-0.568
		c-0.318,0-0.676,0.1133-1.5639,0.6915c-0.5378,0.3496-1.1642,0.7547-1.8645,1.2031c-0.6302,0.4017-1.4735,0.7732-2.5054,1.1058
		c-2.0405,0.6594-4.1063,0.6584-6.1449,0c-1.0329-0.3336-1.8752-0.7051-2.5025-1.1049c-0.6944-0.4435-1.3218-0.8491-1.8674-1.2046
		c-0.887-0.5782-1.2449-0.6915-1.563-0.6915c-1.134,0-2.1932,0.1916-3.1473,0.569c-0.9541,0.3779-1.7789,0.8953-2.4509,1.5382
		c-0.6507,0.6234-1.2303,1.3801-1.7234,2.2486c-0.4824,0.85-0.8724,1.7341-1.1603,2.6289
		c-0.2791,0.8753-0.5135,1.8343-0.6954,2.8487c-0.1809,1.0027-0.3035,1.9588-0.3638,2.8419
		c-0.0603,0.8549-0.0905,1.7526-0.0905,2.6688c0,2.2681,0.7149,4.0975,2.1241,5.4388c1.3966,1.3305,3.2543,2.0045,5.5205,2.0045
		h21.9875c2.2642,0,4.1219-0.674,5.5214-2.0045c1.4093-1.3412,2.1242-3.1707,2.1242-5.4397
		C43.6379,39.0611,43.6077,38.1634,43.5474,37.3017z M35.9933,45.5581H14.0058c-1.7964,0-3.1833-0.4882-4.2395-1.492
		c-1.0426-0.993-1.5493-2.3323-1.5493-4.0956c0-0.8676,0.0292-1.7225,0.0856-2.5404c0.0554-0.8063,0.1702-1.6952,0.3404-2.6416
		c0.1673-0.9366,0.3813-1.8149,0.638-2.6105c0.2461-0.7713,0.5836-1.5377,1.0027-2.2778c0.4095-0.7178,0.8792-1.3325,1.3957-1.8256
		c0.4951-0.4746,1.1175-0.8627,1.8509-1.1535c0.675-0.2665,1.4307-0.4134,2.2457-0.4357l0.1089-0.0019l0.0963,0.0496
		c0.1498,0.0798,0.3385,0.1945,0.5612,0.3404c0.5495,0.3579,1.1827,0.7674,1.882,1.2138c0.7645,0.4863,1.7497,0.9259,2.9304,1.3052
		c2.4159,0.782,4.8678,0.78,7.2896,0.0019c1.1837-0.3832,2.1699-0.8238,2.9304-1.3091c0.7158-0.4571,1.3305-0.8539,1.88-1.2119
		c0.283-0.1848,0.463-0.2869,0.5631-0.3394l0.0943-0.0506l0.108,0.0019c0.818,0.0224,1.5746,0.1692,2.2477,0.4357
		c0.7304,0.2889,1.3529,0.6769,1.8508,1.1535c0.5184,0.496,0.9882,1.1107,1.3947,1.8256c0.4202,0.7392,0.7586,1.5056,1.0057,2.2768
		c0.2548,0.7975,0.4688,1.6758,0.6361,2.6105c0.1692,0.9386,0.284,1.8275,0.3414,2.6425c0.0564,0.8053,0.0856,1.6592,0.0866,2.5394
		c-0.001,1.7633-0.5077,3.1026-1.5493,4.0956C39.1785,45.0698,37.7906,45.5581,35.9933,45.5581z"/>
</g>
</svg>
