[
  {
    "model": "auth.group",
    "fields": {
      "name": "staff",
      "permissions": [
        [
          "view_group",
          "auth",
          "group"
        ],
        [
          "view_user",
          "auth",
          "user"
        ],
        [
          "add_event",
          "fet",
          "event"
        ],
        [
          "change_event",
          "fet",
          "event"
        ],
        [
          "delete_event",
          "fet",
          "event"
        ],
        [
          "view_event",
          "fet",
          "event"
        ],
        [
          "add_fet",
          "fet",
          "fet"
        ],
        [
          "change_fet",
          "fet",
          "fet"
        ],
        [
          "delete_fet",
          "fet",
          "fet"
        ],
        [
          "view_fet",
          "fet",
          "fet"
        ],
        [
          "add_order",
          "fet",
          "order"
        ],
        [
          "change_order",
          "fet",
          "order"
        ],
        [
          "delete_order",
          "fet",
          "order"
        ],
        [
          "view_order",
          "fet",
          "order"
        ],
        [
          "add_provider",
          "fet",
          "provider"
        ],
        [
          "change_provider",
          "fet",
          "provider"
        ],
        [
          "delete_provider",
          "fet",
          "provider"
        ],
        [
          "view_provider",
          "fet",
          "provider"
        ],
        [
          "add_round",
          "fet",
          "round"
        ],
        [
          "change_round",
          "fet",
          "round"
        ],
        [
          "delete_round",
          "fet",
          "round"
        ],
        [
          "view_round",
          "fet",
          "round"
        ]
      ]
    }
  }
]
