{
  "@type": "earl:report",
  "@context": "http://daisy.github.io/ace/ace-report-1.0.jsonld",
  "dct:title": "Ace Report",
  "dct:description": "Report on automated accessibility checks for EPUB",
  "dct:date": "17/10/2018 19:01:43",
  "earl:assertedBy": {
    "@type": "earl:software",
    "doap:name": "DAISY Ace",
    "doap:description": "DAISY Accessibility Checker for EPUB",
    "doap:homepage": "http://daisy.github.io/ace",
    "doap:created": "2017-07-01",
    "doap:release": {
      "doap:revision": "1.0.0"
    }
  },
  "outlines": {
    "toc": "<ol xmlns=\"http://www.w3.org/1999/xhtml\">\n                <li>Portada</li>\n                <li>Descripción\n                    <ol>\n                        <li>Antecedentes</li>\n                        <li>Proyección</li>\n                    </ol>\n                </li>\n                <li>Información general\n                    <ol>\n                        <li>Objetivos</li>\n                        <li>Propuesta de cronograma</li>\n                        <li>Requisitos previos</li>\n                        <li>Necesidades espaciales</li>\n                    </ol>\n                </li>\n                <li>Syllabus\n                    <ol>\n                        <li>Sesión 1: Más allá de Adobe</li>\n                        <li>Sesión 2: Bienvenido a la edición «desde cero»</li>\n                        <li>Sesión 3: ¡Esto es Pecas! > Herramientas editoriales libres</li>\n                        <li>Sesión 4: De la planicie y los tornados al bosque y las ramas</li>\n                        <li>Sesión 5: Bienvenidos al mundo de Markdown</li>\n                        <li>Sesión 6: Nuestro primer proyecto con Markdown</li>\n                        <li>Sesión 7: ¿Otra vez Pecas?</li>\n                        <li>Sesión 8: Mi primer EPUB</li>\n                        <li>Sesión 9: Viaje a la exósfera</li>\n                        <li>Sesión 10: Regreso a la tierra</li>\n                    </ol>\n                </li>\n                <li>Costos</li>\n            </ol>",
    "headings": "<ul><li><span class=\"toc-h1\">La edición se hizo código</span><ul><li><span class=\"toc-h2\">Taller intensivo de edición digital</span></li></ul></li><li><span class=\"toc-h1\">Descripción</span><ul><li><span class=\"toc-h2\">Antecedentes</span><li><span class=\"toc-h2\">Proyección</span></li></ul></li><li><span class=\"toc-h1\">Información general</span><ul><li><span class=\"toc-h2\">Objetivos</span><ul><li><span class=\"toc-h3\">General</span><li><span class=\"toc-h3\">Particulares</span></li></ul></li><li><span class=\"toc-h2\">Propuesta de cronograma</span><li><span class=\"toc-h2\">Requisitos previos</span><li><span class=\"toc-h2\">Necesidades espaciales</span></li></ul></li><li><span class=\"toc-h1\">Syllabus</span><ul><li><span class=\"toc-h2\">Sesión 1: Más allá de Adobe</span><ul><li><span class=\"toc-h3\">Temas</span></li></ul></li><li><span class=\"toc-h2\">Sesión 2: Bienvenido a la edición «desde cero»</span><ul><li><span class=\"toc-h3\">Temas</span></li></ul></li><li><span class=\"toc-h2\">Sesión 3: ¡Esto es Pecas! > Herramientas editoriales libres</span><ul><li><span class=\"toc-h3\">Temas</span></li></ul></li><li><span class=\"toc-h2\">Sesión 4: De la planicie y los tornados al bosque y las ramas</span><ul><li><span class=\"toc-h3\">Temas</span></li></ul></li><li><span class=\"toc-h2\">Sesión 5: Bienvenidos al mundo de Markdown</span><ul><li><span class=\"toc-h3\">Temas</span></li></ul></li><li><span class=\"toc-h2\">Sesión 6: Nuestro primer proyecto con Markdown</span><ul><li><span class=\"toc-h3\">Temas</span></li></ul></li><li><span class=\"toc-h2\">Sesión 7: ¿Otra vez Pecas?</span><ul><li><span class=\"toc-h3\">Temas</span></li></ul></li><li><span class=\"toc-h2\">Sesión 8: Mi primer EPUB</span><ul><li><span class=\"toc-h3\">Temas</span></li></ul></li><li><span class=\"toc-h2\">Sesión 9: Viaje a la exósfera</span><ul><li><span class=\"toc-h3\">Temas</span></li></ul></li><li><span class=\"toc-h2\">Sesión 10: Regreso a la tierra</span><ul><li><span class=\"toc-h3\">Temas</span></li></ul></li></ul></li><li><span class=\"toc-h1\">Costos</span></li></ul>",
    "html": "<ol><li><ol><li><i>Untitled BODY</i><ol><li>La edición se hizo código<ol><li>Taller intensivo de edición digital</li></ol></li></ol></li></ol></li><li><ol><li><i>Untitled BODY</i><ol><li>Descripción<ol><li>Antecedentes</li><li>Proyección</li></ol></li></ol></li></ol></li><li><ol><li><i>Untitled BODY</i><ol><li>Información general<ol><li>Objetivos<ol><li>General</li><li>Particulares</li></ol></li><li>Propuesta de cronograma</li><li>Requisitos previos</li><li>Necesidades espaciales</li></ol></li></ol></li></ol></li><li><ol><li><i>Untitled BODY</i><ol><li>Syllabus<ol><li>Sesión 1: Más allá de Adobe<ol><li>Temas</li></ol></li><li>Sesión 2: Bienvenido a la edición «desde cero»<ol><li>Temas</li></ol></li><li>Sesión 3: ¡Esto es Pecas! > Herramientas editoriales libres<ol><li>Temas</li></ol></li><li>Sesión 4: De la planicie y los tornados al bosque y las ramas<ol><li>Temas</li></ol></li><li>Sesión 5: Bienvenidos al mundo de Markdown<ol><li>Temas</li></ol></li><li>Sesión 6: Nuestro primer proyecto con Markdown<ol><li>Temas</li></ol></li><li>Sesión 7: ¿Otra vez Pecas?<ol><li>Temas</li></ol></li><li>Sesión 8: Mi primer EPUB<ol><li>Temas</li></ol></li><li>Sesión 9: Viaje a la exósfera<ol><li>Temas</li></ol></li><li>Sesión 10: Regreso a la tierra<ol><li>Temas</li></ol></li></ol></li></ol></li></ol></li><li><ol><li><i>Untitled BODY</i><ol><li>Costos</li></ol></li></ol></li></ol>"
  },
  "data": {},
  "properties": {
    "hasManifestFallbacks": false,
    "hasBindings": false,
    "hasSVGContentDocuments": false,
    "hasFormElements": false,
    "hasMathML": false,
    "hasPageBreaks": false
  },
  "earl:testSubject": {
    "url": "../../epub-c60acce0.epub",
    "metadata": {
      "dc:language": "es",
      "dc:title": "Taller Intensivo de Edición Digital",
      "dc:creator": [
        "Bayardo, Melisa",
        "Santa Ana Anguiano, Ramiro"
      ],
      "dc:identifier": "1_0_0-c60acce00189404aba65a8717f33c452",
      "schema:accessibilitySummary": "Este EPUB está optimizado para personas con deficiencias visuales; cualquier observación por favor póngase en contacto.",
      "schema:accessMode": [
        "textual",
        "visual"
      ],
      "schema:accessModeSufficient": [
        "textual, visual",
        "textual"
      ],
      "schema:accessibilityFeature": [
        "structuralNavigation",
        "alternativeText",
        "resizeText"
      ],
      "schema:accessibilityAPI": "ARIA",
      "schema:accessibilityHazard": "none",
      "dcterms:modified": "2018-10-17T19:01:36Z",
      "rendition:layout": "reflowable",
      "ibooks:specified-fonts": "true"
    },
    "links": {}
  },
  "a11y-metadata": {
    "missing": [
      "schema:accessibilityControl",
      "a11y:certifiedBy"
    ],
    "empty": [],
    "present": [
      "schema:accessMode",
      "schema:accessibilityFeature",
      "schema:accessibilityHazard",
      "schema:accessibilitySummary",
      "schema:accessModeSufficient",
      "schema:accessibilityAPI"
    ]
  },
  "assertions": [
    {
      "@type": "earl:assertion",
      "earl:result": {
        "earl:outcome": "pass"
      },
      "assertions": [],
      "earl:testSubject": {
        "url": "OPS/content.opf",
        "dct:title": "Taller Intensivo de Edición Digital"
      }
    },
    {
      "@type": "earl:assertion",
      "earl:result": {
        "earl:outcome": "pass"
      },
      "assertions": [],
      "earl:testSubject": {
        "url": "xhtml/003-portada.xhtml",
        "dct:title": "Portada"
      }
    },
    {
      "@type": "earl:assertion",
      "earl:result": {
        "earl:outcome": "pass"
      },
      "assertions": [],
      "earl:testSubject": {
        "url": "xhtml/004-descripcion.xhtml",
        "dct:title": "Descripción"
      }
    },
    {
      "@type": "earl:assertion",
      "earl:result": {
        "earl:outcome": "pass"
      },
      "assertions": [],
      "earl:testSubject": {
        "url": "xhtml/005-informacion_general.xhtml",
        "dct:title": "Información general"
      }
    },
    {
      "@type": "earl:assertion",
      "earl:result": {
        "earl:outcome": "pass"
      },
      "assertions": [],
      "earl:testSubject": {
        "url": "xhtml/006-syllabus.xhtml",
        "dct:title": "Syllabus"
      }
    },
    {
      "@type": "earl:assertion",
      "earl:result": {
        "earl:outcome": "pass"
      },
      "assertions": [],
      "earl:testSubject": {
        "url": "xhtml/007-costos.xhtml",
        "dct:title": "Costos"
      }
    }
  ],
  "earl:result": {
    "earl:outcome": "pass"
  }
}