{
  "title": "¿Conceptos o percepción?",
  "words_digits": {
    "all": 24,
    "uniq_case_on": 16,
    "list_all_case_on": [
      [
        "acerca",
        1
      ],
      [
        "Autoría",
        1
      ],
      [
        "Conceptos",
        2
      ],
      [
        "de",
        2
      ],
      [
        "Debates",
        1
      ],
      [
        "Emiliano",
        2
      ],
      [
        "experiencia",
        1
      ],
      [
        "humana",
        1
      ],
      [
        "la",
        2
      ],
      [
        "naturaleza",
        1
      ],
      [
        "o",
        2
      ],
      [
        "percepción",
        2
      ],
      [
        "Perro",
        1
      ],
      [
        "R",
        2
      ],
      [
        "Tuerto",
        1
      ],
      [
        "Villarreal",
        2
      ]
    ],
    "list_uniq_case_on": [
      "acerca",
      "Autoría",
      "Conceptos",
      "de",
      "Debates",
      "Emiliano",
      "experiencia",
      "humana",
      "la",
      "naturaleza",
      "o",
      "percepción",
      "Perro",
      "R",
      "Tuerto",
      "Villarreal"
    ]
  },
  "words": {
    "all": 24,
    "uniq_case_on": 16,
    "list_all_case_on": [
      [
        "acerca",
        1
      ],
      [
        "Autoría",
        1
      ],
      [
        "Conceptos",
        2
      ],
      [
        "de",
        2
      ],
      [
        "Debates",
        1
      ],
      [
        "Emiliano",
        2
      ],
      [
        "experiencia",
        1
      ],
      [
        "humana",
        1
      ],
      [
        "la",
        2
      ],
      [
        "naturaleza",
        1
      ],
      [
        "o",
        2
      ],
      [
        "percepción",
        2
      ],
      [
        "Perro",
        1
      ],
      [
        "R",
        2
      ],
      [
        "Tuerto",
        1
      ],
      [
        "Villarreal",
        2
      ]
    ],
    "list_uniq_case_on": [
      "acerca",
      "Autoría",
      "Conceptos",
      "de",
      "Debates",
      "Emiliano",
      "experiencia",
      "humana",
      "la",
      "naturaleza",
      "o",
      "percepción",
      "Perro",
      "R",
      "Tuerto",
      "Villarreal"
    ]
  },
  "digits": {
    "all": 0,
    "uniq_case_on": 0,
    "list_all_case_on": [

    ],
    "list_uniq_case_on": [

    ]
  },
  "unknown": {
    "all": 0,
    "uniq_case_on": 0,
    "list_all_case_on": [

    ],
    "list_uniq_case_on": [

    ]
  },
  "uppercase": {
    "all": 12,
    "uniq_case_on": 8,
    "list_all_case_on": [
      [
        "Autoría",
        1
      ],
      [
        "Conceptos",
        2
      ],
      [
        "Debates",
        1
      ],
      [
        "Emiliano",
        2
      ],
      [
        "Perro",
        1
      ],
      [
        "R",
        2
      ],
      [
        "Tuerto",
        1
      ],
      [
        "Villarreal",
        2
      ]
    ],
    "list_uniq_case_on": [
      "Autoría",
      "Conceptos",
      "Debates",
      "Emiliano",
      "Perro",
      "R",
      "Tuerto",
      "Villarreal"
    ]
  },
  "top": {
    "all_clean": 12,
    "list_all_clean": [
      [
        "villarreal",
        2,
        8.333333333333334
      ],
      [
        "percepción",
        2,
        8.333333333333334
      ],
      [
        "emiliano",
        2,
        8.333333333333334
      ],
      [
        "conceptos",
        2,
        8.333333333333334
      ],
      [
        "tuerto",
        1,
        4.166666666666667
      ],
      [
        "perro",
        1,
        4.166666666666667
      ],
      [
        "naturaleza",
        1,
        4.166666666666667
      ],
      [
        "humana",
        1,
        4.166666666666667
      ],
      [
        "experiencia",
        1,
        4.166666666666667
      ],
      [
        "debates",
        1,
        4.166666666666667
      ],
      [
        "autoría",
        1,
        4.166666666666667
      ],
      [
        "acerca",
        1,
        4.166666666666667
      ]
    ]
  },
  "diversity": 1.5,
  "tags": {
    "all": 22,
    "types": 12,
    "list": [
      {
        "tag": "body",
        "length": 2,
        "types": [
          [
            "<body>",
            2
          ]
        ]
      },
      {
        "tag": "br",
        "length": 1,
        "types": [
          [
            "<br />",
            1
          ]
        ]
      },
      {
        "tag": "h1",
        "length": 1,
        "types": [
          [
            "<h1 id=\"pc-title\" class=\"centrado titulo\">",
            1
          ]
        ]
      },
      {
        "tag": "h2",
        "length": 1,
        "types": [
          [
            "<h2 id=\"pc-subtitle\" class=\"centrado subtitulo\">",
            1
          ]
        ]
      },
      {
        "tag": "head",
        "length": 2,
        "types": [
          [
            "<head>",
            2
          ]
        ]
      },
      {
        "tag": "html",
        "length": 2,
        "types": [
          [
            "<html xmlns=\"http://www.w3.org/1999/xhtml\" xmlns:epub=\"http://www.idpf.org/2007/ops\" xml:lang=\"es\" lang=\"es\">",
            2
          ]
        ]
      },
      {
        "tag": "i",
        "length": 1,
        "types": [
          [
            "<i>",
            1
          ]
        ]
      },
      {
        "tag": "link",
        "length": 2,
        "types": [
          [
            "<link href=\"../css/styles.css\" rel=\"stylesheet\" type=\"text/css\" />",
            2
          ]
        ]
      },
      {
        "tag": "meta",
        "length": 2,
        "types": [
          [
            "<meta charset=\"UTF-8\" />",
            2
          ]
        ]
      },
      {
        "tag": "p",
        "length": 4,
        "types": [
          [
            "<p id=\"pc-author\" class=\"centrado\">",
            1
          ],
          [
            "<p id=\"pc-author\" class=\"espacio-arriba2\">",
            1
          ],
          [
            "<p id=\"pc-publisher\">",
            1
          ],
          [
            "<p id=\"pc-title\">",
            1
          ]
        ]
      },
      {
        "tag": "section",
        "length": 2,
        "types": [
          [
            "<section class=\"legal\" epub:type=\"copyright-page\">",
            1
          ],
          [
            "<section id=\"portadilla\" epub:type=\"titlepage\">",
            1
          ]
        ]
      },
      {
        "tag": "title",
        "length": 2,
        "types": [
          [
            "<title>",
            2
          ]
        ]
      }
    ]
  },
  "linkchecker": {
    "all": 3,
    "list": [
      {
        "urlname": "./OPS/xhtml/001-portadilla.xhtml",
        "parentname": "",
        "baseref": "",
        "result": "",
        "warningstring": "",
        "infostring": "",
        "valid": "True",
        "url": "./OPS/xhtml/001-portadilla.xhtml",
        "line": "0",
        "column": "0",
        "name": "/home/ted/Repositorios/taller-ibero/src/emiliano/epub-automata/epub-output/OPS/xhtml/001-portadilla.xhtml",
        "dltime": "-1",
        "size": "718",
        "checktime": "0.0020158290863",
        "cached": "0",
        "level": "0",
        "modified": "2019-11-20 19:52:43.000000Z"
      },
      {
        "urlname": "./OPS/xhtml/002-legal.xhtml",
        "parentname": "",
        "baseref": "",
        "result": "",
        "warningstring": "",
        "infostring": "",
        "valid": "True",
        "url": "./OPS/xhtml/002-legal.xhtml",
        "line": "0",
        "column": "0",
        "name": "/home/ted/Repositorios/taller-ibero/src/emiliano/epub-automata/epub-output/OPS/xhtml/002-legal.xhtml",
        "dltime": "-1",
        "size": "645",
        "checktime": "0.00117301940918",
        "cached": "0",
        "level": "0",
        "modified": "2019-11-20 19:52:43.000000Z"
      },
      {
        "urlname": "../css/styles.css",
        "parentname": "./OPS/xhtml/001-portadilla.xhtml",
        "baseref": "",
        "result": "",
        "warningstring": "",
        "infostring": "",
        "valid": "True",
        "url": "./OPS/css/styles.css",
        "line": "7",
        "column": "9",
        "name": "",
        "dltime": "-1",
        "size": "15044",
        "checktime": "0.000308036804199",
        "cached": "0",
        "level": "1",
        "modified": "2019-11-20 19:52:43.000000Z"
      }
    ]
  }
}
