digraph {
  node  [fontsize=36]
  1  [shape=triangle, fixedsize=true, width=2.0, height=2.0]
  1  -> 2  [arrowhead=none, style=dashed]
  1  -> 5  [arrowhead=none, style=dashed]
  1  -> 6  [arrowhead=none, style=dashed]
  1  -> 8  [arrowhead=none, style=dashed]
  2  -> 20 [color=blue]
  2  -> 4  [color=blue]
  2  -> 21 [color=blue]
  2  [shape=diamond, fixedsize=true, width=4.666666666666667, height=4.666666666666667]
  2  -> 3  [color=blue]
  2  -> 3  [arrowhead=none, style=dashed]
  2  -> 4  [arrowhead=none, style=dashed]
  2  -> 5  [arrowhead=none, style=dashed]
  2  -> 6  [arrowhead=none, style=dashed]
  2  -> 8  [arrowhead=none, style=dashed]
  2  -> 10 [arrowhead=none, style=dashed]
  2  -> 18 [arrowhead=none, style=dashed]
  3  [shape=diamond, fixedsize=true, width=3.3333333333333335, height=3.3333333333333335]
  3  -> 4  [arrowhead=none, style=dashed]
  3  -> 5  [arrowhead=none, style=dashed]
  3  -> 6  [arrowhead=none, style=dashed]
  3  -> 8  [arrowhead=none, style=dashed]
  4  [shape=diamond, fixedsize=true, width=6.666666666666667, height=6.666666666666667]
  4  -> 5  [arrowhead=none, style=dashed]
  4  -> 6  [arrowhead=none, style=dashed]
  4  -> 8  [arrowhead=none, style=dashed]
  4  -> 12 [arrowhead=none, style=dashed]
  5  -> 4  [color=blue]
  5  -> 19 [color=blue]
  5  [shape=circle, fixedsize=true, width=2.0, height=2.0]
  5  -> 3  [color=blue]
  5  -> 8  [arrowhead=none, style=dashed]
  5  -> 20 [arrowhead=none, style=dashed]
  5  -> 22 [arrowhead=none, style=dashed]
  6  [shape=circle, fixedsize=true, width=4.0, height=4.0]
  6  -> 19 [color=blue]
  6  -> 5  [color=blue]
  6  -> 7  [arrowhead=none, style=dashed]
  6  -> 8  [arrowhead=none, style=dashed]
  6  -> 22 [arrowhead=none, style=dashed]
  7  [shape=diamond, fixedsize=true, width=3.3333333333333335, height=3.3333333333333335]
  7  -> 8  [arrowhead=none, style=dashed]
  7  -> 16 [arrowhead=none, style=dashed]
  7  -> 22 [arrowhead=none, style=dashed]
  8  [shape=triangle, fixedsize=true, width=1.3333333333333333, height=1.3333333333333333]
  8  -> 9  [arrowhead=none, style=dashed]
  8  -> 11 [arrowhead=none, style=dashed]
  8  -> 16 [arrowhead=none, style=dashed]
  8  -> 19 [arrowhead=none, style=dashed]
  8  -> 20 [arrowhead=none, style=dashed]
  8  -> 21 [arrowhead=none, style=dashed]
  8  -> 22 [arrowhead=none, style=dashed]
  9  [shape=triangle, fixedsize=true, width=1.3333333333333333, height=1.3333333333333333]
  9  -> 11 [arrowhead=none, style=dashed]
  9  -> 19 [arrowhead=none, style=dashed]
  9  -> 20 [arrowhead=none, style=dashed]
  10 [shape=diamond, fixedsize=true, width=6.666666666666667, height=6.666666666666667]
  10 -> 22 [arrowhead=none, style=dashed]
  11 [shape=diamond, fixedsize=true, width=2.0, height=2.0]
  11 -> 7  [color=blue]
  11 -> 10 [color=blue]
  11 -> 12 [arrowhead=none, style=dashed]
  11 -> 17 [arrowhead=none, style=dashed]
  11 -> 22 [arrowhead=none, style=dashed]
  12 [shape=diamond, fixedsize=true, width=6.666666666666667, height=6.666666666666667]
  12 -> 22 [arrowhead=none, style=dashed]
  13 [shape=triangle, fixedsize=true, width=6.666666666666667, height=6.666666666666667]
  13 -> 14 [arrowhead=none, style=dashed]
  13 -> 15 [arrowhead=none, style=dashed]
  13 -> 16 [arrowhead=none, style=dashed]
  14 [shape=triangle, fixedsize=true, width=6.666666666666667, height=6.666666666666667]
  14 -> 15 [arrowhead=none, style=dashed]
  14 -> 16 [arrowhead=none, style=dashed]
  15 [shape=triangle, fixedsize=true, width=3.3333333333333335, height=3.3333333333333335]
  15 -> 16 [arrowhead=none, style=dashed]
  16 [shape=diamond, fixedsize=true, width=2.6666666666666665, height=2.6666666666666665]
  17 -> 4  [color=blue]
  17 -> 6  [color=blue]
  17 -> 18 [color=blue]
  17 -> 3  [color=blue]
  17 [shape=circle, fixedsize=true, width=1.3333333333333333, height=1.3333333333333333]
  18 -> 22 [color=red, penwidth=5.0]
  18 -> 6  [color=red, penwidth=5.0]
  18 -> 19 [color=red, penwidth=5.0]
  18 -> 5  [color=red, penwidth=5.0]
  18 [shape=circle, fixedsize=true, width=3.3333333333333335, height=3.3333333333333335]
  18 -> 10 [color=red, penwidth=5.0]
  19 [shape=circle, fixedsize=true, width=13.333333333333334, height=13.333333333333334]
  19 -> 10 [color=blue]
  19 -> 20 [arrowhead=none, style=dashed]
  20 [shape=circle, fixedsize=true, width=6.666666666666667, height=6.666666666666667]
  21 [shape=circle, fixedsize=true, width=4.666666666666667, height=4.666666666666667]
  22 [shape=diamond, fixedsize=true, width=10.0, height=10.0]
}
