<?xml version="1.0" encoding="UTF-8" standalone="no"?>
<!-- Created with Inkscape (http://www.inkscape.org/) -->

<svg
   xmlns:dc="http://purl.org/dc/elements/1.1/"
   xmlns:cc="http://creativecommons.org/ns#"
   xmlns:rdf="http://www.w3.org/1999/02/22-rdf-syntax-ns#"
   xmlns:svg="http://www.w3.org/2000/svg"
   xmlns="http://www.w3.org/2000/svg"
   xmlns:sodipodi="http://sodipodi.sourceforge.net/DTD/sodipodi-0.dtd"
   xmlns:inkscape="http://www.inkscape.org/namespaces/inkscape"
   width="625"
   height="1000"
   viewBox="0 0 165.36458 264.58334"
   version="1.1"
   id="svg8"
   inkscape:version="0.92.2 2405546, 2018-03-11"
   sodipodi:docname="10_no-estandarizada.svg"
   inkscape:export-filename="/home/nika-zhenya/Repositorios/taller-edicion-digital/src/notes/covers/10_no-estandarizada.png"
   inkscape:export-xdpi="143.99998"
   inkscape:export-ydpi="143.99998">
  <defs
     id="defs2" />
  <sodipodi:namedview
     id="base"
     pagecolor="#ffffff"
     bordercolor="#666666"
     borderopacity="1.0"
     inkscape:pageopacity="0.0"
     inkscape:pageshadow="2"
     inkscape:zoom="0.49497475"
     inkscape:cx="251.91315"
     inkscape:cy="468.78018"
     inkscape:document-units="px"
     inkscape:current-layer="layer1"
     showgrid="false"
     units="px"
     inkscape:window-width="1920"
     inkscape:window-height="1025"
     inkscape:window-x="0"
     inkscape:window-y="27"
     inkscape:window-maximized="1" />
  <metadata
     id="metadata5">
    <rdf:RDF>
      <cc:Work
         rdf:about="">
        <dc:format>image/svg+xml</dc:format>
        <dc:type
           rdf:resource="http://purl.org/dc/dcmitype/StillImage" />
        <dc:title />
      </cc:Work>
    </rdf:RDF>
  </metadata>
  <g
     inkscape:label="Capa 1"
     inkscape:groupmode="layer"
     id="layer1"
     transform="translate(0,-32.416658)">
    <rect
       style="opacity:1;fill:#000000;fill-opacity:1;stroke:none;stroke-width:0.54230016;stroke-linecap:round;stroke-linejoin:round;stroke-miterlimit:4;stroke-dasharray:none;stroke-dashoffset:0;stroke-opacity:1"
       id="rect815"
       width="165.36458"
       height="264.58334"
       x="0"
       y="32.416656" />
    <text
       xml:space="preserve"
       style="font-style:normal;font-weight:normal;font-size:10.58333302px;line-height:1.25;font-family:sans-serif;letter-spacing:0px;word-spacing:0px;fill:#ffffff;fill-opacity:1;stroke:none;stroke-width:0.26458332"
       x="13.229167"
       y="52.63076"
       id="text819"><tspan
         sodipodi:role="line"
         id="tspan817"
         x="13.229167"
         y="52.63076"
         style="font-style:normal;font-variant:normal;font-weight:normal;font-stretch:normal;font-family:'Calling Code';-inkscape-font-specification:'Calling Code';fill:#ffffff;stroke-width:0.26458332"># TALLER</tspan><tspan
         sodipodi:role="line"
         x="13.229167"
         y="66.016197"
         style="font-style:normal;font-variant:normal;font-weight:normal;font-stretch:normal;font-family:'Calling Code';-inkscape-font-specification:'Calling Code';fill:#ffffff;stroke-width:0.26458332"
         id="tspan821">  EDICIÓN</tspan><tspan
         sodipodi:role="line"
         x="13.229167"
         y="79.401634"
         style="font-style:normal;font-variant:normal;font-weight:normal;font-stretch:normal;font-family:'Calling Code';-inkscape-font-specification:'Calling Code';fill:#ffffff;stroke-width:0.26458332"
         id="tspan823">  DIGITAL</tspan></text>
    <text
       xml:space="preserve"
       style="font-style:normal;font-weight:normal;font-size:10.57239819px;line-height:1.25;font-family:sans-serif;letter-spacing:0px;word-spacing:0px;fill:#000000;fill-opacity:1;stroke:none;stroke-width:0.26430997"
       x="13.208982"
       y="216.04912"
       id="text846"
       transform="scale(0.99896686,1.0010342)"
       inkscape:export-xdpi="143.99998"
       inkscape:export-ydpi="143.99998"><tspan
         sodipodi:role="line"
         x="13.208982"
         y="216.04912"
         style="font-style:normal;font-variant:normal;font-weight:normal;font-stretch:normal;font-size:16.93333435px;font-family:'Calling Code';-inkscape-font-specification:'Calling Code';fill:#ffffff;stroke-width:0.26430997"
         id="tspan1190">Edición no </tspan><tspan
         sodipodi:role="line"
         x="13.208982"
         y="237.21577"
         style="font-style:normal;font-variant:normal;font-weight:normal;font-stretch:normal;font-size:16.93333435px;font-family:'Calling Code';-inkscape-font-specification:'Calling Code';fill:#ffffff;stroke-width:0.26430997"
         id="tspan1213">estandarizada: </tspan><tspan
         sodipodi:role="line"
         x="13.208982"
         y="258.38245"
         style="font-style:normal;font-variant:normal;font-weight:normal;font-stretch:normal;font-size:16.93333435px;font-family:'Calling Code';-inkscape-font-specification:'Calling Code';fill:#ffffff;stroke-width:0.26430997"
         id="tspan1215">aplicaciones </tspan><tspan
         sodipodi:role="line"
         x="13.208982"
         y="279.5491"
         style="font-style:normal;font-variant:normal;font-weight:normal;font-stretch:normal;font-size:16.93333435px;font-family:'Calling Code';-inkscape-font-specification:'Calling Code';fill:#ffffff;stroke-width:0.26430997"
         id="tspan1217">y más</tspan></text>
  </g>
</svg>
