cordova/platforms/android/app/src/main/res/drawable-land-hdpi/screen.png    ; 800x480   ; 50% logo
cordova/platforms/android/app/src/main/res/drawable-land-ldpi/screen.png    ; 320x200   ; 50% logo
cordova/platforms/android/app/src/main/res/drawable-land-mdpi/screen.png    ; 480x320   ; 50% logo
cordova/platforms/android/app/src/main/res/drawable-land-xhdpi/screen.png   ; 1280x720  ; 33% logo
cordova/platforms/android/app/src/main/res/drawable-land-xxhdpi/screen.png  ; 1600x960  ; 33% logo
cordova/platforms/android/app/src/main/res/drawable-land-xxxhdpi/screen.png ; 1920x1280 ; 33% logo
cordova/platforms/android/app/src/main/res/drawable-port-hdpi/screen.png    ; 480x800   ; 50% logo
cordova/platforms/android/app/src/main/res/drawable-port-ldpi/screen.png    ; 200x320   ; 50% logo
cordova/platforms/android/app/src/main/res/drawable-port-mdpi/screen.png    ; 320x480   ; 50% logo
cordova/platforms/android/app/src/main/res/drawable-port-xhdpi/screen.png   ; 720x1280  ; 33% logo
cordova/platforms/android/app/src/main/res/drawable-port-xxhdpi/screen.png  ; 960x1600  ; 33% logo
cordova/platforms/android/app/src/main/res/drawable-port-xxxhdpi/screen.png ; 1280x1920 ; 33% logo
cordova/platforms/android/app/src/main/res/mipmap-hdpi/icon.png             ; 72x72
cordova/platforms/android/app/src/main/res/mipmap-ldpi/icon.png             ; 36x36
cordova/platforms/android/app/src/main/res/mipmap-mdpi/icon.png             ; 48x48
cordova/platforms/android/app/src/main/res/mipmap-xhdpi/icon.png            ; 96x96
cordova/platforms/android/app/src/main/res/mipmap-xxhdpi/icon.png           ; 144x144
cordova/platforms/android/app/src/main/res/mipmap-xxxhdpi/icon.png          ; 192x192
