<?xml version="1.0" encoding="UTF-8" standalone="no"?>
<!-- Created with Inkscape (http://www.inkscape.org/) -->

<svg
   width="210mm"
   height="297mm"
   viewBox="0 0 210 297"
   version="1.1"
   id="svg5"
   xml:space="preserve"
   inkscape:version="1.2.1 (9c6d41e410, 2022-07-14, custom)"
   sodipodi:docname="venn.svg"
   xmlns:inkscape="http://www.inkscape.org/namespaces/inkscape"
   xmlns:sodipodi="http://sodipodi.sourceforge.net/DTD/sodipodi-0.dtd"
   xmlns="http://www.w3.org/2000/svg"
   xmlns:svg="http://www.w3.org/2000/svg"><sodipodi:namedview
     id="namedview7"
     pagecolor="#ffffff"
     bordercolor="#666666"
     borderopacity="1.0"
     inkscape:showpageshadow="2"
     inkscape:pageopacity="0.0"
     inkscape:pagecheckerboard="0"
     inkscape:deskcolor="#d1d1d1"
     inkscape:document-units="mm"
     showgrid="false"
     inkscape:zoom="0.71446409"
     inkscape:cx="277.1308"
     inkscape:cy="568.25809"
     inkscape:window-width="1280"
     inkscape:window-height="960"
     inkscape:window-x="1366"
     inkscape:window-y="32"
     inkscape:window-maximized="1"
     inkscape:current-layer="layer1" /><defs
     id="defs2" /><g
     inkscape:label="Capa 1"
     inkscape:groupmode="layer"
     id="layer1"><path
       id="path12706"
       style="fill:#ffeacc;fill-opacity:1;stroke:none;stroke-width:6.99826;stroke-linejoin:round;stroke-dasharray:none;stroke-opacity:1"
       d="m 104.51591,130.90127 c -4.05223,0.0923 -8.168357,0.52535 -11.944251,2.09177 -5.251664,2.06631 -10.224074,5.07421 -14.111179,9.20238 -3.622051,3.98814 -6.541161,8.65019 -8.426519,13.70247 -1.172652,3.32575 -1.646759,6.85439 -1.990949,10.34944 -0.01976,0.78829 -0.296503,1.94975 0.642823,2.31996 2.834022,1.20274 5.832185,1.9904 8.825392,2.6879 3.345344,0.59999 6.76972,0.34915 10.14547,0.21741 4.11064,-0.18499 8.193246,-1.08571 11.934555,-2.8171 1.940768,-0.78472 3.872338,-1.76803 5.977398,-1.99446 1.66667,0.19373 3.06981,1.25594 4.61812,1.83092 4.05425,1.68911 8.34958,3.0602 12.78802,3.00949 3.26898,8.4e-4 6.56706,0.21054 9.81192,-0.27373 2.75432,-0.5542 5.45562,-1.38383 8.08958,-2.35655 0.60811,-0.27184 1.62499,-0.463 1.49295,-1.3256 -0.19898,-3.57746 -0.6775,-7.15798 -1.81622,-10.56812 -2.31998,-7.29294 -6.83914,-13.90113 -12.97018,-18.51153 -6.5549,-5.01309 -14.79378,-7.83035 -23.06693,-7.56465 z"
       inkscape:export-filename="../../../../../Descargas/venn.png"
       inkscape:export-xdpi="96"
       inkscape:export-ydpi="96" /><path
       id="path12710"
       style="fill:#ff995e;fill-opacity:1;stroke:none;stroke-width:6.99826;stroke-linejoin:round;stroke-dasharray:none;stroke-opacity:1"
       d="m 105.1956,98.190319 c -1.68185,1.212532 -3.4116,2.366881 -4.97541,3.733621 -4.435068,3.82754 -7.989549,8.64985 -10.433667,13.96825 -0.906558,1.99302 -1.67641,4.05403 -2.22015,6.17639 -0.567219,2.35191 -0.934059,4.74806 -1.220161,7.14892 -0.18838,1.60071 -0.314174,3.2114 -0.283294,4.82427 -0.02131,0.19449 0.120422,0.35365 0.181385,0.53031 0.208978,0.0479 0.425849,0.1922 0.630444,0.0553 1.449731,-0.62263 2.910107,-1.27018 4.352197,-1.86503 0.605168,-0.24635 1.206942,-0.48025 1.806607,-0.69504 0.806804,-0.28693 1.625795,-0.54057 2.457733,-0.74414 0.141203,-0.0329 0.370877,-0.0883 0.547481,-0.12459 2.127464,-0.46151 4.317865,-0.56308 6.476145,-0.60973 2.32992,-0.0326 4.66067,-0.0313 6.99041,0.0123 1.55521,0.0322 3.12512,0.13056 4.6268,0.56624 2.19962,0.61284 4.35406,1.38368 6.46362,2.25575 1.03655,0.44511 2.05207,0.94386 3.11061,1.33502 0.15214,0.0299 0.31055,-0.0434 0.46174,-0.0631 0.15486,-0.14403 0.27336,-0.32465 0.26613,-0.54416 0.033,-1.22727 -0.0634,-2.45416 -0.14382,-3.67815 -0.36822,-5.05817 -1.40349,-10.10522 -3.43646,-14.76754 -1.32987,-3.06694 -3.0736,-5.95512 -5.16845,-8.56005 -1.62386,-1.92701 -3.41937,-3.70303 -5.27103,-5.40969 -1.17892,-1.06643 -2.37965,-2.122813 -3.73152,-2.967895 -0.30611,-0.193564 -0.60111,-0.415679 -0.91402,-0.591754 -0.19637,-0.01478 -0.39913,-0.123287 -0.57332,0.01449 z" /><path
       style="fill:#000000;stroke-width:0.264583"
       d="m 101.69529,205.99467 c -15.481995,-1.4129 -28.764362,-12.31173 -33.147132,-27.19884 -0.728956,-2.47607 -1.137928,-4.7325 -1.526677,-8.42316 -0.154004,-1.46205 -0.212521,-1.56483 -1.102585,-1.93673 -2.616803,-1.09337 -7.533518,-4.68228 -10.512811,-7.67374 -8.137512,-8.17074 -12.529103,-19.44684 -11.961347,-30.71264 1.026692,-20.37232 16.395814,-36.705342 36.687008,-38.987885 7.408225,-0.833346 16.158882,0.825606 22.874864,4.336624 l 2.63424,1.377142 2.12826,-1.098845 c 2.6565,-1.371581 6.83587,-2.795775 10.46264,-3.565326 4.00044,-0.848842 11.34539,-0.848842 15.34584,0 12.83204,2.722786 23.03,10.45635 28.74052,21.79521 6.57918,13.06368 5.52641,28.72597 -2.76048,41.06818 -3.32045,4.94536 -8.96616,10.08706 -14.05036,12.79603 -1.17705,0.62716 -2.1401,1.25572 -2.1401,1.39679 0,1.17418 -0.65788,5.82756 -1.08069,7.64398 -1.72497,7.41067 -6.31706,15.02929 -11.96506,19.85093 -8.13271,6.9428 -18.34135,10.27087 -28.62613,9.33228 z m 7.67291,-1.42264 c 12.06854,-1.43817 22.6147,-8.64878 28.31105,-19.35682 1.57895,-2.9681 2.38471,-5.04129 3.16334,-8.13917 0.61496,-2.44664 1.30537,-7.12824 1.08389,-7.34972 -0.0607,-0.0607 -0.77183,0.13721 -1.58036,0.43973 -10.85237,4.06039 -22.92415,3.38506 -32.97661,-1.8448 l -2.10961,-1.09754 -2.5612,1.24618 c -6.562416,3.19305 -13.22432,4.61717 -20.053412,4.28685 -4.165756,-0.2015 -7.077578,-0.73854 -11.015559,-2.03166 -1.774256,-0.58261 -3.256151,-1.02907 -3.2931,-0.99212 -0.03695,0.037 0.04575,1.07918 0.183785,2.31607 2.256073,20.21671 20.724244,34.92106 40.847786,32.523 z M 92.170288,170.71897 c 3.392255,-0.71351 5.976773,-1.58406 9.164122,-3.08675 l 2.54954,-1.202 -2.54954,-1.92058 c -7.972322,-6.00561 -13.338668,-14.63371 -15.384439,-24.73538 -0.308944,-1.52551 -0.597551,-2.80949 -0.64135,-2.85329 -0.0438,-0.0438 -1.018156,0.61703 -2.165236,1.46851 -2.757382,2.04683 -6.030738,5.39016 -8.046186,8.21821 -1.72407,2.41918 -4.080139,7.01896 -4.984895,9.73205 -0.870101,2.60919 -1.596629,6.65379 -1.678491,9.34424 l -0.07603,2.49856 1.984375,0.75119 c 2.352545,0.89055 6.541913,1.94716 9.128125,2.30222 2.926831,0.40183 9.628762,0.12902 12.7,-0.51698 z m 38.239242,0.52642 c 2.93282,-0.35894 7.03682,-1.36129 9.51806,-2.32466 2.33971,-0.90842 2.32118,-0.85929 1.8572,-4.92408 -1.15952,-10.15804 -6.39929,-19.40268 -14.41805,-25.43809 -2.11556,-1.59229 -2.50621,-1.6244 -2.51635,-0.2068 -0.006,0.79461 -1.2322,5.44519 -1.97891,7.50345 -2.63988,7.2767 -7.57235,13.94592 -13.74128,18.57967 -1.17878,0.88544 -2.24738,1.7017 -2.37466,1.81392 -0.12728,0.11222 0.61508,0.63033 1.6497,1.15136 6.55301,3.30004 14.75206,4.73282 22.00429,3.84523 z m -63.383842,-5.74487 c 0.709057,-7.66427 3.075482,-14.22142 7.202749,-19.95818 2.016813,-2.80331 5.830525,-6.5947 8.653021,-8.60239 l 2.260497,-1.60792 0.111857,-4.06497 c 0.356685,-12.96236 6.282518,-24.34883 16.668528,-32.028526 1.18481,-0.876077 2.19638,-1.63251 2.24793,-1.680962 0.19774,-0.185845 -4.702774,-2.463658 -6.972899,-3.24108 -4.574413,-1.566543 -7.393276,-2.007538 -12.832291,-2.007538 -4.080489,0 -5.356964,0.09921 -7.672917,0.596348 -7.959606,1.708596 -14.423382,5.151133 -20.076276,10.692408 -5.761758,5.64798 -9.411494,12.38396 -11.197627,20.66642 -0.840021,3.89525 -0.830411,11.28017 0.01984,15.24108 2.447984,11.40409 9.182415,20.84071 18.945416,26.54727 1.161124,0.67869 2.193443,1.23398 2.294046,1.23398 0.1006,0 0.257262,-0.80368 0.348136,-1.78594 z m 78.925112,0.48505 c 9.88454,-6.00359 16.31622,-15.07519 18.58677,-26.21578 3.88316,-19.05296 -7.18645,-38.40102 -25.64665,-44.826595 -4.78885,-1.666891 -7.44812,-2.103112 -12.85395,-2.108535 -6.59577,-0.0066 -10.31649,0.777678 -16.47207,3.472166 l -2.71371,1.187878 2.18522,1.648278 c 3.77367,2.846418 7.60076,7.029318 10.19375,11.141478 4.02599,6.38469 6.3849,15.1343 6.10627,22.64937 l -0.0932,2.51422 1.59978,1.09474 c 6.81362,4.66263 12.26009,12.07723 14.78261,20.12443 0.7373,2.35208 1.33411,5.55645 1.62055,8.70101 0.0961,1.05502 0.26205,1.91823 0.36878,1.91823 0.10672,0 1.15786,-0.5854 2.33587,-1.30089 z m -40.08227,-0.85442 c 1.36329,-0.72961 4.50352,-3.25684 6.38638,-5.1397 5.67767,-5.67767 9.41363,-12.61151 10.98914,-20.39551 0.29917,-1.47807 0.54394,-2.88437 0.54394,-3.1251 0,-0.29559 -0.88054,-0.85285 -2.71198,-1.7163 -5.64833,-2.66298 -9.52247,-3.53227 -15.80885,-3.54727 -6.223778,-0.0148 -10.458709,0.90653 -15.941143,3.46823 -2.988281,1.39629 -2.866681,1.08932 -2.039461,5.14856 1.968624,9.66021 7.357292,18.11024 15.291534,23.97884 1.21315,0.89731 2.32231,1.63147 2.4648,1.63147 0.14248,0 0.51402,-0.13645 0.82564,-0.30322 z m 18.10057,-34.42334 c -0.42657,-10.54708 -4.34796,-19.65015 -11.58687,-26.8976 -2.06437,-2.06681 -6.17654,-5.315419 -6.72839,-5.315419 -0.52134,0 -3.33164,1.972029 -5.57812,3.914249 -6.581737,5.69033 -11.227696,13.79236 -12.927478,22.54408 -0.45245,2.32955 -0.880673,9.525 -0.566862,9.525 0.09799,0 1.028309,-0.42812 2.067381,-0.95139 4.846074,-2.44045 10.24714,-3.63161 16.486109,-3.63587 6.334,-0.004 11.54256,1.164 16.66875,3.73897 1.16416,0.58477 2.16437,1.0744 2.22267,1.08805 0.0583,0.0136 0.0326,-1.79088 -0.0572,-4.01007 z"
       id="path12377"
       sodipodi:nodetypes="sssssssscsssssssssssssccscsssscssscssssssscssssssssccsssscsscsssssssscsscccsssscssscssssccsssssssssssssssssscssss" /><text
       xml:space="preserve"
       style="font-weight:bold;font-size:10.5833px;line-height:1;font-family:sans-serif;-inkscape-font-specification:'sans-serif Bold';word-spacing:0px;stroke-width:0.264583"
       x="104.84654"
       y="189.7157"
       id="text9955"><tspan
         sodipodi:role="line"
         id="tspan9953"
         style="font-style:italic;font-variant:normal;font-weight:normal;font-stretch:normal;font-family:'Alegreya Sans';-inkscape-font-specification:'Alegreya Sans Italic';text-align:center;text-anchor:middle;stroke-width:0.264583"
         x="104.84654"
         y="189.7157">freeware</tspan></text><text
       xml:space="preserve"
       style="font-weight:bold;font-size:10.5833px;line-height:1;font-family:sans-serif;-inkscape-font-specification:'sans-serif Bold';word-spacing:0px;stroke-width:0.264583"
       x="143.76855"
       y="122.42947"
       id="text10009"><tspan
         sodipodi:role="line"
         id="tspan10007"
         style="font-style:normal;font-variant:normal;font-weight:normal;font-stretch:normal;font-family:'Alegreya Sans';-inkscape-font-specification:'Alegreya Sans';text-align:center;text-anchor:middle;stroke-width:0.264583"
         x="143.76855"
         y="122.42947">código</tspan><tspan
         sodipodi:role="line"
         style="font-style:normal;font-variant:normal;font-weight:normal;font-stretch:normal;font-family:'Alegreya Sans';-inkscape-font-specification:'Alegreya Sans';text-align:center;text-anchor:middle;stroke-width:0.264583"
         x="143.76855"
         y="133.14687"
         id="tspan10021">abierto</tspan></text><text
       xml:space="preserve"
       style="font-weight:bold;font-size:10.5833px;line-height:1;font-family:sans-serif;-inkscape-font-specification:'sans-serif Bold';word-spacing:0px;stroke-width:0.264583"
       x="67.946442"
       y="122.45065"
       id="text10013"><tspan
         sodipodi:role="line"
         id="tspan10011"
         style="font-style:italic;font-variant:normal;font-weight:normal;font-stretch:normal;font-family:'Alegreya Sans';-inkscape-font-specification:'Alegreya Sans Italic';text-align:center;text-anchor:middle;stroke-width:0.264583"
         x="67.946442"
         y="122.45065">software</tspan><tspan
         sodipodi:role="line"
         style="font-style:normal;font-variant:normal;font-weight:normal;font-stretch:normal;font-family:'Alegreya Sans';-inkscape-font-specification:'Alegreya Sans';text-align:center;text-anchor:middle;stroke-width:0.264583"
         x="67.946442"
         y="133.16803"
         id="tspan10023">libre</tspan></text><text
       xml:space="preserve"
       style="font-weight:bold;font-size:4.93889px;line-height:1;font-family:sans-serif;-inkscape-font-specification:'sans-serif Bold';word-spacing:0px;stroke-width:0.264583"
       x="105.00494"
       y="142.6586"
       id="text10019"><tspan
         sodipodi:role="line"
         style="font-style:normal;font-variant:normal;font-weight:normal;font-stretch:normal;font-size:4.93889px;font-family:'Alegreya Sans';-inkscape-font-specification:'Alegreya Sans';text-align:center;text-anchor:middle;stroke-width:0.264583"
         x="105.00494"
         y="142.6586"
         id="tspan10031">código</tspan><tspan
         sodipodi:role="line"
         style="font-style:normal;font-variant:normal;font-weight:normal;font-stretch:normal;font-size:4.93889px;font-family:'Alegreya Sans';-inkscape-font-specification:'Alegreya Sans';text-align:center;text-anchor:middle;stroke-width:0.264583"
         x="105.00494"
         y="147.66006"
         id="tspan10047">máquina</tspan><tspan
         sodipodi:role="line"
         style="font-style:normal;font-variant:normal;font-weight:normal;font-stretch:normal;font-size:4.93889px;font-family:'Alegreya Sans';-inkscape-font-specification:'Alegreya Sans';text-align:center;text-anchor:middle;stroke-width:0.264583"
         x="105.00494"
         y="152.66153"
         id="tspan10049">disponible</tspan></text><text
       xml:space="preserve"
       style="font-weight:bold;font-size:4.93889px;line-height:1;font-family:sans-serif;-inkscape-font-specification:'sans-serif Bold';word-spacing:0px;stroke-width:0.264583"
       x="105.00494"
       y="113.55463"
       id="text10029"><tspan
         sodipodi:role="line"
         id="tspan10027"
         style="font-style:normal;font-variant:normal;font-weight:normal;font-stretch:normal;font-size:4.93889px;font-family:'Alegreya Sans';-inkscape-font-specification:'Alegreya Sans';text-align:center;text-anchor:middle;stroke-width:0.264583"
         x="105.00494"
         y="113.55463">código</tspan><tspan
         sodipodi:role="line"
         style="font-style:normal;font-variant:normal;font-weight:normal;font-stretch:normal;font-size:4.93889px;font-family:'Alegreya Sans';-inkscape-font-specification:'Alegreya Sans';text-align:center;text-anchor:middle;stroke-width:0.264583"
         x="105.00494"
         y="118.55609"
         id="tspan10043">fuente</tspan><tspan
         sodipodi:role="line"
         style="font-style:normal;font-variant:normal;font-weight:normal;font-stretch:normal;font-size:4.93889px;font-family:'Alegreya Sans';-inkscape-font-specification:'Alegreya Sans';text-align:center;text-anchor:middle;stroke-width:0.264583"
         x="105.00494"
         y="123.55756"
         id="tspan10033">disponible</tspan></text></g></svg>
