<?xml version="1.0" encoding="UTF-8" standalone="no"?>
<!-- Generator: Adobe Illustrator 16.0.0, SVG Export Plug-In . SVG Version: 6.00 Build 0)  -->

<svg
   version="1.1"
   id="Layer_1"
   x="0px"
   y="0px"
   width="100"
   height="100"
   viewBox="0 0 100 100"
   enable-background="new 0 0 612 792"
   xml:space="preserve"
   sodipodi:docname="icono-wikimedia.svg"
   inkscape:version="1.2.1 (9c6d41e410, 2022-07-14, custom)"
   inkscape:export-filename="../print/logo-wikimedia.png"
   inkscape:export-xdpi="300"
   inkscape:export-ydpi="300"
   xmlns:inkscape="http://www.inkscape.org/namespaces/inkscape"
   xmlns:sodipodi="http://sodipodi.sourceforge.net/DTD/sodipodi-0.dtd"
   xmlns="http://www.w3.org/2000/svg"
   xmlns:svg="http://www.w3.org/2000/svg"><defs
   id="defs330">
	
	
	
	
<clipPath
   clipPathUnits="userSpaceOnUse"
   id="clipPath494"><g
     id="g498"><path
       d="M -467.00579,-4.3093969 V 358.96272 h -81.202 V -4.3093969 L -1020.0342,-476.13577 V 592.31164 H 4.820589 V -476.13577 Z"
       id="path496"
       style="stroke-width:0.854758" /></g></clipPath><clipPath
   clipPathUnits="userSpaceOnUse"
   id="clipPath500"><g
     id="g504"><path
       d="M -467.00579,-4.3093969 V 358.96272 h -81.202 V -4.3093969 L -1020.0342,-476.13577 V 592.31164 H 4.820589 V -476.13577 Z"
       id="path502"
       style="stroke-width:0.854758" /></g></clipPath><clipPath
   clipPathUnits="userSpaceOnUse"
   id="clipPath494-6"><g
     id="g498-7"><path
       d="M -467.00579,-4.3093969 V 358.96272 h -81.202 V -4.3093969 L -1020.0342,-476.13577 V 592.31164 H 4.820589 V -476.13577 Z"
       id="path496-5"
       style="stroke-width:0.854758" /></g></clipPath><clipPath
   clipPathUnits="userSpaceOnUse"
   id="clipPath500-3"><g
     id="g504-5"><path
       d="M -467.00579,-4.3093969 V 358.96272 h -81.202 V -4.3093969 L -1020.0342,-476.13577 V 592.31164 H 4.820589 V -476.13577 Z"
       id="path502-6"
       style="stroke-width:0.854758" /></g></clipPath>
	
	
	
	
</defs><sodipodi:namedview
   id="namedview328"
   pagecolor="#ffffff"
   bordercolor="#666666"
   borderopacity="1.0"
   inkscape:showpageshadow="2"
   inkscape:pageopacity="0.0"
   inkscape:pagecheckerboard="0"
   inkscape:deskcolor="#d1d1d1"
   showgrid="false"
   inkscape:zoom="1.7810458"
   inkscape:cx="-118.18899"
   inkscape:cy="-37.05688"
   inkscape:window-width="1920"
   inkscape:window-height="1016"
   inkscape:window-x="1366"
   inkscape:window-y="32"
   inkscape:window-maximized="1"
   inkscape:current-layer="layer2" />




<g
   inkscape:groupmode="layer"
   id="layer1"
   inkscape:label="print" /><g
   inkscape:groupmode="layer"
   id="layer2"
   inkscape:label="digital"
   style="display:inline"><g
     id="g613"
     transform="matrix(0.41574507,0,0,0.41574507,152.60637,36.109178)"><g
       id="g606"><path
         display="inline"
         fill="#ffffff"
         d="m -236.32968,106.80788 c 35.801,-5.086 63.324,-35.799998 63.324,-73.096998 0,-22.637 -10.172,-42.881 -26.228,-56.344 l -37.196,37.197 v 92.243998 z"
         id="path661"
         style="fill:#339966;fill-opacity:1;stroke:none" /><path
         display="inline"
         fill="#ffffff"
         d="M -257.17168,106.80788 V 14.563882 l -37.197,-37.197 c -16.056,13.563 -26.227,33.806 -26.227,56.344 0.1,37.196 27.623,68.010998 63.424,73.096998 z"
         id="path663"
         style="fill:#339966;fill-opacity:1;stroke:none" /></g><path
       display="inline"
       fill="#ffffff"
       d="m -182.57868,-30.411118 c 17.152,17.152 26.526,39.889 26.526,64.122 0,24.232 -9.474,46.969 -26.526,64.122 -17.152,17.151998 -39.89,26.525998 -64.122,26.525998 -24.232,0 -46.969,-9.474 -64.122,-26.525998 -17.153,-17.053 -26.526,-39.889 -26.526,-64.122 0,-24.233 9.474,-46.97 26.526,-64.122 1.496,-1.496 2.992,-2.892 4.487,-4.188 l -20.742,-20.742 c -1.496,1.396 -2.992,2.792 -4.488,4.288 -10.969,10.969 -19.646,23.833 -25.729,38.094 -6.283,14.759 -9.474,30.515 -9.474,46.67 0,16.155 3.191,31.911 9.474,46.67 6.083,14.26 14.659,27.124998 25.729,38.093998 10.97,10.97 23.834,19.646 38.094,25.729 14.759,6.283 30.515,9.474 46.67,9.474 16.155,0 31.911,-3.19 46.67,-9.474 14.261,-6.083 27.125,-14.659 38.095,-25.729 10.97,-10.969 19.646,-23.832998 25.729,-38.093998 6.282,-14.759 9.474,-30.516 9.474,-46.67 0,-16.155 -3.191,-31.912 -9.474,-46.67 -6.083,-14.261 -14.659,-27.125 -25.729,-38.094 -1.496,-1.496 -2.992,-2.892 -4.487,-4.288 l -20.743,20.742 c 1.696,1.296 3.192,2.692 4.688,4.188 z"
       id="path665"
       style="fill:#006699;fill-opacity:1;stroke:none" /><circle
       id="red_circle_52_-6"
       display="inline"
       fill="#ffffff"
       cx="-246.7007"
       cy="-49.458134"
       r="37.396"
       style="fill:#990000;fill-opacity:1;stroke:none" /></g></g></svg>
