\babel@toc {spanish}{}
~\hfill \textbf {Pag.}\par 
\contentsline {section}{\numberline {1}Introducción}{1}{section.1}% 
\contentsline {subsection}{\numberline {1.1}Propósito}{1}{subsection.1.1}% 
\contentsline {subsection}{\numberline {1.2}Alcance}{1}{subsection.1.2}% 
\contentsline {subsection}{\numberline {1.3}Estructura del Documento}{1}{subsection.1.3}% 
\contentsline {section}{\numberline {2}Dominio del Problema}{2}{section.2}% 
\contentsline {section}{\numberline {3}Restricciones}{3}{section.3}% 
