\BOOKMARK [1][-]{section.1}{Introducción}{}% 1
\BOOKMARK [2][-]{subsection.1.1}{Propósito}{section.1}% 2
\BOOKMARK [2][-]{subsection.1.2}{Alcance}{section.1}% 3
\BOOKMARK [2][-]{subsection.1.3}{Estructura\040del\040Documento}{section.1}% 4
\BOOKMARK [1][-]{section.2}{Dominio\040del\040Problema}{}% 5
\BOOKMARK [1][-]{section.3}{Restricciones}{}% 6
