# Blender 3.6.4
# www.blender.org
mtllib bataille5.mtl
o Bonhomme
v 0.216645 -0.488337 -0.206342
v 0.216645 0.488337 -0.206342
v 0.216645 -0.488337 0.206342
v 0.216645 0.488337 0.206342
v -0.216645 -0.488337 -0.206342
v -0.216645 0.488337 -0.206342
v -0.216645 -0.488337 0.206342
v -0.216645 0.488337 0.206342
v 0.216645 0.214148 -0.206342
v 0.216645 0.214148 0.206342
v -0.216645 0.214148 0.206342
v -0.216645 0.214148 -0.206342
v 0.216645 0.023013 0.206342
v -0.216645 0.023013 0.206342
v -0.216645 0.023013 -0.206342
v 0.216645 0.023013 -0.206342
v -0.444302 0.214148 0.206342
v -0.444302 0.214148 -0.206342
v -0.444302 0.023013 0.206342
v -0.444302 0.023013 -0.206342
v 0.429991 0.023013 -0.206342
v 0.429991 0.214148 -0.206342
v 0.429991 0.214148 0.206342
v 0.429991 0.023013 0.206342
vn 1.0000 -0.0000 -0.0000
vn -0.0000 -0.0000 1.0000
vn -1.0000 -0.0000 -0.0000
vn -0.0000 -0.0000 -1.0000
vn -0.0000 -1.0000 -0.0000
vn -0.0000 1.0000 -0.0000
vt 0.625000 0.000000
vt 0.554816 0.250000
vt 0.554816 0.000000
vt 0.625000 0.250000
vt 0.554816 0.500000
vt 0.625000 0.500000
vt 0.554816 0.750000
vt 0.625000 0.750000
vt 0.554816 1.000000
vt 0.375000 0.500000
vt 0.125000 0.750000
vt 0.125000 0.500000
vt 0.875000 0.500000
vt 0.464908 1.000000
vt 0.464908 0.750000
vt 0.464908 0.500000
vt 0.464908 0.250000
vt 0.464908 0.000000
vt 0.375000 0.250000
vt 0.375000 0.000000
vt 0.375000 0.750000
vt 0.375000 1.000000
vt 0.625000 1.000000
vt 0.875000 0.750000
s 0
f 2/1/1 10/2/1 9/3/1
f 4/4/2 11/5/2 10/2/2
f 8/6/3 12/7/3 11/5/3
f 6/8/4 9/9/4 12/7/4
f 7/10/5 1/11/5 3/12/5
f 4/13/6 6/8/6 8/6/6
f 12/7/4 16/14/4 15/15/4
f 12/7/6 17/5/6 11/5/6
f 10/2/2 14/16/2 13/17/2
f 16/18/5 24/17/5 13/17/5
f 16/18/1 3/19/1 1/20/1
f 13/17/2 7/10/2 3/19/2
f 14/16/3 5/21/3 7/10/3
f 15/15/4 1/22/4 5/21/4
f 17/5/3 20/15/3 19/16/3
f 14/16/5 20/15/5 15/15/5
f 15/15/4 18/7/4 12/7/4
f 11/5/2 19/16/2 14/16/2
f 22/3/1 24/17/1 21/18/1
f 13/17/2 23/2/2 10/2/2
f 9/9/4 21/14/4 16/14/4
f 10/2/6 22/3/6 9/3/6
f 2/1/1 4/4/1 10/2/1
f 4/4/2 8/6/2 11/5/2
f 8/6/3 6/8/3 12/7/3
f 6/8/4 2/23/4 9/9/4
f 7/10/5 5/21/5 1/11/5
f 4/13/6 2/24/6 6/8/6
f 12/7/4 9/9/4 16/14/4
f 12/7/6 18/7/6 17/5/6
f 10/2/2 11/5/2 14/16/2
f 16/18/5 21/18/5 24/17/5
f 16/18/1 13/17/1 3/19/1
f 13/17/2 14/16/2 7/10/2
f 14/16/3 15/15/3 5/21/3
f 15/15/4 16/14/4 1/22/4
f 17/5/3 18/7/3 20/15/3
f 14/16/5 19/16/5 20/15/5
f 15/15/4 20/15/4 18/7/4
f 11/5/2 17/5/2 19/16/2
f 22/3/1 23/2/1 24/17/1
f 13/17/2 24/17/2 23/2/2
f 9/9/4 22/9/4 21/14/4
f 10/2/6 23/2/6 22/3/6
o Terrain
v 21.073071 1.000000 -21.073071
v 21.073071 1.000000 21.073071
v -21.073071 1.000000 -21.073071
v -21.073071 1.000000 21.073071
v 21.073071 0.200000 -21.073071
v 21.073071 0.400000 -21.073071
v 21.073071 0.600000 -21.073071
v 21.073071 0.800000 -21.073071
v 21.073071 1.000000 -16.858458
v 21.073071 1.000000 -12.643843
v 21.073071 1.000000 -8.429229
v 21.073071 1.000000 -4.214614
v 21.073071 1.000000 0.000000
v 21.073071 1.000000 4.214614
v 21.073071 1.000000 8.429229
v 21.073071 1.000000 12.643843
v 21.073071 1.000000 16.858458
v 21.073071 0.800000 21.073071
v 21.073071 0.600000 21.073071
v 21.073071 0.400000 21.073071
v 21.073071 0.200000 21.073071
v 16.858458 1.000000 21.073071
v 12.643843 1.000000 21.073071
v 8.429229 1.000000 21.073071
v 4.214614 1.000000 21.073071
v 0.000000 1.000000 21.073071
v -4.214614 1.000000 21.073071
v -8.429229 1.000000 21.073071
v -12.643843 1.000000 21.073071
v -16.858458 1.000000 21.073071
v -21.073071 0.800000 21.073071
v -21.073071 0.600000 21.073071
v -21.073071 0.400000 21.073071
v -21.073071 0.200000 21.073071
v -21.073071 1.000000 16.858458
v -21.073071 1.000000 12.643843
v -21.073071 1.000000 8.429229
v -21.073071 1.000000 4.214614
v -21.073071 1.000000 0.000000
v -21.073071 1.000000 -4.214614
v -21.073071 1.000000 -8.429229
v -21.073071 1.000000 -12.643843
v -21.073071 1.000000 -16.858458
v -21.073071 0.800000 -21.073071
v -21.073071 0.600000 -21.073071
v -21.073071 0.400000 -21.073071
v -21.073071 0.200000 -21.073071
v -16.858458 1.000000 -21.073071
v -12.643843 1.000000 -21.073071
v -8.429229 1.000000 -21.073071
v -4.214614 1.000000 -21.073071
v 0.000000 1.000000 -21.073071
v 4.214614 1.000000 -21.073071
v 8.429229 1.000000 -21.073071
v 12.643843 1.000000 -21.073071
v 16.858458 1.000000 -21.073071
v -16.858458 1.000000 16.858458
v -16.858458 1.000000 12.643843
v -16.858458 1.000000 8.429229
v -16.858458 1.000000 4.214614
v -16.858458 1.000000 0.000000
v -16.858458 1.000000 -4.214614
v -16.858458 1.000000 -8.429229
v -16.858458 1.000000 -12.643843
v -16.858458 1.000000 -16.858458
v -9.912647 8.943522 15.375038
v -9.912647 8.943522 14.127261
v -12.643843 1.000000 8.429229
v -12.643843 1.000000 4.214614
v -12.643843 1.000000 0.000000
v -12.643843 1.000000 -4.214614
v -12.643843 1.000000 -8.429229
v -12.643843 1.000000 -12.643843
v -12.643843 1.000000 -16.858458
v -11.160424 8.943522 14.127261
v -11.160424 8.943522 15.375038
v -8.429229 1.000000 8.429229
v -8.429229 1.000000 4.214614
v -8.429229 1.000000 0.000000
v -8.429229 1.000000 -4.214614
v -8.429229 1.000000 -8.429229
v -8.429229 1.000000 -12.643843
v -8.429229 1.000000 -16.858458
v -4.214614 1.000000 16.858458
v -4.214614 1.000000 12.643843
v -4.214614 1.000000 8.429229
v -4.214614 1.000000 4.214614
v -4.214614 1.000000 0.000000
v -4.214614 1.000000 -4.214614
v -4.214614 1.000000 -8.429229
v -4.214614 1.000000 -12.643843
v -4.214614 1.000000 -16.858458
v 0.000000 1.000000 16.858458
v 0.000000 1.000000 12.643843
v 0.000000 1.000000 8.429229
v 0.000000 1.000000 4.214614
v 0.000000 1.000000 0.000000
v 0.000000 1.000000 -4.214614
v 0.000000 1.000000 -8.429229
v 0.000000 1.000000 -12.643843
v 0.000000 1.000000 -16.858458
v 4.214614 1.000000 16.858458
v 4.214614 1.000000 12.643843
v 4.214614 1.000000 8.429229
v 4.214614 1.000000 4.214614
v 4.214614 1.000000 0.000000
v 4.214614 1.000000 -4.214614
v 4.214614 1.000000 -8.429229
v 4.214614 1.000000 -12.643843
v 4.214614 1.000000 -16.858458
v 8.429229 1.000000 16.858458
v 8.429229 1.000000 12.643843
v 8.429229 1.000000 8.429229
v 8.429229 1.000000 4.214614
v 8.429229 1.000000 0.000000
v 8.429229 1.000000 -4.214614
v 8.429229 1.000000 -8.429229
v 8.429229 1.000000 -12.643843
v 8.429229 1.000000 -16.858458
v 12.643843 1.000000 16.858458
v 12.643843 1.000000 8.429229
v 12.643843 1.000000 4.214614
v 12.643843 1.000000 0.000000
v 12.643843 1.000000 -4.214614
v 12.643843 1.000000 -8.429229
v 12.643843 1.000000 -12.643843
v 12.643843 1.000000 -16.858458
v 16.858458 1.000000 16.858458
v 16.858458 1.000000 12.643843
v 16.858458 1.000000 8.429229
v 16.858458 1.000000 4.214614
v 16.858458 1.000000 0.000000
v 16.858458 1.000000 -4.214614
v 16.858458 1.000000 -8.429229
v 16.858458 1.000000 -12.643843
v 16.858458 1.000000 -16.858458
v -16.858458 0.200000 -21.073071
v -12.643843 0.200000 -21.073071
v -8.429229 0.200000 -21.073071
v -4.214614 0.200000 -21.073071
v 0.000000 0.200000 -21.073071
v 4.214614 0.200000 -21.073071
v 8.429229 0.200000 -21.073071
v 12.643843 0.200000 -21.073071
v 16.858458 0.200000 -21.073071
v -16.858458 0.400000 -21.073071
v -12.643843 0.400000 -21.073071
v -8.429229 0.400000 -21.073071
v -4.214614 0.400000 -21.073071
v 0.000000 0.400000 -21.073071
v 4.214614 0.400000 -21.073071
v 8.429229 0.400000 -21.073071
v 12.643843 0.400000 -21.073071
v 16.858458 0.400000 -21.073071
v -16.858458 0.600000 -21.073071
v -12.643843 0.600000 -21.073071
v -8.429229 0.600000 -21.073071
v -4.214614 0.600000 -21.073071
v 0.000000 0.600000 -21.073071
v 4.214614 0.600000 -21.073071
v 8.429229 0.600000 -21.073071
v 12.643843 0.600000 -21.073071
v 16.858458 0.600000 -21.073071
v -16.858458 0.800000 -21.073071
v -12.643843 0.800000 -21.073071
v -8.429229 0.800000 -21.073071
v -4.214614 0.800000 -21.073071
v 0.000000 0.800000 -21.073071
v 4.214614 0.800000 -21.073071
v 8.429229 0.800000 -21.073071
v 12.643843 0.800000 -21.073071
v 16.858458 0.800000 -21.073071
v -21.073071 0.200000 16.858458
v -21.073071 0.200000 12.643843
v -21.073071 0.200000 8.429229
v -21.073071 0.200000 4.214614
v -21.073071 0.200000 0.000000
v -21.073071 0.200000 -4.214614
v -21.073071 0.200000 -8.429229
v -21.073071 0.200000 -12.643843
v -21.073071 0.200000 -16.858458
v -21.073071 0.400000 16.858458
v -21.073071 0.400000 12.643843
v -21.073071 0.400000 8.429229
v -21.073071 0.400000 4.214614
v -21.073071 0.400000 0.000000
v -21.073071 0.400000 -4.214614
v -21.073071 0.400000 -8.429229
v -21.073071 0.400000 -12.643843
v -21.073071 0.400000 -16.858458
v -21.073071 0.600000 16.858458
v -21.073071 0.600000 12.643843
v -21.073071 0.600000 8.429229
v -21.073071 0.600000 4.214614
v -21.073071 0.600000 0.000000
v -21.073071 0.600000 -4.214614
v -21.073071 0.600000 -8.429229
v -21.073071 0.600000 -12.643843
v -21.073071 0.600000 -16.858458
v -21.073071 0.800000 16.858458
v -21.073071 0.800000 12.643843
v -21.073071 0.800000 8.429229
v -21.073071 0.800000 4.214614
v -21.073071 0.800000 0.000000
v -21.073071 0.800000 -4.214614
v -21.073071 0.800000 -8.429229
v -21.073071 0.800000 -12.643843
v -21.073071 0.800000 -16.858458
v 16.858458 0.200000 21.073071
v 12.643843 0.200000 21.073071
v 8.429229 0.200000 21.073071
v 4.214614 0.200000 21.073071
v 0.000000 0.200000 21.073071
v -4.214614 0.200000 21.073071
v -8.429229 0.200000 21.073071
v -12.643843 0.200000 21.073071
v -16.858458 0.200000 21.073071
v 16.858458 0.400000 21.073071
v 12.643843 0.400000 21.073071
v 8.429229 0.400000 21.073071
v 4.214614 0.400000 21.073071
v 0.000000 0.400000 21.073071
v -4.214614 0.400000 21.073071
v -8.429229 0.400000 21.073071
v -12.643843 0.400000 21.073071
v -16.858458 0.400000 21.073071
v -16.858458 0.400000 54.929157
v -21.073071 0.400000 54.929157
v -21.073071 0.600000 54.929157
v -21.073071 0.800000 54.929157
v -12.643843 1.000000 54.929157
v -8.429229 1.000000 54.929157
v -4.214614 1.000000 54.929157
v 0.000000 1.000000 54.929157
v 4.214614 1.000000 54.929157
v 8.429229 1.000000 54.929157
v 12.643843 1.000000 54.929157
v 16.858458 1.000000 54.929157
v 21.073071 0.400000 54.929157
v 21.073071 0.600000 54.929157
v 21.073071 0.800000 54.929157
v 21.073071 1.000000 54.929157
v -21.073071 1.000000 54.929157
v -16.858458 1.000000 54.929157
v 21.073071 0.200000 -16.858458
v 21.073071 0.200000 -12.643843
v 21.073071 0.200000 -8.429229
v 21.073071 0.200000 -4.214614
v 21.073071 0.200000 0.000000
v 21.073071 0.200000 4.214614
v 21.073071 0.200000 8.429229
v 21.073071 0.200000 12.643843
v 21.073071 0.200000 16.858458
v 21.073071 0.400000 -16.858458
v 21.073071 0.400000 -12.643843
v 21.073071 0.400000 -8.429229
v 21.073071 0.400000 -4.214614
v 21.073071 0.400000 0.000000
v 21.073071 0.400000 4.214614
v 21.073071 0.400000 8.429229
v 21.073071 0.400000 12.643843
v 21.073071 0.400000 16.858458
v 21.073071 0.600000 -16.858458
v 21.073071 0.600000 -12.643843
v 21.073071 0.600000 -8.429229
v 21.073071 0.600000 -4.214614
v 21.073071 0.600000 0.000000
v 21.073071 0.600000 4.214614
v 21.073071 0.600000 8.429229
v 21.073071 0.600000 12.643843
v 21.073071 0.600000 16.858458
v 21.073071 0.800000 -16.858458
v 21.073071 0.800000 -12.643843
v 21.073071 0.800000 -8.429229
v 21.073071 0.800000 -4.214614
v 21.073071 0.800000 0.000000
v 21.073071 0.800000 4.214614
v 21.073071 0.800000 8.429229
v 21.073071 0.800000 12.643843
v 21.073071 0.800000 16.858458
v 21.073071 2.802306 12.643843
v 21.073071 2.802306 16.858458
v 8.429229 2.802306 16.858458
v 8.429229 2.802306 12.643843
v 8.429229 2.802306 8.429229
v 12.643843 2.802306 16.858458
v 12.643843 2.802306 12.643843
v 12.643843 2.802306 8.429229
v 16.858458 2.802306 16.858458
v 16.858458 2.802306 12.643843
v 16.858458 2.802306 8.429229
v -12.643843 1.000000 16.858458
v -12.643843 1.000000 12.643843
v -8.429229 1.000000 16.858458
v -8.429229 1.000000 12.643843
v -12.643843 1.000000 16.858458
v -11.160424 1.000000 15.375038
v -11.160424 1.000000 14.127261
v -12.643843 1.000000 12.643843
v -9.912647 1.000000 15.375038
v -8.429229 1.000000 16.858458
v -8.429229 1.000000 12.643843
v -9.912647 1.000000 14.127261
v -9.912647 11.305190 15.375038
v -11.160424 11.305190 15.375038
v -11.160424 11.305190 14.127261
v -9.912647 11.305190 14.127261
v -11.160424 8.943522 7.937326
v -9.912647 8.943522 7.937326
v -11.160424 11.305190 7.937326
v -9.912647 11.305190 7.937326
v -9.912647 8.943522 22.359108
v -11.160424 8.943522 22.359108
v -9.912647 11.305190 22.359108
v -11.160424 11.305190 22.359108
v -4.120488 8.943522 14.127261
v -4.120488 8.943522 15.375038
v -4.120488 11.305190 14.127261
v -4.120488 11.305190 15.375038
v -4.120488 8.943522 7.937326
v -4.120488 11.305190 7.937326
v -4.120488 11.305190 22.359108
v -4.120488 8.943522 22.359108
v -18.864418 8.943522 15.375038
v -18.864418 8.943522 14.127261
v -18.864418 11.305190 15.375038
v -18.864418 11.305190 14.127261
v -18.864418 8.943522 7.937326
v -18.864418 11.305190 7.937326
v -18.864418 11.305190 22.359108
v -18.864418 8.943522 22.359108
v -16.858458 1.000000 39.384041
v -21.073071 1.000000 39.384041
v 21.073071 1.000000 39.384041
v 21.073071 0.800000 39.384041
v 21.073071 0.600000 39.384041
v 21.073071 0.400000 39.384041
v 16.858458 1.000000 39.384041
v 12.643843 1.000000 39.384041
v 8.429229 1.000000 39.384041
v 4.214614 1.000000 39.384041
v 0.000000 1.000000 39.384041
v -4.214614 1.000000 39.384041
v -8.429229 1.000000 39.384041
v -12.643843 1.000000 39.384041
v -21.073071 0.800000 39.384041
v -21.073071 0.600000 39.384041
v -21.073071 0.400000 39.384041
v -16.858458 0.400000 39.384041
v 16.858458 0.400000 39.384041
v 12.643843 0.400000 39.384041
v 8.429229 0.400000 39.384041
v 4.214614 0.400000 39.384041
v 0.000000 0.400000 39.384041
v -4.214614 0.400000 39.384041
v -8.429229 0.400000 39.384041
v -12.643843 0.400000 39.384041
v 12.643843 6.821480 67.858223
v 8.429229 5.236243 67.858223
v 4.214614 3.707340 67.858223
v 0.000000 2.548029 67.858223
v -4.214614 1.641305 67.858223
v -8.429229 1.000000 67.858223
v 4.214614 3.707340 70.293358
v 8.429229 5.236243 70.293358
v -21.073071 1.000000 67.858223
v -21.073071 0.800000 67.858223
v -21.073071 0.600000 67.858223
v -21.073071 0.400000 67.858223
v -16.858458 0.400000 67.858223
v 21.073071 0.400000 67.858223
v 16.858458 0.400000 67.858223
v 12.643843 0.400000 67.858223
v 4.214614 0.400000 67.858223
v 8.429229 0.400000 67.858223
v 16.858458 0.400000 54.929157
v 12.643843 0.400000 54.929157
v 8.429229 0.400000 54.929157
v 4.214614 0.400000 54.929157
v 0.000000 0.400000 54.929157
v -4.214614 0.400000 54.929157
v -8.429229 0.400000 54.929157
v -12.643843 0.400000 54.929157
v 12.643843 5.902404 39.384041
v 16.858458 5.902404 39.384041
v 21.073071 5.902404 39.384041
v 21.073071 5.902404 54.929157
v 16.858458 5.902404 54.929157
v 12.643843 5.902404 54.929157
v 4.214614 5.902404 54.929157
v 8.429229 5.902404 54.929157
v -12.643843 4.545448 39.384041
v -8.429229 4.545448 39.384041
v -4.214614 4.545448 39.384041
v -21.073071 4.545448 39.384041
v -16.858458 4.545448 39.384041
v -21.073071 4.545448 54.929157
v -4.214614 4.545448 54.929157
v -8.429229 4.545448 54.929157
v -16.858458 4.545448 54.929157
v -12.643843 4.545448 54.929157
v 16.858458 9.877115 67.858223
v 21.073071 1.000000 67.858223
v 21.073071 0.600000 67.858223
v 21.073071 0.800000 67.858223
v 0.000000 0.400000 67.858223
v -4.214614 0.400000 67.858223
v -8.429229 0.400000 67.858223
v -12.643843 0.400000 67.858223
v -16.858458 0.800000 67.858223
v -8.429229 0.800000 67.858223
v -12.643843 0.800000 67.858223
v 8.429229 5.902404 39.384041
v 4.214614 5.902404 39.384041
v 0.000000 1.000000 65.684921
v -4.214614 1.000000 65.684921
v -8.429229 1.000000 65.684921
v 21.073071 1.000000 65.684921
v 12.643843 6.821480 70.293358
v 16.858458 9.877115 70.293358
v 16.858458 1.000000 65.684921
v -21.073071 1.000000 65.684921
v 12.643843 1.000000 65.684921
v 8.429229 1.000000 65.684921
v 4.214614 1.000000 65.684921
v 21.073071 14.009066 67.858223
v 16.858458 14.009066 67.858223
v 12.643843 14.009066 67.858223
v 8.429229 14.009066 67.858223
v 4.214614 14.009066 67.858223
v 0.000000 14.009066 67.858223
v -4.214614 14.009066 67.858223
v -8.429229 14.009066 67.858223
v 21.073071 0.400000 70.293358
v 21.073071 0.600000 70.293358
v 21.073071 0.800000 70.293358
v 4.214614 14.009066 65.684921
v 0.000000 14.009066 65.684921
v -4.214614 14.009066 65.684921
v -8.429229 14.009066 65.684921
v 21.073071 14.009066 65.684921
v 21.073071 1.000000 70.293358
v 16.858458 14.009066 65.684921
v 12.643843 14.009066 65.684921
v 8.429229 14.009066 65.684921
v 0.000000 2.548029 70.293358
v -4.214614 1.641305 70.293358
v -8.429229 1.000000 70.293358
v -21.073071 0.800000 70.293358
v -21.073071 0.600000 70.293358
v -21.073071 0.400000 70.293358
v -16.858458 0.400000 70.293358
v 16.858458 0.400000 70.293358
v 12.643843 0.400000 70.293358
v 8.429229 0.400000 70.293358
v 4.214614 0.400000 70.293358
v 0.000000 0.400000 70.293358
v -4.214614 0.400000 70.293358
v -8.429229 0.400000 70.293358
v -12.643843 0.400000 70.293358
v -16.858458 0.600000 70.293358
v 16.858458 0.600000 70.293358
v 12.643843 0.600000 70.293358
v 8.429229 0.600000 70.293358
v 4.214614 0.600000 70.293358
v 0.000000 0.600000 70.293358
v -4.214614 0.600000 70.293358
v -8.429229 0.600000 70.293358
v -12.643843 0.600000 70.293358
v -16.858458 0.800000 70.293358
v 16.858458 0.800000 70.293358
v 12.643843 0.800000 70.293358
v 8.429229 0.800000 70.293358
v 4.214614 0.800000 70.293358
v 0.000000 0.800000 70.293358
v -4.214614 0.800000 70.293358
v -8.429229 0.800000 70.293358
v -12.643843 0.800000 70.293358
vn 1.0000 -0.0000 -0.0000
vn -0.0000 1.0000 -0.0000
vn -1.0000 -0.0000 -0.0000
vn -0.0000 -0.0000 -1.0000
vn -0.0000 -0.0000 1.0000
vn -0.0000 -1.0000 -0.0000
vn 0.9034 0.4289 -0.0000
vn -0.1504 0.9886 -0.0000
vn -0.2103 0.9776 -0.0000
vn -0.2652 0.9642 -0.0000
vn -0.3410 0.9401 -0.0000
vn -0.3520 0.9360 -0.0000
vn -0.5870 0.8096 -0.0000
vn 0.0235 0.9903 0.1367
vn -0.0474 0.9989 -0.0000
vt 0.625000 0.225000
vt 0.600000 0.250000
vt 0.600000 0.225000
vt 0.625000 0.500000
vt 0.650000 0.500000
vt 0.625000 0.725000
vt 0.600000 0.750000
vt 0.600000 0.725000
vt 0.625000 0.975000
vt 0.600000 1.000000
vt 0.600000 0.975000
vt 0.875000 0.725000
vt 0.850000 0.750000
vt 0.850000 0.725000
vt 0.650000 0.725000
vt 0.625000 0.750000
vt 0.675000 0.725000
vt 0.650000 0.750000
vt 0.700000 0.725000
vt 0.675000 0.750000
vt 0.725000 0.725000
vt 0.700000 0.750000
vt 0.750000 0.725000
vt 0.725000 0.750000
vt 0.775000 0.725000
vt 0.750000 0.750000
vt 0.800000 0.750000
vt 0.775000 0.750000
vt 0.825000 0.725000
vt 0.800000 0.725000
vt 0.825000 0.750000
vt 0.625000 0.525000
vt 0.650000 0.525000
vt 0.625000 0.550000
vt 0.650000 0.550000
vt 0.625000 0.575000
vt 0.650000 0.575000
vt 0.625000 0.600000
vt 0.650000 0.600000
vt 0.625000 0.625000
vt 0.650000 0.625000
vt 0.625000 0.650000
vt 0.650000 0.650000
vt 0.625000 0.675000
vt 0.650000 0.675000
vt 0.625000 0.700000
vt 0.650000 0.700000
vt 0.675000 0.500000
vt 0.675000 0.525000
vt 0.675000 0.550000
vt 0.675000 0.575000
vt 0.675000 0.600000
vt 0.675000 0.625000
vt 0.675000 0.650000
vt 0.675000 0.675000
vt 0.675000 0.700000
vt 0.700000 0.500000
vt 0.700000 0.525000
vt 0.700000 0.550000
vt 0.700000 0.575000
vt 0.700000 0.600000
vt 0.700000 0.625000
vt 0.700000 0.650000
vt 0.700000 0.675000
vt 0.700000 0.700000
vt 0.725000 0.500000
vt 0.725000 0.525000
vt 0.725000 0.550000
vt 0.725000 0.575000
vt 0.725000 0.600000
vt 0.725000 0.625000
vt 0.725000 0.650000
vt 0.725000 0.675000
vt 0.750000 0.500000
vt 0.750000 0.525000
vt 0.750000 0.550000
vt 0.750000 0.575000
vt 0.750000 0.600000
vt 0.750000 0.625000
vt 0.750000 0.650000
vt 0.750000 0.675000
vt 0.725000 0.700000
vt 0.750000 0.700000
vt 0.775000 0.500000
vt 0.775000 0.525000
vt 0.775000 0.550000
vt 0.775000 0.575000
vt 0.775000 0.600000
vt 0.775000 0.625000
vt 0.775000 0.650000
vt 0.775000 0.675000
vt 0.775000 0.700000
vt 0.800000 0.500000
vt 0.800000 0.525000
vt 0.800000 0.550000
vt 0.800000 0.575000
vt 0.800000 0.600000
vt 0.800000 0.625000
vt 0.800000 0.650000
vt 0.800000 0.675000
vt 0.800000 0.700000
vt 0.825000 0.500000
vt 0.850000 0.575000
vt 0.850000 0.550000
vt 0.825000 0.575000
vt 0.825000 0.600000
vt 0.825000 0.625000
vt 0.825000 0.650000
vt 0.825000 0.675000
vt 0.825000 0.700000
vt 0.850000 0.500000
vt 0.825000 0.525000
vt 0.875000 0.525000
vt 0.850000 0.525000
vt 0.850000 0.600000
vt 0.850000 0.625000
vt 0.850000 0.650000
vt 0.850000 0.675000
vt 0.850000 0.700000
vt 0.875000 0.500000
vt 0.875000 0.550000
vt 0.875000 0.575000
vt 0.875000 0.600000
vt 0.875000 0.625000
vt 0.875000 0.650000
vt 0.875000 0.675000
vt 0.875000 0.700000
vt 0.525000 0.975000
vt 0.550000 1.000000
vt 0.525000 1.000000
vt 0.575000 0.975000
vt 0.550000 0.975000
vt 0.575000 1.000000
vt 0.550000 0.750000
vt 0.525000 0.775000
vt 0.525000 0.750000
vt 0.550000 0.775000
vt 0.525000 0.800000
vt 0.550000 0.800000
vt 0.525000 0.825000
vt 0.550000 0.825000
vt 0.525000 0.850000
vt 0.550000 0.850000
vt 0.525000 0.875000
vt 0.550000 0.875000
vt 0.525000 0.900000
vt 0.550000 0.900000
vt 0.525000 0.925000
vt 0.550000 0.925000
vt 0.525000 0.950000
vt 0.550000 0.950000
vt 0.575000 0.750000
vt 0.575000 0.775000
vt 0.575000 0.800000
vt 0.575000 0.825000
vt 0.575000 0.850000
vt 0.575000 0.875000
vt 0.575000 0.900000
vt 0.575000 0.925000
vt 0.575000 0.950000
vt 0.600000 0.775000
vt 0.600000 0.800000
vt 0.600000 0.825000
vt 0.600000 0.850000
vt 0.600000 0.875000
vt 0.600000 0.900000
vt 0.600000 0.925000
vt 0.600000 0.950000
vt 0.625000 0.775000
vt 0.625000 0.800000
vt 0.625000 0.825000
vt 0.625000 0.850000
vt 0.625000 0.875000
vt 0.625000 0.900000
vt 0.625000 0.925000
vt 0.625000 0.950000
vt 0.550000 0.725000
vt 0.525000 0.725000
vt 0.575000 0.725000
vt 0.550000 0.500000
vt 0.525000 0.525000
vt 0.525000 0.500000
vt 0.550000 0.525000
vt 0.525000 0.550000
vt 0.550000 0.550000
vt 0.525000 0.575000
vt 0.550000 0.575000
vt 0.525000 0.600000
vt 0.550000 0.600000
vt 0.525000 0.625000
vt 0.550000 0.625000
vt 0.525000 0.650000
vt 0.550000 0.650000
vt 0.525000 0.675000
vt 0.550000 0.675000
vt 0.525000 0.700000
vt 0.550000 0.700000
vt 0.575000 0.500000
vt 0.575000 0.525000
vt 0.575000 0.550000
vt 0.575000 0.575000
vt 0.575000 0.600000
vt 0.575000 0.625000
vt 0.575000 0.650000
vt 0.575000 0.675000
vt 0.575000 0.700000
vt 0.600000 0.500000
vt 0.600000 0.525000
vt 0.600000 0.550000
vt 0.600000 0.575000
vt 0.600000 0.600000
vt 0.600000 0.625000
vt 0.600000 0.650000
vt 0.600000 0.675000
vt 0.600000 0.700000
vt 0.550000 0.475000
vt 0.525000 0.475000
vt 0.550000 0.250000
vt 0.525000 0.275000
vt 0.525000 0.250000
vt 0.550000 0.275000
vt 0.525000 0.300000
vt 0.550000 0.300000
vt 0.525000 0.325000
vt 0.550000 0.325000
vt 0.525000 0.350000
vt 0.550000 0.350000
vt 0.525000 0.375000
vt 0.550000 0.375000
vt 0.525000 0.400000
vt 0.550000 0.400000
vt 0.525000 0.425000
vt 0.550000 0.425000
vt 0.525000 0.450000
vt 0.550000 0.450000
vt 0.575000 0.250000
vt 0.625000 0.250000
vt 0.550000 0.225000
vt 0.525000 0.225000
vt 0.575000 0.225000
vt 0.550000 0.000000
vt 0.525000 0.025000
vt 0.525000 0.000000
vt 0.550000 0.025000
vt 0.525000 0.050000
vt 0.550000 0.050000
vt 0.525000 0.075000
vt 0.550000 0.075000
vt 0.525000 0.100000
vt 0.550000 0.100000
vt 0.525000 0.125000
vt 0.550000 0.125000
vt 0.525000 0.150000
vt 0.550000 0.150000
vt 0.525000 0.175000
vt 0.550000 0.175000
vt 0.525000 0.200000
vt 0.550000 0.200000
vt 0.575000 0.000000
vt 0.575000 0.025000
vt 0.575000 0.050000
vt 0.575000 0.075000
vt 0.575000 0.100000
vt 0.575000 0.125000
vt 0.575000 0.150000
vt 0.575000 0.175000
vt 0.575000 0.200000
vt 0.600000 0.000000
vt 0.600000 0.025000
vt 0.600000 0.050000
vt 0.600000 0.075000
vt 0.600000 0.100000
vt 0.600000 0.125000
vt 0.600000 0.150000
vt 0.600000 0.175000
vt 0.600000 0.200000
vt 0.625000 0.000000
vt 0.625000 0.025000
vt 0.625000 0.050000
vt 0.625000 0.075000
vt 0.625000 0.100000
vt 0.625000 0.125000
vt 0.625000 0.150000
vt 0.625000 0.175000
vt 0.625000 0.200000
vt 0.825000 0.550000
vt 0.683799 0.533799
vt 0.683799 0.541201
vt 0.691201 0.541201
vt 0.691201 0.533799
vt 0.575000 0.400000
vt 0.600000 0.475000
vt 0.600000 0.450000
vt 0.625000 0.275000
vt 0.625000 0.300000
vt 0.575000 0.450000
vt 0.600000 0.300000
vt 0.575000 0.325000
vt 0.575000 0.300000
vt 0.575000 0.475000
vt 0.600000 0.425000
vt 0.625000 0.425000
vt 0.625000 0.400000
vt 0.625000 0.375000
vt 0.625000 0.350000
vt 0.625000 0.325000
vt 0.575000 0.425000
vt 0.600000 0.275000
vt 0.575000 0.275000
vt 0.575000 0.375000
vt 0.575000 0.350000
vt 0.600000 0.325000
vt 0.600000 0.350000
vt 0.600000 0.375000
vt 0.600000 0.400000
vt 0.625000 1.000000
vt 0.875000 0.750000
s 0
f 41/25/7 42/26/7 304/27/7
f 419/28/8 424/29/8 420/29/8
f 67/30/9 68/31/9 232/32/9
f 80/33/10 32/34/10 196/35/10
f 33/36/8 80/37/8 160/38/8
f 89/39/8 27/40/8 67/30/8
f 98/41/8 72/42/8 89/39/8
f 107/43/8 73/44/8 98/41/8
f 116/45/8 74/46/8 107/43/8
f 125/47/8 75/48/8 116/45/8
f 134/49/8 76/50/8 125/47/8
f 134/49/8 78/51/8 77/52/8
f 151/53/8 78/51/8 143/54/8
f 160/38/8 79/55/8 151/53/8
f 54/29/8 59/56/8 28/28/8
f 81/57/8 60/58/8 59/56/8
f 82/59/8 61/60/8 60/58/8
f 83/61/8 62/62/8 61/60/8
f 84/63/8 63/64/8 62/62/8
f 85/65/8 64/66/8 63/64/8
f 86/67/8 65/68/8 64/66/8
f 87/69/8 66/70/8 65/68/8
f 88/71/8 67/30/8 66/70/8
f 53/72/8 81/57/8 54/29/8
f 316/73/8 82/59/8 81/57/8
f 317/74/8 83/61/8 82/59/8
f 92/75/8 84/63/8 83/61/8
f 93/76/8 85/65/8 84/63/8
f 94/77/8 86/67/8 85/65/8
f 95/78/8 87/69/8 86/67/8
f 96/79/8 88/71/8 87/69/8
f 97/80/8 89/39/8 88/71/8
f 52/81/8 316/73/8 53/72/8
f 325/82/8 316/73/8 318/82/8
f 319/83/8 92/75/8 317/74/8
f 101/84/8 93/76/8 92/75/8
f 102/85/8 94/77/8 93/76/8
f 103/86/8 95/78/8 94/77/8
f 104/87/8 96/79/8 95/78/8
f 105/88/8 97/80/8 96/79/8
f 106/89/8 98/41/8 97/80/8
f 51/90/8 318/82/8 52/81/8
f 108/91/8 319/83/8 318/82/8
f 109/92/8 101/84/8 319/83/8
f 110/93/8 102/85/8 101/84/8
f 111/94/8 103/86/8 102/85/8
f 112/95/8 104/87/8 103/86/8
f 113/96/8 105/88/8 104/87/8
f 114/97/8 106/89/8 105/88/8
f 106/89/8 116/45/8 107/43/8
f 50/98/8 108/91/8 51/90/8
f 117/99/8 109/92/8 108/91/8
f 118/100/8 110/93/8 109/92/8
f 119/101/8 111/94/8 110/93/8
f 120/102/8 112/95/8 111/94/8
f 121/103/8 113/96/8 112/95/8
f 122/104/8 114/97/8 113/96/8
f 123/105/8 115/106/8 114/97/8
f 124/107/8 116/45/8 115/106/8
f 49/108/8 117/99/8 50/98/8
f 126/109/8 118/100/8 117/99/8
f 127/110/8 119/101/8 118/100/8
f 128/111/8 120/102/8 119/101/8
f 129/112/8 121/103/8 120/102/8
f 130/113/8 122/104/8 121/103/8
f 131/114/8 123/105/8 122/104/8
f 132/115/8 124/107/8 123/105/8
f 133/116/8 125/47/8 124/107/8
f 48/117/8 126/109/8 49/108/8
f 135/118/8 127/110/8 126/109/8
f 136/119/8 128/111/8 127/110/8
f 137/120/8 129/112/8 128/111/8
f 138/121/8 130/113/8 129/112/8
f 139/122/8 131/114/8 130/113/8
f 140/123/8 132/115/8 131/114/8
f 141/124/8 133/116/8 132/115/8
f 142/125/8 134/49/8 133/116/8
f 47/126/8 135/118/8 48/117/8
f 136/119/9 309/120/9 137/120/9
f 154/127/7 314/128/7 153/128/7
f 145/129/8 138/121/8 137/120/8
f 146/130/8 139/122/8 138/121/8
f 147/131/8 140/123/8 139/122/8
f 148/132/8 141/124/8 140/123/8
f 149/133/8 142/125/8 141/124/8
f 150/134/8 143/54/8 142/125/8
f 46/135/8 144/136/8 47/126/8
f 41/137/11 313/138/11 152/138/11
f 145/129/10 315/127/10 154/127/10
f 154/127/8 146/130/8 145/129/8
f 155/139/8 147/131/8 146/130/8
f 156/140/8 148/132/8 147/131/8
f 157/141/8 149/133/8 148/132/8
f 158/142/8 150/134/8 149/133/8
f 159/143/8 151/53/8 150/134/8
f 26/144/8 152/138/8 46/135/8
f 135/118/9 308/119/9 136/119/9
f 40/145/8 154/127/8 153/128/8
f 39/146/8 155/139/8 154/127/8
f 38/147/8 156/140/8 155/139/8
f 37/148/8 157/141/8 156/140/8
f 36/149/8 158/142/8 157/141/8
f 35/150/8 159/143/8 158/142/8
f 34/151/8 160/38/8 159/143/8
f 169/152/10 30/153/10 29/154/10
f 187/155/10 30/153/10 178/156/10
f 196/35/10 31/157/10 187/155/10
f 70/158/10 161/159/10 71/160/10
f 170/161/10 162/162/10 161/159/10
f 171/163/10 163/164/10 162/162/10
f 172/165/10 164/166/10 163/164/10
f 173/167/10 165/168/10 164/166/10
f 174/169/10 166/170/10 165/168/10
f 175/171/10 167/172/10 166/170/10
f 176/173/10 168/174/10 167/172/10
f 177/175/10 169/152/10 168/174/10
f 69/176/10 170/161/10 70/158/10
f 179/177/10 171/163/10 170/161/10
f 180/178/10 172/165/10 171/163/10
f 181/179/10 173/167/10 172/165/10
f 182/180/10 174/169/10 173/167/10
f 183/181/10 175/171/10 174/169/10
f 184/182/10 176/173/10 175/171/10
f 185/183/10 177/175/10 176/173/10
f 186/184/10 178/156/10 177/175/10
f 68/31/10 179/177/10 69/176/10
f 188/185/10 180/178/10 179/177/10
f 189/186/10 181/179/10 180/178/10
f 190/187/10 182/180/10 181/179/10
f 191/188/10 183/181/10 182/180/10
f 192/189/10 184/182/10 183/181/10
f 193/190/10 185/183/10 184/182/10
f 194/191/10 186/184/10 185/183/10
f 195/192/10 187/155/10 186/184/10
f 27/40/10 188/185/10 68/31/10
f 72/193/10 189/186/10 188/185/10
f 73/194/10 190/187/10 189/186/10
f 74/195/10 191/188/10 190/187/10
f 75/196/10 192/189/10 191/188/10
f 76/197/10 193/190/10 192/189/10
f 77/198/10 194/191/10 193/190/10
f 78/199/10 195/192/10 194/191/10
f 79/200/10 196/35/10 195/192/10
f 214/201/9 71/160/9 205/202/9
f 223/203/9 70/158/9 214/201/9
f 232/32/9 69/176/9 223/203/9
f 57/204/9 197/205/9 58/206/9
f 206/207/9 198/208/9 197/205/9
f 207/209/9 199/210/9 198/208/9
f 208/211/9 200/212/9 199/210/9
f 209/213/9 201/214/9 200/212/9
f 210/215/9 202/216/9 201/214/9
f 211/217/9 203/218/9 202/216/9
f 212/219/9 204/220/9 203/218/9
f 213/221/9 205/202/9 204/220/9
f 56/222/9 206/207/9 57/204/9
f 215/223/9 207/209/9 206/207/9
f 216/224/9 208/211/9 207/209/9
f 217/225/9 209/213/9 208/211/9
f 218/226/9 210/215/9 209/213/9
f 219/227/9 211/217/9 210/215/9
f 220/228/9 212/219/9 211/217/9
f 221/229/9 213/221/9 212/219/9
f 222/230/9 214/201/9 213/221/9
f 55/231/9 215/223/9 56/222/9
f 224/232/9 216/224/9 215/223/9
f 225/233/9 217/225/9 216/224/9
f 226/234/9 218/226/9 217/225/9
f 227/235/9 219/227/9 218/226/9
f 228/236/9 220/228/9 219/227/9
f 229/237/9 221/229/9 220/228/9
f 230/238/9 222/230/9 221/229/9
f 231/239/9 223/203/9 222/230/9
f 28/28/9 224/232/9 55/231/9
f 59/56/9 225/233/9 224/232/9
f 60/58/9 226/234/9 225/233/9
f 61/60/9 227/235/9 226/234/9
f 62/62/9 228/236/9 227/235/9
f 63/64/9 229/237/9 228/236/9
f 64/66/9 230/238/9 229/237/9
f 65/68/9 231/239/9 230/238/9
f 66/70/9 232/32/9 231/239/9
f 250/240/11 58/206/11 241/241/11
f 417/81/8 422/90/8 418/90/8
f 416/72/8 423/81/8 417/81/8
f 44/242/11 233/243/11 45/244/11
f 242/245/11 234/246/11 233/243/11
f 243/247/11 235/248/11 234/246/11
f 244/249/11 236/250/11 235/248/11
f 245/251/11 237/252/11 236/250/11
f 246/253/11 238/254/11 237/252/11
f 247/255/11 239/256/11 238/254/11
f 248/257/11 240/258/11 239/256/11
f 249/259/11 241/241/11 240/258/11
f 420/29/8 425/72/8 416/72/8
f 250/240/12 372/204/12 57/204/12
f 247/255/12 380/257/12 248/257/12
f 43/260/7 361/242/7 44/242/7
f 52/81/8 367/90/8 51/90/8
f 246/253/12 379/255/12 247/255/12
f 42/26/7 360/260/7 43/260/7
f 51/90/8 366/98/8 50/98/8
f 245/251/12 378/253/12 246/253/12
f 26/261/7 359/26/7 42/26/7
f 50/98/8 365/108/8 49/108/8
f 57/204/9 371/222/9 56/222/9
f 244/249/12 377/251/12 245/251/12
f 49/108/8 364/117/8 48/117/8
f 56/222/9 370/231/9 55/231/9
f 243/247/12 376/249/12 244/249/12
f 48/117/8 363/126/8 47/126/8
f 55/231/9 357/28/9 28/28/9
f 242/245/12 375/247/12 243/247/12
f 47/126/8 362/135/8 46/135/8
f 249/259/12 373/240/12 250/240/12
f 54/29/8 369/72/8 53/72/8
f 44/242/12 374/245/12 242/245/12
f 46/135/8 358/144/8 26/144/8
f 248/257/12 381/259/12 249/259/12
f 28/28/8 356/29/8 54/29/8
f 53/72/8 368/81/8 52/81/8
f 286/262/7 45/244/7 277/263/7
f 295/264/7 44/242/7 286/262/7
f 304/27/7 43/260/7 295/264/7
f 30/265/7 269/266/7 29/267/7
f 278/268/7 270/269/7 269/266/7
f 279/270/7 271/271/7 270/269/7
f 280/272/7 272/273/7 271/271/7
f 281/274/7 273/275/7 272/273/7
f 282/276/7 274/277/7 273/275/7
f 283/278/7 275/279/7 274/277/7
f 284/280/7 276/281/7 275/279/7
f 285/282/7 277/263/7 276/281/7
f 31/283/7 278/268/7 30/265/7
f 287/284/7 279/270/7 278/268/7
f 288/285/7 280/272/7 279/270/7
f 289/286/7 281/274/7 280/272/7
f 290/287/7 282/276/7 281/274/7
f 291/288/7 283/278/7 282/276/7
f 292/289/7 284/280/7 283/278/7
f 293/290/7 285/282/7 284/280/7
f 294/291/7 286/262/7 285/282/7
f 32/292/7 287/284/7 31/283/7
f 296/293/7 288/285/7 287/284/7
f 297/294/7 289/286/7 288/285/7
f 298/295/7 290/287/7 289/286/7
f 299/296/7 291/288/7 290/287/7
f 300/297/7 292/289/7 291/288/7
f 301/298/7 293/290/7 292/289/7
f 302/299/7 294/291/7 293/290/7
f 303/300/7 295/264/7 294/291/7
f 25/301/7 296/293/7 32/292/7
f 33/302/7 297/294/7 296/293/7
f 34/303/7 298/295/7 297/294/7
f 35/304/7 299/296/7 298/295/7
f 36/305/7 300/297/7 299/296/7
f 37/306/7 301/298/7 300/297/7
f 38/307/7 302/299/7 301/298/7
f 39/308/7 303/300/7 302/299/7
f 40/309/7 304/27/7 303/300/7
f 310/136/8 308/119/8 307/118/8
f 311/310/8 309/120/8 308/119/8
f 313/138/8 311/310/8 310/136/8
f 314/128/8 312/129/8 311/310/8
f 306/137/8 314/128/8 313/138/8
f 153/128/10 305/145/10 40/145/10
f 137/120/10 312/129/10 145/129/10
f 152/138/11 310/136/11 144/136/11
f 40/309/7 306/25/7 41/25/7
f 144/136/11 307/118/11 135/118/11
f 321/311/9 99/312/9 322/312/9
f 331/313/8 345/313/8 335/313/8
f 323/74/8 319/83/8 317/74/8
f 326/83/8 318/82/8 319/83/8
f 322/312/8 320/73/8 321/311/8
f 326/83/8 324/314/8 325/82/8
f 321/311/8 325/82/8 324/314/8
f 323/74/8 327/313/8 326/83/8
f 320/73/8 317/74/8 316/73/8
f 324/314/11 100/311/11 321/311/11
f 322/312/10 91/313/10 327/313/10
f 327/313/7 90/314/7 324/314/7
f 328/314/8 330/312/8 329/311/8
f 99/312/12 333/313/12 91/313/12
f 329/311/8 338/314/8 328/314/8
f 329/311/8 354/311/8 339/311/8
f 332/312/10 335/313/10 333/313/10
f 331/313/8 334/312/8 330/312/8
f 332/312/10 353/312/10 334/312/10
f 91/313/12 341/314/12 90/314/12
f 336/314/11 339/311/11 337/311/11
f 337/311/12 348/311/12 100/311/12
f 336/314/11 346/314/11 338/314/11
f 90/314/12 337/311/12 100/311/12
f 340/313/7 343/314/7 341/314/7
f 340/313/7 345/313/7 342/313/7
f 343/314/7 347/314/7 341/314/7
f 328/314/8 342/313/8 331/313/8
f 90/314/12 347/314/12 336/314/12
f 338/314/8 343/314/8 328/314/8
f 335/313/10 344/313/10 333/313/10
f 333/313/12 340/313/12 91/313/12
f 348/311/9 351/312/9 349/312/9
f 351/312/9 352/312/9 349/312/9
f 348/311/9 354/311/9 350/311/9
f 99/312/12 352/312/12 332/312/12
f 339/311/11 355/311/11 337/311/11
f 334/312/8 351/312/8 330/312/8
f 100/311/12 349/312/12 99/312/12
f 330/312/8 350/311/8 329/311/8
f 491/315/11 483/257/11 482/255/11
f 434/316/8 502/317/8 436/317/8
f 397/247/12 479/249/12 399/249/12
f 260/117/11 414/108/11 259/108/11
f 371/222/9 254/231/9 370/231/9
f 377/251/12 404/253/12 378/253/12
f 259/108/9 438/108/9 365/108/9
f 370/231/9 267/28/9 357/28/9
f 376/249/12 403/251/12 377/251/12
f 365/108/10 437/117/10 364/117/10
f 257/90/11 423/81/11 256/81/11
f 375/247/12 402/249/12 376/249/12
f 266/144/11 412/135/11 262/135/11
f 357/28/10 420/29/10 356/29/10
f 374/245/12 401/247/12 375/247/12
f 360/260/7 263/242/7 361/242/7
f 381/259/12 251/240/12 373/240/12
f 368/81/10 418/90/10 367/90/10
f 361/242/12 400/245/12 374/245/12
f 359/26/7 264/260/7 360/260/7
f 380/257/12 407/259/12 381/259/12
f 367/90/8 258/98/8 366/98/8
f 373/240/12 252/204/12 372/204/12
f 358/261/7 265/26/7 359/26/7
f 379/255/12 406/257/12 380/257/12
f 366/98/8 259/108/8 365/108/8
f 372/204/9 253/222/9 371/222/9
f 256/81/11 425/72/11 255/72/11
f 378/253/12 405/255/12 379/255/12
f 447/126/10 467/135/10 445/135/10
f 266/261/7 442/261/7 429/26/7
f 403/251/12 430/253/12 404/253/12
f 251/240/12 393/204/12 252/204/12
f 426/318/11 452/319/11 382/319/11
f 265/26/7 428/260/7 264/260/7
f 263/242/12 396/245/12 400/245/12
f 439/98/10 461/108/10 449/108/10
f 264/260/7 395/242/7 263/242/7
f 400/245/12 397/247/12 401/247/12
f 493/320/11 476/240/11 484/259/11
f 496/321/11 488/322/11 487/323/11
f 448/117/10 468/126/10 447/126/10
f 401/247/12 399/249/12 402/249/12
f 407/259/12 394/240/12 251/240/12
f 426/318/11 450/261/11 451/318/11
f 440/90/10 462/98/10 439/98/10
f 402/249/12 398/251/12 403/251/12
f 406/257/12 433/259/12 407/259/12
f 254/231/9 390/28/9 446/28/9
f 494/316/11 474/222/11 485/324/11
f 405/255/12 432/257/12 406/257/12
f 253/222/9 391/231/9 254/231/9
f 449/108/10 469/117/10 448/117/10
f 404/253/12 431/255/12 405/255/12
f 252/204/9 392/222/9 253/222/9
f 426/318/13 466/261/13 427/261/13
f 430/253/12 482/255/12 431/255/12
f 436/317/8 501/325/8 435/325/8
f 396/245/12 478/247/12 397/247/12
f 428/260/7 458/242/7 395/242/7
f 391/231/8 494/316/8 434/316/8
f 398/251/12 481/253/12 430/253/12
f 387/326/14 471/327/14 386/327/14
f 395/242/12 477/245/12 396/245/12
f 429/26/7 459/260/7 428/260/7
f 386/327/15 470/328/15 385/328/15
f 394/240/12 475/204/12 393/204/12
f 427/261/7 460/26/7 429/26/7
f 385/328/16 388/329/16 384/329/16
f 393/204/9 474/222/9 392/222/9
f 435/325/9 472/326/9 387/326/9
f 384/329/17 389/330/17 383/330/17
f 433/259/12 476/240/12 394/240/12
f 392/222/9 473/231/9 391/231/9
f 383/330/18 443/319/18 382/319/18
f 432/257/12 484/259/12 433/259/12
f 399/249/12 480/251/12 398/251/12
f 382/319/19 444/318/19 426/318/19
f 431/255/12 483/257/12 432/257/12
f 492/331/11 484/259/11 483/257/11
f 495/332/11 487/323/11 486/333/11
f 369/72/10 417/81/10 368/81/10
f 356/29/10 416/72/10 369/72/10
f 267/28/9 419/28/9 357/28/9
f 255/72/11 424/29/11 268/29/11
f 367/90/7 422/90/7 257/90/7
f 268/29/11 421/28/11 267/28/11
f 438/108/8 415/117/8 437/117/8
f 437/117/8 413/126/8 408/126/8
f 408/126/8 412/135/8 409/135/8
f 409/135/8 411/144/8 410/144/8
f 362/135/10 410/144/10 358/144/10
f 261/126/11 415/117/11 260/117/11
f 363/126/10 409/135/10 362/135/10
f 358/261/7 411/261/7 266/261/7
f 262/135/11 413/126/11 261/126/11
f 364/117/10 408/126/10 363/126/10
f 259/108/8 448/117/8 260/117/8
f 260/117/8 447/126/8 261/126/8
f 261/126/8 445/135/8 262/135/8
f 488/322/11 480/251/11 479/249/11
f 262/135/8 442/144/8 266/144/8
f 459/260/11 477/245/11 458/242/11
f 490/334/11 482/255/11 481/253/11
f 256/81/8 440/90/8 257/90/8
f 257/90/8 439/98/8 258/98/8
f 258/98/8 449/108/8 259/108/8
f 462/98/8 454/108/8 461/108/8
f 463/90/8 455/98/8 462/98/8
f 464/81/8 456/90/8 463/90/8
f 485/324/11 475/204/11 476/240/11
f 467/135/8 450/144/8 465/144/8
f 390/28/20 436/317/20 441/81/20
f 468/126/8 451/135/8 467/135/8
f 469/117/8 452/126/8 468/126/8
f 461/108/8 453/117/8 469/117/8
f 382/319/11 453/330/11 383/330/11
f 487/323/11 479/249/11 478/247/11
f 383/330/11 454/329/11 384/329/11
f 445/135/10 465/144/10 442/144/10
f 384/329/11 455/328/11 385/328/11
f 385/328/11 456/327/11 386/327/11
f 486/333/11 478/247/11 477/245/11
f 386/327/11 457/326/11 387/326/11
f 489/335/11 481/253/11 480/251/11
f 442/261/7 450/261/7 427/261/7
f 441/81/10 463/90/10 440/90/10
f 460/26/11 486/333/11 459/260/11
f 497/336/11 489/335/11 488/322/11
f 498/337/11 490/334/11 489/335/11
f 499/338/11 491/315/11 490/334/11
f 500/339/11 492/331/11 491/315/11
f 501/325/11 493/320/11 492/331/11
f 502/317/11 485/324/11 493/320/11
f 466/261/11 495/332/11 460/26/11
f 495/332/11 443/319/11 496/321/11
f 496/321/11 389/330/11 497/336/11
f 497/336/11 388/329/11 498/337/11
f 498/337/11 470/328/11 499/338/11
f 499/338/11 471/327/11 500/339/11
f 500/339/11 472/326/11 501/325/11
f 169/152/12 277/263/12 234/246/12
f 41/25/7 26/261/7 42/26/7
f 419/28/8 421/28/8 424/29/8
f 67/30/9 27/40/9 68/31/9
f 80/33/10 25/340/10 32/34/10
f 33/36/8 25/341/8 80/37/8
f 89/39/8 72/42/8 27/40/8
f 98/41/8 73/44/8 72/42/8
f 107/43/8 74/46/8 73/44/8
f 116/45/8 75/48/8 74/46/8
f 125/47/8 76/50/8 75/48/8
f 134/49/8 77/52/8 76/50/8
f 134/49/8 143/54/8 78/51/8
f 151/53/8 79/55/8 78/51/8
f 160/38/8 80/37/8 79/55/8
f 54/29/8 81/57/8 59/56/8
f 81/57/8 82/59/8 60/58/8
f 82/59/8 83/61/8 61/60/8
f 83/61/8 84/63/8 62/62/8
f 84/63/8 85/65/8 63/64/8
f 85/65/8 86/67/8 64/66/8
f 86/67/8 87/69/8 65/68/8
f 87/69/8 88/71/8 66/70/8
f 88/71/8 89/39/8 67/30/8
f 53/72/8 316/73/8 81/57/8
f 316/73/8 317/74/8 82/59/8
f 317/74/8 92/75/8 83/61/8
f 92/75/8 93/76/8 84/63/8
f 93/76/8 94/77/8 85/65/8
f 94/77/8 95/78/8 86/67/8
f 95/78/8 96/79/8 87/69/8
f 96/79/8 97/80/8 88/71/8
f 97/80/8 98/41/8 89/39/8
f 52/81/8 318/82/8 316/73/8
f 325/82/8 320/73/8 316/73/8
f 319/83/8 101/84/8 92/75/8
f 101/84/8 102/85/8 93/76/8
f 102/85/8 103/86/8 94/77/8
f 103/86/8 104/87/8 95/78/8
f 104/87/8 105/88/8 96/79/8
f 105/88/8 106/89/8 97/80/8
f 106/89/8 107/43/8 98/41/8
f 51/90/8 108/91/8 318/82/8
f 108/91/8 109/92/8 319/83/8
f 109/92/8 110/93/8 101/84/8
f 110/93/8 111/94/8 102/85/8
f 111/94/8 112/95/8 103/86/8
f 112/95/8 113/96/8 104/87/8
f 113/96/8 114/97/8 105/88/8
f 114/97/8 115/106/8 106/89/8
f 106/89/8 115/106/8 116/45/8
f 50/98/8 117/99/8 108/91/8
f 117/99/8 118/100/8 109/92/8
f 118/100/8 119/101/8 110/93/8
f 119/101/8 120/102/8 111/94/8
f 120/102/8 121/103/8 112/95/8
f 121/103/8 122/104/8 113/96/8
f 122/104/8 123/105/8 114/97/8
f 123/105/8 124/107/8 115/106/8
f 124/107/8 125/47/8 116/45/8
f 49/108/8 126/109/8 117/99/8
f 126/109/8 127/110/8 118/100/8
f 127/110/8 128/111/8 119/101/8
f 128/111/8 129/112/8 120/102/8
f 129/112/8 130/113/8 121/103/8
f 130/113/8 131/114/8 122/104/8
f 131/114/8 132/115/8 123/105/8
f 132/115/8 133/116/8 124/107/8
f 133/116/8 134/49/8 125/47/8
f 48/117/8 135/118/8 126/109/8
f 135/118/8 136/119/8 127/110/8
f 136/119/8 137/120/8 128/111/8
f 137/120/8 138/121/8 129/112/8
f 138/121/8 139/122/8 130/113/8
f 139/122/8 140/123/8 131/114/8
f 140/123/8 141/124/8 132/115/8
f 141/124/8 142/125/8 133/116/8
f 142/125/8 143/54/8 134/49/8
f 47/126/8 144/136/8 135/118/8
f 136/119/9 308/119/9 309/120/9
f 154/127/7 315/127/7 314/128/7
f 145/129/8 146/130/8 138/121/8
f 146/130/8 147/131/8 139/122/8
f 147/131/8 148/132/8 140/123/8
f 148/132/8 149/133/8 141/124/8
f 149/133/8 150/134/8 142/125/8
f 150/134/8 151/53/8 143/54/8
f 46/135/8 152/138/8 144/136/8
f 41/137/11 306/137/11 313/138/11
f 145/129/10 312/129/10 315/127/10
f 154/127/8 155/139/8 146/130/8
f 155/139/8 156/140/8 147/131/8
f 156/140/8 157/141/8 148/132/8
f 157/141/8 158/142/8 149/133/8
f 158/142/8 159/143/8 150/134/8
f 159/143/8 160/38/8 151/53/8
f 26/144/8 41/137/8 152/138/8
f 135/118/9 307/118/9 308/119/9
f 40/145/8 39/146/8 154/127/8
f 39/146/8 38/147/8 155/139/8
f 38/147/8 37/148/8 156/140/8
f 37/148/8 36/149/8 157/141/8
f 36/149/8 35/150/8 158/142/8
f 35/150/8 34/151/8 159/143/8
f 34/151/8 33/36/8 160/38/8
f 169/152/10 178/156/10 30/153/10
f 187/155/10 31/157/10 30/153/10
f 196/35/10 32/34/10 31/157/10
f 70/158/10 170/161/10 161/159/10
f 170/161/10 171/163/10 162/162/10
f 171/163/10 172/165/10 163/164/10
f 172/165/10 173/167/10 164/166/10
f 173/167/10 174/169/10 165/168/10
f 174/169/10 175/171/10 166/170/10
f 175/171/10 176/173/10 167/172/10
f 176/173/10 177/175/10 168/174/10
f 177/175/10 178/156/10 169/152/10
f 69/176/10 179/177/10 170/161/10
f 179/177/10 180/178/10 171/163/10
f 180/178/10 181/179/10 172/165/10
f 181/179/10 182/180/10 173/167/10
f 182/180/10 183/181/10 174/169/10
f 183/181/10 184/182/10 175/171/10
f 184/182/10 185/183/10 176/173/10
f 185/183/10 186/184/10 177/175/10
f 186/184/10 187/155/10 178/156/10
f 68/31/10 188/185/10 179/177/10
f 188/185/10 189/186/10 180/178/10
f 189/186/10 190/187/10 181/179/10
f 190/187/10 191/188/10 182/180/10
f 191/188/10 192/189/10 183/181/10
f 192/189/10 193/190/10 184/182/10
f 193/190/10 194/191/10 185/183/10
f 194/191/10 195/192/10 186/184/10
f 195/192/10 196/35/10 187/155/10
f 27/40/10 72/193/10 188/185/10
f 72/193/10 73/194/10 189/186/10
f 73/194/10 74/195/10 190/187/10
f 74/195/10 75/196/10 191/188/10
f 75/196/10 76/197/10 192/189/10
f 76/197/10 77/198/10 193/190/10
f 77/198/10 78/199/10 194/191/10
f 78/199/10 79/200/10 195/192/10
f 79/200/10 80/33/10 196/35/10
f 214/201/9 70/158/9 71/160/9
f 223/203/9 69/176/9 70/158/9
f 232/32/9 68/31/9 69/176/9
f 57/204/9 206/207/9 197/205/9
f 206/207/9 207/209/9 198/208/9
f 207/209/9 208/211/9 199/210/9
f 208/211/9 209/213/9 200/212/9
f 209/213/9 210/215/9 201/214/9
f 210/215/9 211/217/9 202/216/9
f 211/217/9 212/219/9 203/218/9
f 212/219/9 213/221/9 204/220/9
f 213/221/9 214/201/9 205/202/9
f 56/222/9 215/223/9 206/207/9
f 215/223/9 216/224/9 207/209/9
f 216/224/9 217/225/9 208/211/9
f 217/225/9 218/226/9 209/213/9
f 218/226/9 219/227/9 210/215/9
f 219/227/9 220/228/9 211/217/9
f 220/228/9 221/229/9 212/219/9
f 221/229/9 222/230/9 213/221/9
f 222/230/9 223/203/9 214/201/9
f 55/231/9 224/232/9 215/223/9
f 224/232/9 225/233/9 216/224/9
f 225/233/9 226/234/9 217/225/9
f 226/234/9 227/235/9 218/226/9
f 227/235/9 228/236/9 219/227/9
f 228/236/9 229/237/9 220/228/9
f 229/237/9 230/238/9 221/229/9
f 230/238/9 231/239/9 222/230/9
f 231/239/9 232/32/9 223/203/9
f 28/28/9 59/56/9 224/232/9
f 59/56/9 60/58/9 225/233/9
f 60/58/9 61/60/9 226/234/9
f 61/60/9 62/62/9 227/235/9
f 62/62/9 63/64/9 228/236/9
f 63/64/9 64/66/9 229/237/9
f 64/66/9 65/68/9 230/238/9
f 65/68/9 66/70/9 231/239/9
f 66/70/9 67/30/9 232/32/9
f 250/240/11 57/204/11 58/206/11
f 417/81/8 423/81/8 422/90/8
f 416/72/8 425/72/8 423/81/8
f 44/242/11 242/245/11 233/243/11
f 242/245/11 243/247/11 234/246/11
f 243/247/11 244/249/11 235/248/11
f 244/249/11 245/251/11 236/250/11
f 245/251/11 246/253/11 237/252/11
f 246/253/11 247/255/11 238/254/11
f 247/255/11 248/257/11 239/256/11
f 248/257/11 249/259/11 240/258/11
f 249/259/11 250/240/11 241/241/11
f 420/29/8 424/29/8 425/72/8
f 250/240/12 373/240/12 372/204/12
f 247/255/12 379/255/12 380/257/12
f 43/260/7 360/260/7 361/242/7
f 52/81/8 368/81/8 367/90/8
f 246/253/12 378/253/12 379/255/12
f 42/26/7 359/26/7 360/260/7
f 51/90/8 367/90/8 366/98/8
f 245/251/12 377/251/12 378/253/12
f 26/261/7 358/261/7 359/26/7
f 50/98/8 366/98/8 365/108/8
f 57/204/9 372/204/9 371/222/9
f 244/249/12 376/249/12 377/251/12
f 49/108/8 365/108/8 364/117/8
f 56/222/9 371/222/9 370/231/9
f 243/247/12 375/247/12 376/249/12
f 48/117/8 364/117/8 363/126/8
f 55/231/9 370/231/9 357/28/9
f 242/245/12 374/245/12 375/247/12
f 47/126/8 363/126/8 362/135/8
f 249/259/12 381/259/12 373/240/12
f 54/29/8 356/29/8 369/72/8
f 44/242/12 361/242/12 374/245/12
f 46/135/8 362/135/8 358/144/8
f 248/257/12 380/257/12 381/259/12
f 28/28/8 357/28/8 356/29/8
f 53/72/8 369/72/8 368/81/8
f 286/262/7 44/242/7 45/244/7
f 295/264/7 43/260/7 44/242/7
f 304/27/7 42/26/7 43/260/7
f 30/265/7 278/268/7 269/266/7
f 278/268/7 279/270/7 270/269/7
f 279/270/7 280/272/7 271/271/7
f 280/272/7 281/274/7 272/273/7
f 281/274/7 282/276/7 273/275/7
f 282/276/7 283/278/7 274/277/7
f 283/278/7 284/280/7 275/279/7
f 284/280/7 285/282/7 276/281/7
f 285/282/7 286/262/7 277/263/7
f 31/283/7 287/284/7 278/268/7
f 287/284/7 288/285/7 279/270/7
f 288/285/7 289/286/7 280/272/7
f 289/286/7 290/287/7 281/274/7
f 290/287/7 291/288/7 282/276/7
f 291/288/7 292/289/7 283/278/7
f 292/289/7 293/290/7 284/280/7
f 293/290/7 294/291/7 285/282/7
f 294/291/7 295/264/7 286/262/7
f 32/292/7 296/293/7 287/284/7
f 296/293/7 297/294/7 288/285/7
f 297/294/7 298/295/7 289/286/7
f 298/295/7 299/296/7 290/287/7
f 299/296/7 300/297/7 291/288/7
f 300/297/7 301/298/7 292/289/7
f 301/298/7 302/299/7 293/290/7
f 302/299/7 303/300/7 294/291/7
f 303/300/7 304/27/7 295/264/7
f 25/301/7 33/302/7 296/293/7
f 33/302/7 34/303/7 297/294/7
f 34/303/7 35/304/7 298/295/7
f 35/304/7 36/305/7 299/296/7
f 36/305/7 37/306/7 300/297/7
f 37/306/7 38/307/7 301/298/7
f 38/307/7 39/308/7 302/299/7
f 39/308/7 40/309/7 303/300/7
f 40/309/7 41/25/7 304/27/7
f 310/136/8 311/310/8 308/119/8
f 311/310/8 312/129/8 309/120/8
f 313/138/8 314/128/8 311/310/8
f 314/128/8 315/127/8 312/129/8
f 306/137/8 305/145/8 314/128/8
f 153/128/10 314/128/10 305/145/10
f 137/120/10 309/120/10 312/129/10
f 152/138/11 313/138/11 310/136/11
f 40/309/7 305/309/7 306/25/7
f 144/136/11 310/136/11 307/118/11
f 321/311/9 100/311/9 99/312/9
f 331/313/8 342/313/8 345/313/8
f 323/74/8 326/83/8 319/83/8
f 326/83/8 325/82/8 318/82/8
f 322/312/8 323/74/8 320/73/8
f 326/83/8 327/313/8 324/314/8
f 321/311/8 320/73/8 325/82/8
f 323/74/8 322/312/8 327/313/8
f 320/73/8 323/74/8 317/74/8
f 324/314/11 90/314/11 100/311/11
f 322/312/10 99/312/10 91/313/10
f 327/313/7 91/313/7 90/314/7
f 328/314/8 331/313/8 330/312/8
f 99/312/12 332/312/12 333/313/12
f 329/311/8 339/311/8 338/314/8
f 329/311/8 350/311/8 354/311/8
f 332/312/10 334/312/10 335/313/10
f 331/313/8 335/313/8 334/312/8
f 332/312/10 352/312/10 353/312/10
f 91/313/12 340/313/12 341/314/12
f 336/314/11 338/314/11 339/311/11
f 337/311/12 355/311/12 348/311/12
f 336/314/11 347/314/11 346/314/11
f 90/314/12 336/314/12 337/311/12
f 340/313/7 342/313/7 343/314/7
f 340/313/7 344/313/7 345/313/7
f 343/314/7 346/314/7 347/314/7
f 328/314/8 343/314/8 342/313/8
f 90/314/12 341/314/12 347/314/12
f 338/314/8 346/314/8 343/314/8
f 335/313/10 345/313/10 344/313/10
f 333/313/12 344/313/12 340/313/12
f 348/311/9 350/311/9 351/312/9
f 351/312/9 353/312/9 352/312/9
f 348/311/9 355/311/9 354/311/9
f 99/312/12 349/312/12 352/312/12
f 339/311/11 354/311/11 355/311/11
f 334/312/8 353/312/8 351/312/8
f 100/311/12 348/311/12 349/312/12
f 330/312/8 351/312/8 350/311/8
f 491/315/11 492/331/11 483/257/11
f 434/316/8 494/316/8 502/317/8
f 397/247/12 478/247/12 479/249/12
f 260/117/11 415/117/11 414/108/11
f 371/222/9 253/222/9 254/231/9
f 377/251/12 403/251/12 404/253/12
f 259/108/9 414/108/9 438/108/9
f 370/231/9 254/231/9 267/28/9
f 376/249/12 402/249/12 403/251/12
f 365/108/10 438/108/10 437/117/10
f 257/90/11 422/90/11 423/81/11
f 375/247/12 401/247/12 402/249/12
f 266/144/11 411/144/11 412/135/11
f 357/28/10 419/28/10 420/29/10
f 374/245/12 400/245/12 401/247/12
f 360/260/7 264/260/7 263/242/7
f 381/259/12 407/259/12 251/240/12
f 368/81/10 417/81/10 418/90/10
f 361/242/12 263/242/12 400/245/12
f 359/26/7 265/26/7 264/260/7
f 380/257/12 406/257/12 407/259/12
f 367/90/8 257/90/8 258/98/8
f 373/240/12 251/240/12 252/204/12
f 358/261/7 266/261/7 265/26/7
f 379/255/12 405/255/12 406/257/12
f 366/98/8 258/98/8 259/108/8
f 372/204/9 252/204/9 253/222/9
f 256/81/11 423/81/11 425/72/11
f 378/253/12 404/253/12 405/255/12
f 447/126/10 468/126/10 467/135/10
f 429/26/7 265/26/7 266/261/7
f 442/261/7 427/261/7 429/26/7
f 403/251/12 398/251/12 430/253/12
f 251/240/12 394/240/12 393/204/12
f 426/318/11 451/318/11 452/319/11
f 265/26/7 429/26/7 428/260/7
f 263/242/12 395/242/12 396/245/12
f 439/98/10 462/98/10 461/108/10
f 264/260/7 428/260/7 395/242/7
f 400/245/12 396/245/12 397/247/12
f 493/320/11 485/324/11 476/240/11
f 496/321/11 497/336/11 488/322/11
f 448/117/10 469/117/10 468/126/10
f 401/247/12 397/247/12 399/249/12
f 407/259/12 433/259/12 394/240/12
f 426/318/11 427/261/11 450/261/11
f 440/90/10 463/90/10 462/98/10
f 402/249/12 399/249/12 398/251/12
f 406/257/12 432/257/12 433/259/12
f 446/28/9 267/28/9 254/231/9
f 254/231/9 391/231/9 390/28/9
f 494/316/11 473/231/11 474/222/11
f 405/255/12 431/255/12 432/257/12
f 253/222/9 392/222/9 391/231/9
f 449/108/10 461/108/10 469/117/10
f 404/253/12 430/253/12 431/255/12
f 252/204/9 393/204/9 392/222/9
f 426/318/13 444/318/13 466/261/13
f 430/253/12 481/253/12 482/255/12
f 436/317/8 502/317/8 501/325/8
f 396/245/12 477/245/12 478/247/12
f 428/260/7 459/260/7 458/242/7
f 391/231/8 473/231/8 494/316/8
f 398/251/12 480/251/12 481/253/12
f 387/326/14 472/326/14 471/327/14
f 395/242/12 458/242/12 477/245/12
f 429/26/7 460/26/7 459/260/7
f 386/327/15 471/327/15 470/328/15
f 394/240/12 476/240/12 475/204/12
f 427/261/7 466/261/7 460/26/7
f 385/328/16 470/328/16 388/329/16
f 393/204/9 475/204/9 474/222/9
f 435/325/9 501/325/9 472/326/9
f 384/329/17 388/329/17 389/330/17
f 433/259/12 484/259/12 476/240/12
f 392/222/9 474/222/9 473/231/9
f 383/330/18 389/330/18 443/319/18
f 432/257/12 483/257/12 484/259/12
f 399/249/12 479/249/12 480/251/12
f 382/319/19 443/319/19 444/318/19
f 431/255/12 482/255/12 483/257/12
f 492/331/11 493/320/11 484/259/11
f 495/332/11 496/321/11 487/323/11
f 369/72/10 416/72/10 417/81/10
f 356/29/10 420/29/10 416/72/10
f 267/28/9 421/28/9 419/28/9
f 255/72/11 425/72/11 424/29/11
f 367/90/7 418/90/7 422/90/7
f 268/29/11 424/29/11 421/28/11
f 438/108/8 414/108/8 415/117/8
f 437/117/8 415/117/8 413/126/8
f 408/126/8 413/126/8 412/135/8
f 409/135/8 412/135/8 411/144/8
f 362/135/10 409/135/10 410/144/10
f 261/126/11 413/126/11 415/117/11
f 363/126/10 408/126/10 409/135/10
f 358/261/7 410/261/7 411/261/7
f 262/135/11 412/135/11 413/126/11
f 364/117/10 437/117/10 408/126/10
f 259/108/8 449/108/8 448/117/8
f 260/117/8 448/117/8 447/126/8
f 261/126/8 447/126/8 445/135/8
f 488/322/11 489/335/11 480/251/11
f 262/135/8 445/135/8 442/144/8
f 459/260/11 486/333/11 477/245/11
f 490/334/11 491/315/11 482/255/11
f 256/81/8 441/81/8 440/90/8
f 257/90/8 440/90/8 439/98/8
f 258/98/8 439/98/8 449/108/8
f 462/98/8 455/98/8 454/108/8
f 463/90/8 456/90/8 455/98/8
f 464/81/8 457/81/8 456/90/8
f 485/324/11 474/222/11 475/204/11
f 467/135/8 451/135/8 450/144/8
f 441/81/8 256/81/8 255/72/8
f 268/29/8 267/28/8 446/28/8
f 441/81/8 255/72/8 268/29/8
f 457/81/9 464/81/9 441/81/9
f 436/317/11 435/325/11 387/326/11
f 387/326/9 457/81/9 441/81/9
f 441/81/8 268/29/8 446/28/8
f 390/28/11 391/231/11 434/316/11
f 441/81/8 446/28/8 390/28/8
f 436/317/21 387/326/21 441/81/21
f 390/28/11 434/316/11 436/317/11
f 468/126/8 452/126/8 451/135/8
f 469/117/8 453/117/8 452/126/8
f 461/108/8 454/108/8 453/117/8
f 382/319/11 452/319/11 453/330/11
f 487/323/11 488/322/11 479/249/11
f 383/330/11 453/330/11 454/329/11
f 445/135/10 467/135/10 465/144/10
f 384/329/11 454/329/11 455/328/11
f 385/328/11 455/328/11 456/327/11
f 486/333/11 487/323/11 478/247/11
f 386/327/11 456/327/11 457/326/11
f 489/335/11 490/334/11 481/253/11
f 442/261/7 465/261/7 450/261/7
f 441/81/10 464/81/10 463/90/10
f 460/26/11 495/332/11 486/333/11
f 497/336/11 498/337/11 489/335/11
f 498/337/11 499/338/11 490/334/11
f 499/338/11 500/339/11 491/315/11
f 500/339/11 501/325/11 492/331/11
f 501/325/11 502/317/11 493/320/11
f 502/317/11 494/316/11 485/324/11
f 466/261/11 444/318/11 495/332/11
f 495/332/11 444/318/11 443/319/11
f 496/321/11 443/319/11 389/330/11
f 497/336/11 389/330/11 388/329/11
f 498/337/11 388/329/11 470/328/11
f 499/338/11 470/328/11 471/327/11
f 500/339/11 471/327/11 472/326/11
f 205/202/12 71/160/12 161/159/12
f 205/202/12 161/159/12 162/162/12
f 204/220/12 205/202/12 162/162/12
f 204/220/12 162/162/12 163/164/12
f 203/218/12 204/220/12 163/164/12
f 203/218/12 163/164/12 164/166/12
f 202/216/12 203/218/12 164/166/12
f 202/216/12 164/166/12 165/168/12
f 201/214/12 202/216/12 165/168/12
f 201/214/12 165/168/12 166/170/12
f 200/212/12 201/214/12 166/170/12
f 200/212/12 166/170/12 167/172/12
f 199/210/12 200/212/12 167/172/12
f 199/210/12 167/172/12 168/174/12
f 198/208/12 199/210/12 168/174/12
f 169/152/12 29/267/12 269/266/12
f 198/208/12 168/174/12 169/152/12
f 241/241/12 58/206/12 197/205/12
f 197/205/12 198/208/12 169/152/12
f 169/152/12 269/266/12 270/269/12
f 169/152/12 270/269/12 271/271/12
f 241/241/12 197/205/12 169/152/12
f 240/258/12 241/241/12 169/152/12
f 169/152/12 271/271/12 272/273/12
f 169/152/12 272/273/12 273/275/12
f 239/256/12 240/258/12 169/152/12
f 238/254/12 239/256/12 169/152/12
f 169/152/12 273/275/12 274/277/12
f 169/152/12 274/277/12 275/279/12
f 237/252/12 238/254/12 169/152/12
f 236/250/12 237/252/12 169/152/12
f 169/152/12 275/279/12 276/281/12
f 277/263/12 45/244/12 233/243/12
f 169/152/12 276/281/12 277/263/12
f 235/248/12 236/250/12 169/152/12
f 277/263/12 233/243/12 234/246/12
f 234/246/12 235/248/12 169/152/12
o Bonhomme.001
v 6.072407 7.319776 47.680939
v 6.072407 7.312694 47.680939
v 6.072407 7.319776 47.673859
v 6.072407 7.312694 47.673859
v 6.079489 7.319776 47.680939
v 6.079489 7.312694 47.680939
v 6.079489 7.319776 47.673859
v 6.079489 7.312694 47.673859
vn 1.0000 -0.0000 -0.0000
vn -0.0000 -0.0000 1.0000
vn -1.0000 -0.0000 -0.0000
vn -0.0000 -0.0000 -1.0000
vn -0.0000 -1.0000 -0.0000
vn -0.0000 1.0000 -0.0000
vt 0.625000 0.000000
vt 0.375000 0.250000
vt 0.375000 0.000000
vt 0.625000 0.250000
vt 0.375000 0.500000
vt 0.625000 0.500000
vt 0.375000 0.750000
vt 0.625000 0.750000
vt 0.375000 1.000000
vt 0.125000 0.750000
vt 0.125000 0.500000
vt 0.875000 0.500000
vt 0.625000 1.000000
vt 0.875000 0.750000
s 0
f 504/342/22 505/343/22 503/344/22
f 506/345/23 509/346/23 505/343/23
f 510/347/24 507/348/24 509/346/24
f 508/349/25 503/350/25 507/348/25
f 509/346/26 503/351/26 505/352/26
f 506/353/27 508/349/27 510/347/27
f 504/342/22 506/345/22 505/343/22
f 506/345/23 510/347/23 509/346/23
f 510/347/24 508/349/24 507/348/24
f 508/349/25 504/354/25 503/350/25
f 509/346/26 507/348/26 503/351/26
f 506/353/27 504/355/27 508/349/27
o Bonhomme.002
v 9.819356 7.485377 47.846542
v 9.819356 7.147092 47.846542
v 9.819356 7.485377 47.508255
v 9.819356 7.147092 47.508255
v 10.157641 7.485377 47.846542
v 10.157641 7.147092 47.846542
v 10.157641 7.485377 47.508255
v 10.157641 7.147092 47.508255
vn 1.0000 -0.0000 -0.0000
vn -0.0000 -0.0000 1.0000
vn -1.0000 -0.0000 -0.0000
vn -0.0000 -0.0000 -1.0000
vn -0.0000 -1.0000 -0.0000
vn -0.0000 1.0000 -0.0000
vt 0.625000 0.000000
vt 0.375000 0.250000
vt 0.375000 0.000000
vt 0.625000 0.250000
vt 0.375000 0.500000
vt 0.625000 0.500000
vt 0.375000 0.750000
vt 0.625000 0.750000
vt 0.375000 1.000000
vt 0.125000 0.750000
vt 0.125000 0.500000
vt 0.875000 0.500000
vt 0.625000 1.000000
vt 0.875000 0.750000
s 0
f 512/356/28 513/357/28 511/358/28
f 514/359/29 517/360/29 513/357/29
f 518/361/30 515/362/30 517/360/30
f 516/363/31 511/364/31 515/362/31
f 517/360/32 511/365/32 513/366/32
f 514/367/33 516/363/33 518/361/33
f 512/356/28 514/359/28 513/357/28
f 514/359/29 518/361/29 517/360/29
f 518/361/30 516/363/30 515/362/30
f 516/363/31 512/368/31 511/364/31
f 517/360/32 515/362/32 511/365/32
f 514/367/33 512/369/33 516/363/33
o Bonhomme.003
v 14.583285 7.331372 47.692535
v 14.583285 7.301097 47.692535
v 14.583285 7.331372 47.662262
v 14.583285 7.301097 47.662262
v 14.613561 7.331372 47.692535
v 14.613561 7.301097 47.692535
v 14.613561 7.331372 47.662262
v 14.613561 7.301097 47.662262
vn 1.0000 -0.0000 -0.0000
vn -0.0000 -0.0000 1.0000
vn -1.0000 -0.0000 -0.0000
vn -0.0000 -0.0000 -1.0000
vn -0.0000 -1.0000 -0.0000
vn -0.0000 1.0000 -0.0000
vt 0.625000 0.000000
vt 0.375000 0.250000
vt 0.375000 0.000000
vt 0.625000 0.250000
vt 0.375000 0.500000
vt 0.625000 0.500000
vt 0.375000 0.750000
vt 0.625000 0.750000
vt 0.375000 1.000000
vt 0.125000 0.750000
vt 0.125000 0.500000
vt 0.875000 0.500000
vt 0.625000 1.000000
vt 0.875000 0.750000
s 0
f 520/370/34 521/371/34 519/372/34
f 522/373/35 525/374/35 521/371/35
f 526/375/36 523/376/36 525/374/36
f 524/377/37 519/378/37 523/376/37
f 525/374/38 519/379/38 521/380/38
f 522/381/39 524/377/39 526/375/39
f 520/370/34 522/373/34 521/371/34
f 522/373/35 526/375/35 525/374/35
f 526/375/36 524/377/36 523/376/36
f 524/377/37 520/382/37 519/378/37
f 525/374/38 523/376/38 519/379/38
f 522/381/39 520/383/39 524/377/39
o Bonhomme.004
v 18.778244 7.381603 47.742767
v 18.778244 7.250866 47.742767
v 18.778244 7.381603 47.612030
v 18.778244 7.250866 47.612030
v 18.908981 7.381603 47.742767
v 18.908981 7.250866 47.742767
v 18.908981 7.381603 47.612030
v 18.908981 7.250866 47.612030
vn 1.0000 -0.0000 -0.0000
vn -0.0000 -0.0000 1.0000
vn -1.0000 -0.0000 -0.0000
vn -0.0000 -0.0000 -1.0000
vn -0.0000 -1.0000 -0.0000
vn -0.0000 1.0000 -0.0000
vt 0.625000 0.000000
vt 0.375000 0.250000
vt 0.375000 0.000000
vt 0.625000 0.250000
vt 0.375000 0.500000
vt 0.625000 0.500000
vt 0.375000 0.750000
vt 0.625000 0.750000
vt 0.375000 1.000000
vt 0.125000 0.750000
vt 0.125000 0.500000
vt 0.875000 0.500000
vt 0.625000 1.000000
vt 0.875000 0.750000
s 0
f 528/384/40 529/385/40 527/386/40
f 530/387/41 533/388/41 529/385/41
f 534/389/42 531/390/42 533/388/42
f 532/391/43 527/392/43 531/390/43
f 533/388/44 527/393/44 529/394/44
f 530/395/45 532/391/45 534/389/45
f 528/384/40 530/387/40 529/385/40
f 530/387/41 534/389/41 533/388/41
f 534/389/42 532/391/42 531/390/42
f 532/391/43 528/396/43 527/392/43
f 533/388/44 531/390/44 527/393/44
f 530/395/45 528/397/45 532/391/45
o Bonhomme.005
v 6.072407 7.319776 41.993584
v 6.072407 7.312694 41.993584
v 6.072407 7.319776 41.986504
v 6.072407 7.312694 41.986504
v 6.079489 7.319776 41.993584
v 6.079489 7.312694 41.993584
v 6.079489 7.319776 41.986504
v 6.079489 7.312694 41.986504
vn 1.0000 -0.0000 -0.0000
vn -0.0000 -0.0000 1.0000
vn -1.0000 -0.0000 -0.0000
vn -0.0000 -0.0000 -1.0000
vn -0.0000 -1.0000 -0.0000
vn -0.0000 1.0000 -0.0000
vt 0.625000 0.000000
vt 0.375000 0.250000
vt 0.375000 0.000000
vt 0.625000 0.250000
vt 0.375000 0.500000
vt 0.625000 0.500000
vt 0.375000 0.750000
vt 0.625000 0.750000
vt 0.375000 1.000000
vt 0.125000 0.750000
vt 0.125000 0.500000
vt 0.875000 0.500000
vt 0.625000 1.000000
vt 0.875000 0.750000
s 0
f 536/398/46 537/399/46 535/400/46
f 538/401/47 541/402/47 537/399/47
f 542/403/48 539/404/48 541/402/48
f 540/405/49 535/406/49 539/404/49
f 541/402/50 535/407/50 537/408/50
f 538/409/51 540/405/51 542/403/51
f 536/398/46 538/401/46 537/399/46
f 538/401/47 542/403/47 541/402/47
f 542/403/48 540/405/48 539/404/48
f 540/405/49 536/410/49 535/406/49
f 541/402/50 539/404/50 535/407/50
f 538/409/51 536/411/51 540/405/51
o Bonhomme.006
v 9.819356 7.485377 42.159187
v 9.819356 7.147092 42.159187
v 9.819356 7.485377 41.820900
v 9.819356 7.147092 41.820900
v 10.157641 7.485377 42.159187
v 10.157641 7.147092 42.159187
v 10.157641 7.485377 41.820900
v 10.157641 7.147092 41.820900
vn 1.0000 -0.0000 -0.0000
vn -0.0000 -0.0000 1.0000
vn -1.0000 -0.0000 -0.0000
vn -0.0000 -0.0000 -1.0000
vn -0.0000 -1.0000 -0.0000
vn -0.0000 1.0000 -0.0000
vt 0.625000 0.000000
vt 0.375000 0.250000
vt 0.375000 0.000000
vt 0.625000 0.250000
vt 0.375000 0.500000
vt 0.625000 0.500000
vt 0.375000 0.750000
vt 0.625000 0.750000
vt 0.375000 1.000000
vt 0.125000 0.750000
vt 0.125000 0.500000
vt 0.875000 0.500000
vt 0.625000 1.000000
vt 0.875000 0.750000
s 0
f 544/412/52 545/413/52 543/414/52
f 546/415/53 549/416/53 545/413/53
f 550/417/54 547/418/54 549/416/54
f 548/419/55 543/420/55 547/418/55
f 549/416/56 543/421/56 545/422/56
f 546/423/57 548/419/57 550/417/57
f 544/412/52 546/415/52 545/413/52
f 546/415/53 550/417/53 549/416/53
f 550/417/54 548/419/54 547/418/54
f 548/419/55 544/424/55 543/420/55
f 549/416/56 547/418/56 543/421/56
f 546/423/57 544/425/57 548/419/57
o Bonhomme.007
v 14.583285 7.331372 42.005180
v 14.583285 7.301097 42.005180
v 14.583285 7.331372 41.974907
v 14.583285 7.301097 41.974907
v 14.613561 7.331372 42.005180
v 14.613561 7.301097 42.005180
v 14.613561 7.331372 41.974907
v 14.613561 7.301097 41.974907
vn 1.0000 -0.0000 -0.0000
vn -0.0000 -0.0000 1.0000
vn -1.0000 -0.0000 -0.0000
vn -0.0000 -0.0000 -1.0000
vn -0.0000 -1.0000 -0.0000
vn -0.0000 1.0000 -0.0000
vt 0.625000 0.000000
vt 0.375000 0.250000
vt 0.375000 0.000000
vt 0.625000 0.250000
vt 0.375000 0.500000
vt 0.625000 0.500000
vt 0.375000 0.750000
vt 0.625000 0.750000
vt 0.375000 1.000000
vt 0.125000 0.750000
vt 0.125000 0.500000
vt 0.875000 0.500000
vt 0.625000 1.000000
vt 0.875000 0.750000
s 0
f 552/426/58 553/427/58 551/428/58
f 554/429/59 557/430/59 553/427/59
f 558/431/60 555/432/60 557/430/60
f 556/433/61 551/434/61 555/432/61
f 557/430/62 551/435/62 553/436/62
f 554/437/63 556/433/63 558/431/63
f 552/426/58 554/429/58 553/427/58
f 554/429/59 558/431/59 557/430/59
f 558/431/60 556/433/60 555/432/60
f 556/433/61 552/438/61 551/434/61
f 557/430/62 555/432/62 551/435/62
f 554/437/63 552/439/63 556/433/63
o Bonhomme.008
v 18.778244 7.381603 42.055412
v 18.778244 7.250866 42.055412
v 18.778244 7.381603 41.924675
v 18.778244 7.250866 41.924675
v 18.908981 7.381603 42.055412
v 18.908981 7.250866 42.055412
v 18.908981 7.381603 41.924675
v 18.908981 7.250866 41.924675
vn 1.0000 -0.0000 -0.0000
vn -0.0000 -0.0000 1.0000
vn -1.0000 -0.0000 -0.0000
vn -0.0000 -0.0000 -1.0000
vn -0.0000 -1.0000 -0.0000
vn -0.0000 1.0000 -0.0000
vt 0.625000 0.000000
vt 0.375000 0.250000
vt 0.375000 0.000000
vt 0.625000 0.250000
vt 0.375000 0.500000
vt 0.625000 0.500000
vt 0.375000 0.750000
vt 0.625000 0.750000
vt 0.375000 1.000000
vt 0.125000 0.750000
vt 0.125000 0.500000
vt 0.875000 0.500000
vt 0.625000 1.000000
vt 0.875000 0.750000
s 0
f 560/440/64 561/441/64 559/442/64
f 562/443/65 565/444/65 561/441/65
f 566/445/66 563/446/66 565/444/66
f 564/447/67 559/448/67 563/446/67
f 565/444/68 559/449/68 561/450/68
f 562/451/69 564/447/69 566/445/69
f 560/440/64 562/443/64 561/441/64
f 562/443/65 566/445/65 565/444/65
f 566/445/66 564/447/66 563/446/66
f 564/447/67 560/452/67 559/448/67
f 565/444/68 563/446/68 559/449/68
f 562/451/69 560/453/69 564/447/69
o Bonhomme.009
v -18.801609 6.078518 47.680939
v -18.801609 6.071436 47.680939
v -18.801609 6.078518 47.673859
v -18.801609 6.071436 47.673859
v -18.794525 6.078518 47.680939
v -18.794525 6.071436 47.680939
v -18.794525 6.078518 47.673859
v -18.794525 6.071436 47.673859
vn 1.0000 -0.0000 -0.0000
vn -0.0000 -0.0000 1.0000
vn -1.0000 -0.0000 -0.0000
vn -0.0000 -0.0000 -1.0000
vn -0.0000 -1.0000 -0.0000
vn -0.0000 1.0000 -0.0000
vt 0.625000 0.000000
vt 0.375000 0.250000
vt 0.375000 0.000000
vt 0.625000 0.250000
vt 0.375000 0.500000
vt 0.625000 0.500000
vt 0.375000 0.750000
vt 0.625000 0.750000
vt 0.375000 1.000000
vt 0.125000 0.750000
vt 0.125000 0.500000
vt 0.875000 0.500000
vt 0.625000 1.000000
vt 0.875000 0.750000
s 0
f 568/454/70 569/455/70 567/456/70
f 570/457/71 573/458/71 569/455/71
f 574/459/72 571/460/72 573/458/72
f 572/461/73 567/462/73 571/460/73
f 573/458/74 567/463/74 569/464/74
f 570/465/75 572/461/75 574/459/75
f 568/454/70 570/457/70 569/455/70
f 570/457/71 574/459/71 573/458/71
f 574/459/72 572/461/72 571/460/72
f 572/461/73 568/466/73 567/462/73
f 573/458/74 571/460/74 567/463/74
f 570/465/75 568/467/75 572/461/75
o Bonhomme.010
v -15.054660 6.244120 47.846542
v -15.054660 5.905834 47.846542
v -15.054660 6.244120 47.508255
v -15.054660 5.905834 47.508255
v -14.716374 6.244120 47.846542
v -14.716374 5.905834 47.846542
v -14.716374 6.244120 47.508255
v -14.716374 5.905834 47.508255
vn 1.0000 -0.0000 -0.0000
vn -0.0000 -0.0000 1.0000
vn -1.0000 -0.0000 -0.0000
vn -0.0000 -0.0000 -1.0000
vn -0.0000 -1.0000 -0.0000
vn -0.0000 1.0000 -0.0000
vt 0.625000 0.000000
vt 0.375000 0.250000
vt 0.375000 0.000000
vt 0.625000 0.250000
vt 0.375000 0.500000
vt 0.625000 0.500000
vt 0.375000 0.750000
vt 0.625000 0.750000
vt 0.375000 1.000000
vt 0.125000 0.750000
vt 0.125000 0.500000
vt 0.875000 0.500000
vt 0.625000 1.000000
vt 0.875000 0.750000
s 0
f 576/468/76 577/469/76 575/470/76
f 578/471/77 581/472/77 577/469/77
f 582/473/78 579/474/78 581/472/78
f 580/475/79 575/476/79 579/474/79
f 581/472/80 575/477/80 577/478/80
f 578/479/81 580/475/81 582/473/81
f 576/468/76 578/471/76 577/469/76
f 578/471/77 582/473/77 581/472/77
f 582/473/78 580/475/78 579/474/78
f 580/475/79 576/480/79 575/476/79
f 581/472/80 579/474/80 575/477/80
f 578/479/81 576/481/81 580/475/81
o Bonhomme.011
v -10.290730 6.090114 47.692535
v -10.290730 6.059840 47.692535
v -10.290730 6.090114 47.662262
v -10.290730 6.059840 47.662262
v -10.260455 6.090114 47.692535
v -10.260455 6.059840 47.692535
v -10.260455 6.090114 47.662262
v -10.260455 6.059840 47.662262
vn 1.0000 -0.0000 -0.0000
vn -0.0000 -0.0000 1.0000
vn -1.0000 -0.0000 -0.0000
vn -0.0000 -0.0000 -1.0000
vn -0.0000 -1.0000 -0.0000
vn -0.0000 1.0000 -0.0000
vt 0.625000 0.000000
vt 0.375000 0.250000
vt 0.375000 0.000000
vt 0.625000 0.250000
vt 0.375000 0.500000
vt 0.625000 0.500000
vt 0.375000 0.750000
vt 0.625000 0.750000
vt 0.375000 1.000000
vt 0.125000 0.750000
vt 0.125000 0.500000
vt 0.875000 0.500000
vt 0.625000 1.000000
vt 0.875000 0.750000
s 0
f 584/482/82 585/483/82 583/484/82
f 586/485/83 589/486/83 585/483/83
f 590/487/84 587/488/84 589/486/84
f 588/489/85 583/490/85 587/488/85
f 589/486/86 583/491/86 585/492/86
f 586/493/87 588/489/87 590/487/87
f 584/482/82 586/485/82 585/483/82
f 586/485/83 590/487/83 589/486/83
f 590/487/84 588/489/84 587/488/84
f 588/489/85 584/494/85 583/490/85
f 589/486/86 587/488/86 583/491/86
f 586/493/87 584/495/87 588/489/87
o Bonhomme.012
v -6.095771 6.140345 47.742767
v -6.095771 6.009609 47.742767
v -6.095771 6.140345 47.612030
v -6.095771 6.009609 47.612030
v -5.965035 6.140345 47.742767
v -5.965035 6.009609 47.742767
v -5.965035 6.140345 47.612030
v -5.965035 6.009609 47.612030
vn 1.0000 -0.0000 -0.0000
vn -0.0000 -0.0000 1.0000
vn -1.0000 -0.0000 -0.0000
vn -0.0000 -0.0000 -1.0000
vn -0.0000 -1.0000 -0.0000
vn -0.0000 1.0000 -0.0000
vt 0.625000 0.000000
vt 0.375000 0.250000
vt 0.375000 0.000000
vt 0.625000 0.250000
vt 0.375000 0.500000
vt 0.625000 0.500000
vt 0.375000 0.750000
vt 0.625000 0.750000
vt 0.375000 1.000000
vt 0.125000 0.750000
vt 0.125000 0.500000
vt 0.875000 0.500000
vt 0.625000 1.000000
vt 0.875000 0.750000
s 0
f 592/496/88 593/497/88 591/498/88
f 594/499/89 597/500/89 593/497/89
f 598/501/90 595/502/90 597/500/90
f 596/503/91 591/504/91 595/502/91
f 597/500/92 591/505/92 593/506/92
f 594/507/93 596/503/93 598/501/93
f 592/496/88 594/499/88 593/497/88
f 594/499/89 598/501/89 597/500/89
f 598/501/90 596/503/90 595/502/90
f 596/503/91 592/508/91 591/504/91
f 597/500/92 595/502/92 591/505/92
f 594/507/93 592/509/93 596/503/93
o Bonhomme.013
v -18.801609 6.078518 41.993584
v -18.801609 6.071436 41.993584
v -18.801609 6.078518 41.986504
v -18.801609 6.071436 41.986504
v -18.794525 6.078518 41.993584
v -18.794525 6.071436 41.993584
v -18.794525 6.078518 41.986504
v -18.794525 6.071436 41.986504
vn 1.0000 -0.0000 -0.0000
vn -0.0000 -0.0000 1.0000
vn -1.0000 -0.0000 -0.0000
vn -0.0000 -0.0000 -1.0000
vn -0.0000 -1.0000 -0.0000
vn -0.0000 1.0000 -0.0000
vt 0.625000 0.000000
vt 0.375000 0.250000
vt 0.375000 0.000000
vt 0.625000 0.250000
vt 0.375000 0.500000
vt 0.625000 0.500000
vt 0.375000 0.750000
vt 0.625000 0.750000
vt 0.375000 1.000000
vt 0.125000 0.750000
vt 0.125000 0.500000
vt 0.875000 0.500000
vt 0.625000 1.000000
vt 0.875000 0.750000
s 0
f 600/510/94 601/511/94 599/512/94
f 602/513/95 605/514/95 601/511/95
f 606/515/96 603/516/96 605/514/96
f 604/517/97 599/518/97 603/516/97
f 605/514/98 599/519/98 601/520/98
f 602/521/99 604/517/99 606/515/99
f 600/510/94 602/513/94 601/511/94
f 602/513/95 606/515/95 605/514/95
f 606/515/96 604/517/96 603/516/96
f 604/517/97 600/522/97 599/518/97
f 605/514/98 603/516/98 599/519/98
f 602/521/99 600/523/99 604/517/99
o Bonhomme.014
v -15.054660 6.244120 42.159187
v -15.054660 5.905834 42.159187
v -15.054660 6.244120 41.820900
v -15.054660 5.905834 41.820900
v -14.716374 6.244120 42.159187
v -14.716374 5.905834 42.159187
v -14.716374 6.244120 41.820900
v -14.716374 5.905834 41.820900
vn 1.0000 -0.0000 -0.0000
vn -0.0000 -0.0000 1.0000
vn -1.0000 -0.0000 -0.0000
vn -0.0000 -0.0000 -1.0000
vn -0.0000 -1.0000 -0.0000
vn -0.0000 1.0000 -0.0000
vt 0.625000 0.000000
vt 0.375000 0.250000
vt 0.375000 0.000000
vt 0.625000 0.250000
vt 0.375000 0.500000
vt 0.625000 0.500000
vt 0.375000 0.750000
vt 0.625000 0.750000
vt 0.375000 1.000000
vt 0.125000 0.750000
vt 0.125000 0.500000
vt 0.875000 0.500000
vt 0.625000 1.000000
vt 0.875000 0.750000
s 0
f 608/524/100 609/525/100 607/526/100
f 610/527/101 613/528/101 609/525/101
f 614/529/102 611/530/102 613/528/102
f 612/531/103 607/532/103 611/530/103
f 613/528/104 607/533/104 609/534/104
f 610/535/105 612/531/105 614/529/105
f 608/524/100 610/527/100 609/525/100
f 610/527/101 614/529/101 613/528/101
f 614/529/102 612/531/102 611/530/102
f 612/531/103 608/536/103 607/532/103
f 613/528/104 611/530/104 607/533/104
f 610/535/105 608/537/105 612/531/105
o Bonhomme.015
v -10.290730 6.090114 42.005180
v -10.290730 6.059840 42.005180
v -10.290730 6.090114 41.974907
v -10.290730 6.059840 41.974907
v -10.260455 6.090114 42.005180
v -10.260455 6.059840 42.005180
v -10.260455 6.090114 41.974907
v -10.260455 6.059840 41.974907
vn 1.0000 -0.0000 -0.0000
vn -0.0000 -0.0000 1.0000
vn -1.0000 -0.0000 -0.0000
vn -0.0000 -0.0000 -1.0000
vn -0.0000 -1.0000 -0.0000
vn -0.0000 1.0000 -0.0000
vt 0.625000 0.000000
vt 0.375000 0.250000
vt 0.375000 0.000000
vt 0.625000 0.250000
vt 0.375000 0.500000
vt 0.625000 0.500000
vt 0.375000 0.750000
vt 0.625000 0.750000
vt 0.375000 1.000000
vt 0.125000 0.750000
vt 0.125000 0.500000
vt 0.875000 0.500000
vt 0.625000 1.000000
vt 0.875000 0.750000
s 0
f 616/538/106 617/539/106 615/540/106
f 618/541/107 621/542/107 617/539/107
f 622/543/108 619/544/108 621/542/108
f 620/545/109 615/546/109 619/544/109
f 621/542/110 615/547/110 617/548/110
f 618/549/111 620/545/111 622/543/111
f 616/538/106 618/541/106 617/539/106
f 618/541/107 622/543/107 621/542/107
f 622/543/108 620/545/108 619/544/108
f 620/545/109 616/550/109 615/546/109
f 621/542/110 619/544/110 615/547/110
f 618/549/111 616/551/111 620/545/111
o Bonhomme.016
v -6.095771 6.140345 42.055412
v -6.095771 6.009609 42.055412
v -6.095771 6.140345 41.924675
v -6.095771 6.009609 41.924675
v -5.965035 6.140345 42.055412
v -5.965035 6.009609 42.055412
v -5.965035 6.140345 41.924675
v -5.965035 6.009609 41.924675
vn 1.0000 -0.0000 -0.0000
vn -0.0000 -0.0000 1.0000
vn -1.0000 -0.0000 -0.0000
vn -0.0000 -0.0000 -1.0000
vn -0.0000 -1.0000 -0.0000
vn -0.0000 1.0000 -0.0000
vt 0.625000 0.000000
vt 0.375000 0.250000
vt 0.375000 0.000000
vt 0.625000 0.250000
vt 0.375000 0.500000
vt 0.625000 0.500000
vt 0.375000 0.750000
vt 0.625000 0.750000
vt 0.375000 1.000000
vt 0.125000 0.750000
vt 0.125000 0.500000
vt 0.875000 0.500000
vt 0.625000 1.000000
vt 0.875000 0.750000
s 0
f 624/552/112 625/553/112 623/554/112
f 626/555/113 629/556/113 625/553/113
f 630/557/114 627/558/114 629/556/114
f 628/559/115 623/560/115 627/558/115
f 629/556/116 623/561/116 625/562/116
f 626/563/117 628/559/117 630/557/117
f 624/552/112 626/555/112 625/553/112
f 626/555/113 630/557/113 629/556/113
f 630/557/114 628/559/114 627/558/114
f 628/559/115 624/564/115 623/560/115
f 629/556/116 627/558/116 623/561/116
f 626/563/117 624/565/117 628/559/117
o Bonhomme.017.R
v 9.196050 6.437624 45.395824
v 7.196050 6.437624 45.395824
v 9.196050 8.437624 45.395824
v 7.196050 8.437624 45.395824
vn -0.0000 -0.0000 -1.0000
vt 1.000000 0.000000
vt 0.000000 1.000000
vt 0.000000 0.000000
vt 1.000000 1.000000
s 0
f 632/566/118 633/567/118 631/568/118
f 632/566/118 634/569/118 633/567/118
