<svg width="100" height="100" viewBox="0 0 100 100" fill="#FFFFFF" xmlns="http://www.w3.org/2000/svg">
  <g clip-path="url(#clip0)">
    <path
      d="M62.4993 54.1672C60.1953 54.1672 58.333 56.0341 58.333 58.3336V75.0006C58.333 77.2962 56.4661 79.1669 54.1658 79.1669H41.666V16.6676C41.666 13.1093 39.3993 9.93014 35.9913 8.74683L34.7576 8.33408H54.1658C56.4661 8.33408 58.333 10.2048 58.333 12.5012V25.0011C58.333 27.3006 60.1953 29.1675 62.4993 29.1675C64.8034 29.1675 66.6657 27.3006 66.6657 25.0011V12.5012C66.6657 5.60965 61.0574 0.00134277 54.1658 0.00134277H9.3749C9.21621 0.00134277 9.08346 0.0722955 8.92935 0.0928945C8.7287 0.0761101 8.5372 0.00134277 8.3335 0.00134277C3.7376 0.00134277 0 3.73818 0 8.33408V83.3333C0 86.8916 2.26667 90.0708 5.67468 91.2541L30.75 99.6128C31.5999 99.8752 32.4452 100 33.3332 100C37.9291 100 41.666 96.2627 41.666 91.6668V87.5005H54.1658C61.0574 87.5005 66.6657 81.8921 66.6657 75.0006V58.3336C66.6657 56.0341 64.8034 54.1672 62.4993 54.1672Z"
      fill="#FFFFFF"
    />
    <path
      d="M98.7783 38.7216L82.1113 22.0553C80.9204 20.8636 79.1282 20.5051 77.5703 21.1505C76.0163 21.7967 74.9993 23.3172 74.9993 25.001V37.5009H58.333C56.0328 37.5009 54.1659 39.367 54.1659 41.6672C54.1659 43.9675 56.0328 45.8336 58.333 45.8336H74.9993V58.3335C74.9993 60.0173 76.0163 61.5378 77.5703 62.184C79.1282 62.8294 80.9204 62.4709 82.1113 61.2799L98.7783 44.6129C100.407 42.9841 100.407 40.3504 98.7783 38.7216Z"
      fill="#FFFFFF"
    />
  </g>
  <defs>
    <clipPath id="clip0">
      <rect width="100" height="100" fill="#FFFFFF" />
    </clipPath>
  </defs>
</svg>
