jour,S,I,E,R,
0,19980.0,20.0,0.0,0.0,
1,19964.0,20.0,16.0,0.0,
2,19888.0,25.0,87.0,0.0,
3,19787.0,43.0,170.0,0.0,
4,19625.0,69.0,301.0,5.0,
5,19303.0,153.0,530.0,14.0,
6,18567.0,282.0,1117.0,34.0,
7,17519.0,510.0,1907.0,64.0,
8,15483.0,959.0,3422.0,136.0,
9,12765.0,1687.0,5282.0,266.0,
10,8958.0,2892.0,7689.0,461.0,
11,5560.0,4699.0,8894.0,847.0,
12,2392.0,7133.0,9026.0,1449.0,
13,697.0,8746.0,8061.0,2496.0,
14,124.0,9725.0,6397.0,3754.0,
15,29.0,10614.0,4662.0,4695.0,
16,135.0,9848.0,3548.0,6469.0,
17,52.0,9898.0,2544.0,7506.0,
18,72.0,8951.0,1988.0,8989.0,
19,225.0,8606.0,1512.0,9657.0,
20,202.0,7869.0,1318.0,10611.0,
21,119.0,7015.0,1143.0,11723.0,
22,244.0,6570.0,892.0,12294.0,
23,238.0,5746.0,689.0,13327.0,
24,217.0,4800.0,668.0,14315.0,
25,179.0,4262.0,532.0,15027.0,
26,169.0,3663.0,372.0,15796.0,
27,84.0,3272.0,341.0,16303.0,
28,260.0,2606.0,137.0,16997.0,
29,263.0,2088.0,195.0,17454.0,
30,231.0,1726.0,226.0,17817.0,
31,306.0,1371.0,200.0,18123.0,
32,319.0,1129.0,186.0,18366.0,
33,364.0,994.0,123.0,18519.0,
34,582.0,938.0,128.0,18352.0,
35,714.0,672.0,166.0,18448.0,
36,923.0,591.0,166.0,18320.0,
37,1176.0,588.0,137.0,18099.0,
38,1331.0,569.0,162.0,17938.0,
39,1477.0,578.0,184.0,17761.0,
40,1642.0,609.0,251.0,17498.0,
41,1600.0,529.0,375.0,17496.0,
42,1455.0,603.0,402.0,17540.0,
43,1305.0,657.0,478.0,17560.0,
44,1248.0,747.0,339.0,17666.0,
45,1155.0,682.0,361.0,17802.0,
46,1102.0,740.0,327.0,17831.0,
47,982.0,703.0,334.0,17981.0,
48,908.0,794.0,282.0,18016.0,
49,906.0,779.0,263.0,18052.0,
50,847.0,732.0,239.0,18182.0,
51,898.0,749.0,178.0,18175.0,
52,881.0,695.0,189.0,18235.0,
53,874.0,718.0,193.0,18215.0,
54,936.0,631.0,273.0,18160.0,
55,923.0,549.0,260.0,18268.0,
56,916.0,546.0,137.0,18401.0,
57,958.0,444.0,96.0,18502.0,
58,918.0,345.0,135.0,18602.0,
59,973.0,280.0,112.0,18635.0,
60,1006.0,324.0,74.0,18596.0,
61,1180.0,242.0,77.0,18501.0,
62,1253.0,203.0,62.0,18482.0,
63,1329.0,206.0,60.0,18405.0,
64,1419.0,189.0,56.0,18336.0,
65,1464.0,157.0,69.0,18310.0,
66,1553.0,153.0,89.0,18205.0,
67,1547.0,191.0,74.0,18188.0,
68,1674.0,199.0,60.0,18067.0,
69,1779.0,161.0,87.0,17973.0,
70,1880.0,157.0,107.0,17856.0,
71,2011.0,184.0,93.0,17712.0,
72,2120.0,185.0,111.0,17584.0,
73,2345.0,151.0,169.0,17335.0,
74,2474.0,179.0,120.0,17227.0,
75,2694.0,149.0,147.0,17010.0,
76,2888.0,144.0,167.0,16801.0,
77,2915.0,188.0,182.0,16715.0,
78,3119.0,196.0,204.0,16481.0,
79,3075.0,213.0,241.0,16471.0,
80,3142.0,231.0,258.0,16369.0,
81,3190.0,271.0,321.0,16218.0,
82,3047.0,370.0,384.0,16199.0,
83,2897.0,414.0,529.0,16160.0,
84,2834.0,512.0,447.0,16207.0,
85,2695.0,613.0,414.0,16278.0,
86,2435.0,665.0,591.0,16309.0,
87,2376.0,736.0,613.0,16275.0,
88,2172.0,824.0,670.0,16334.0,
89,2033.0,816.0,722.0,16429.0,
90,1864.0,1004.0,524.0,16608.0,
91,1829.0,948.0,551.0,16672.0,
92,1692.0,844.0,583.0,16881.0,
93,1684.0,856.0,701.0,16759.0,
94,1651.0,883.0,695.0,16771.0,
95,1594.0,871.0,606.0,16929.0,
96,1637.0,865.0,523.0,16975.0,
97,1697.0,790.0,503.0,17010.0,
98,1648.0,817.0,502.0,17033.0,
99,1587.0,830.0,535.0,17048.0,
100,1548.0,887.0,467.0,17098.0,
101,1395.0,929.0,509.0,17167.0,
102,1363.0,820.0,479.0,17338.0,
103,1273.0,814.0,569.0,17344.0,
104,1165.0,932.0,492.0,17411.0,
105,1111.0,999.0,429.0,17461.0,
106,1087.0,960.0,349.0,17604.0,
107,1049.0,981.0,394.0,17576.0,
108,997.0,961.0,417.0,17625.0,
109,1078.0,971.0,452.0,17499.0,
110,1047.0,959.0,462.0,17532.0,
111,1071.0,927.0,381.0,17621.0,
112,1108.0,1007.0,277.0,17608.0,
113,1050.0,950.0,323.0,17677.0,
114,1078.0,975.0,349.0,17598.0,
115,1116.0,1008.0,248.0,17628.0,
116,1104.0,964.0,265.0,17667.0,
117,1243.0,821.0,276.0,17660.0,
118,1323.0,790.0,348.0,17539.0,
119,1337.0,799.0,335.0,17529.0,
120,1292.0,749.0,322.0,17637.0,
121,1293.0,652.0,389.0,17666.0,
122,1255.0,711.0,370.0,17664.0,
123,1238.0,713.0,371.0,17678.0,
124,1225.0,808.0,280.0,17687.0,
125,1215.0,703.0,313.0,17769.0,
126,1255.0,669.0,305.0,17771.0,
127,1245.0,672.0,311.0,17772.0,
128,1329.0,635.0,313.0,17723.0,
129,1352.0,644.0,283.0,17721.0,
130,1480.0,664.0,332.0,17524.0,
131,1522.0,689.0,316.0,17473.0,
132,1510.0,695.0,228.0,17567.0,
133,1453.0,654.0,235.0,17658.0,
134,1430.0,567.0,292.0,17711.0,
135,1370.0,525.0,373.0,17732.0,
136,1395.0,531.0,403.0,17671.0,
137,1370.0,652.0,334.0,17644.0,
138,1374.0,641.0,307.0,17678.0,
139,1357.0,635.0,251.0,17757.0,
140,1366.0,593.0,267.0,17774.0,
141,1381.0,577.0,258.0,17784.0,
142,1423.0,557.0,295.0,17725.0,
143,1576.0,527.0,265.0,17632.0,
144,1714.0,531.0,265.0,17490.0,
145,1871.0,483.0,295.0,17351.0,
146,1990.0,435.0,318.0,17257.0,
147,2010.0,466.0,311.0,17213.0,
148,2011.0,485.0,353.0,17151.0,
149,2077.0,470.0,363.0,17090.0,
150,2070.0,563.0,298.0,17069.0,
151,2116.0,515.0,339.0,17030.0,
152,2122.0,537.0,356.0,16985.0,
153,2184.0,584.0,426.0,16806.0,
154,2229.0,565.0,444.0,16762.0,
155,2369.0,619.0,511.0,16501.0,
156,2293.0,642.0,578.0,16487.0,
157,2238.0,691.0,572.0,16499.0,
158,2148.0,759.0,565.0,16528.0,
159,2021.0,816.0,632.0,16531.0,
160,2019.0,819.0,633.0,16529.0,
161,2000.0,777.0,658.0,16565.0,
162,1916.0,799.0,558.0,16727.0,
163,1840.0,861.0,539.0,16760.0,
164,1883.0,853.0,601.0,16663.0,
165,1765.0,907.0,697.0,16631.0,
166,1691.0,1044.0,590.0,16675.0,
167,1619.0,965.0,706.0,16710.0,
168,1505.0,1019.0,694.0,16782.0,
169,1368.0,1099.0,785.0,16748.0,
170,1299.0,1165.0,716.0,16820.0,
171,1197.0,1221.0,593.0,16989.0,
172,1144.0,1154.0,619.0,17083.0,
173,1074.0,1183.0,480.0,17263.0,
174,1006.0,1061.0,451.0,17482.0,
175,1039.0,1025.0,479.0,17457.0,
176,1015.0,1062.0,412.0,17511.0,
177,1047.0,964.0,412.0,17577.0,
178,1036.0,923.0,416.0,17625.0,
179,1029.0,907.0,349.0,17715.0,
180,1051.0,811.0,314.0,17824.0,
181,1104.0,741.0,302.0,17853.0,
182,1181.0,669.0,269.0,17881.0,
183,1204.0,669.0,237.0,17890.0,
184,1366.0,623.0,220.0,17791.0,
185,1584.0,579.0,244.0,17593.0,
186,1613.0,516.0,332.0,17539.0,
187,1631.0,506.0,329.0,17534.0,
188,1647.0,549.0,293.0,17511.0,
189,1666.0,554.0,264.0,17516.0,
190,1671.0,455.0,247.0,17627.0,
191,1723.0,458.0,257.0,17562.0,
192,1753.0,492.0,221.0,17534.0,
193,1733.0,495.0,246.0,17526.0,
194,1745.0,534.0,206.0,17515.0,
195,1742.0,520.0,200.0,17538.0,
196,1719.0,468.0,278.0,17535.0,
197,1718.0,498.0,301.0,17483.0,
198,1735.0,494.0,378.0,17393.0,
199,1754.0,517.0,329.0,17400.0,
200,1708.0,571.0,308.0,17413.0,
201,1734.0,604.0,267.0,17395.0,
202,1673.0,562.0,309.0,17456.0,
203,1701.0,561.0,314.0,17424.0,
204,1738.0,581.0,310.0,17371.0,
205,1733.0,582.0,289.0,17396.0,
206,1812.0,575.0,266.0,17347.0,
207,1895.0,564.0,332.0,17209.0,
208,2022.0,564.0,393.0,17021.0,
209,2043.0,658.0,342.0,16957.0,
210,2041.0,743.0,298.0,16918.0,
211,1896.0,734.0,482.0,16888.0,
212,1792.0,718.0,519.0,16971.0,
213,1723.0,802.0,503.0,16972.0,
214,1531.0,929.0,560.0,16980.0,
215,1462.0,959.0,482.0,17097.0,
216,1373.0,990.0,465.0,17172.0,
217,1378.0,948.0,486.0,17188.0,
218,1378.0,1005.0,340.0,17277.0,
219,1439.0,1006.0,444.0,17111.0,
220,1412.0,890.0,481.0,17217.0,
221,1376.0,914.0,470.0,17240.0,
222,1320.0,942.0,492.0,17246.0,
223,1305.0,888.0,451.0,17356.0,
224,1304.0,860.0,466.0,17370.0,
225,1405.0,888.0,447.0,17260.0,
226,1392.0,852.0,484.0,17272.0,
227,1407.0,823.0,505.0,17265.0,
228,1418.0,855.0,483.0,17244.0,
229,1445.0,885.0,438.0,17232.0,
230,1410.0,849.0,408.0,17333.0,
231,1391.0,783.0,478.0,17348.0,
232,1401.0,765.0,495.0,17339.0,
233,1430.0,791.0,449.0,17330.0,
234,1430.0,814.0,428.0,17328.0,
235,1421.0,833.0,349.0,17397.0,
236,1476.0,779.0,430.0,17315.0,
237,1468.0,813.0,355.0,17364.0,
238,1467.0,845.0,367.0,17321.0,
239,1468.0,830.0,397.0,17305.0,
240,1483.0,884.0,368.0,17265.0,
241,1486.0,856.0,357.0,17301.0,
242,1433.0,824.0,459.0,17284.0,
243,1471.0,808.0,493.0,17228.0,
244,1510.0,863.0,444.0,17183.0,
245,1642.0,899.0,429.0,17030.0,
246,1782.0,792.0,570.0,16856.0,
247,1862.0,874.0,639.0,16625.0,
248,1864.0,947.0,627.0,16562.0,
249,1849.0,1029.0,685.0,16437.0,
250,1775.0,1152.0,574.0,16499.0,
251,1815.0,1138.0,489.0,16558.0,
252,1728.0,1173.0,651.0,16448.0,
253,1652.0,1292.0,622.0,16434.0,
254,1500.0,1326.0,838.0,16336.0,
255,1357.0,1428.0,832.0,16383.0,
256,1297.0,1570.0,750.0,16383.0,
257,1196.0,1505.0,789.0,16510.0,
258,1115.0,1537.0,781.0,16567.0,
259,1014.0,1585.0,755.0,16646.0,
260,990.0,1577.0,634.0,16799.0,
261,900.0,1504.0,605.0,16991.0,
262,863.0,1351.0,547.0,17239.0,
263,828.0,1266.0,448.0,17458.0,
264,850.0,1127.0,461.0,17562.0,
265,874.0,989.0,396.0,17741.0,
266,926.0,916.0,326.0,17832.0,
267,1004.0,813.0,337.0,17846.0,
268,1080.0,733.0,283.0,17904.0,
269,1185.0,669.0,306.0,17840.0,
270,1255.0,673.0,279.0,17793.0,
271,1319.0,631.0,243.0,17807.0,
272,1345.0,631.0,265.0,17759.0,
273,1376.0,555.0,321.0,17748.0,
274,1436.0,458.0,303.0,17803.0,
275,1464.0,496.0,277.0,17763.0,
276,1506.0,454.0,257.0,17783.0,
277,1738.0,458.0,270.0,17534.0,
278,1804.0,435.0,323.0,17438.0,
279,1826.0,434.0,320.0,17420.0,
280,1877.0,470.0,303.0,17350.0,
281,1998.0,459.0,324.0,17219.0,
282,2062.0,459.0,297.0,17182.0,
283,2136.0,463.0,304.0,17097.0,
284,2320.0,501.0,370.0,16809.0,
285,2320.0,534.0,383.0,16763.0,
286,2334.0,532.0,479.0,16655.0,
287,2303.0,617.0,534.0,16546.0,
288,2214.0,670.0,643.0,16473.0,
289,2212.0,762.0,665.0,16361.0,
290,2300.0,780.0,606.0,16314.0,
291,2198.0,845.0,675.0,16282.0,
292,2156.0,882.0,723.0,16239.0,
293,2187.0,890.0,765.0,16158.0,
294,2075.0,916.0,811.0,16198.0,
295,2016.0,960.0,807.0,16217.0,
296,1882.0,1027.0,780.0,16311.0,
297,1858.0,1072.0,740.0,16330.0,
298,1792.0,1151.0,736.0,16321.0,
299,1586.0,1234.0,875.0,16305.0,
300,1419.0,1244.0,923.0,16414.0,
301,1383.0,1207.0,870.0,16540.0,
302,1331.0,1248.0,874.0,16547.0,
303,1292.0,1372.0,847.0,16489.0,
304,1190.0,1376.0,833.0,16601.0,
305,1145.0,1543.0,702.0,16610.0,
306,1073.0,1507.0,717.0,16703.0,
307,1200.0,1458.0,615.0,16727.0,
308,1186.0,1394.0,495.0,16925.0,
309,1229.0,1426.0,591.0,16754.0,
310,1203.0,1248.0,619.0,16930.0,
311,1216.0,1294.0,528.0,16962.0,
312,1238.0,1362.0,444.0,16956.0,
313,1220.0,1279.0,508.0,16993.0,
314,1211.0,1265.0,536.0,16988.0,
315,1209.0,1279.0,445.0,17067.0,
316,1230.0,1233.0,391.0,17146.0,
317,1290.0,1220.0,402.0,17088.0,
318,1366.0,1175.0,480.0,16979.0,
319,1363.0,1162.0,435.0,17040.0,
320,1384.0,1163.0,432.0,17021.0,
321,1380.0,1104.0,529.0,16987.0,
322,1400.0,1169.0,517.0,16914.0,
323,1373.0,1173.0,540.0,16914.0,
324,1293.0,1094.0,625.0,16988.0,
325,1290.0,1182.0,528.0,17000.0,
326,1199.0,1265.0,525.0,17011.0,
327,1146.0,1250.0,475.0,17129.0,
328,1084.0,1236.0,502.0,17178.0,
329,1059.0,1295.0,421.0,17225.0,
330,994.0,1249.0,403.0,17354.0,
331,974.0,1236.0,391.0,17399.0,
332,992.0,1233.0,336.0,17439.0,
333,965.0,1203.0,356.0,17476.0,
334,970.0,1140.0,355.0,17535.0,
335,967.0,1125.0,369.0,17539.0,
336,974.0,1108.0,355.0,17563.0,
337,971.0,1111.0,360.0,17558.0,
338,996.0,1002.0,341.0,17661.0,
339,999.0,953.0,323.0,17725.0,
340,1074.0,894.0,326.0,17706.0,
341,1124.0,846.0,246.0,17784.0,
342,1163.0,803.0,248.0,17786.0,
343,1274.0,719.0,276.0,17731.0,
344,1331.0,620.0,322.0,17727.0,
345,1330.0,627.0,369.0,17674.0,
346,1394.0,587.0,297.0,17722.0,
347,1401.0,522.0,312.0,17765.0,
348,1469.0,489.0,333.0,17709.0,
349,1511.0,493.0,334.0,17662.0,
350,1550.0,466.0,378.0,17606.0,
351,1592.0,496.0,376.0,17536.0,
352,1587.0,548.0,342.0,17523.0,
353,1589.0,572.0,322.0,17517.0,
354,1618.0,525.0,353.0,17504.0,
355,1675.0,484.0,353.0,17488.0,
356,1716.0,489.0,310.0,17485.0,
357,1756.0,458.0,311.0,17475.0,
358,1908.0,464.0,319.0,17309.0,
359,1987.0,446.0,330.0,17237.0,
360,2099.0,436.0,349.0,17116.0,
361,2165.0,493.0,344.0,16998.0,
362,2107.0,495.0,438.0,16960.0,
363,2104.0,455.0,443.0,16998.0,
364,2061.0,503.0,452.0,16984.0,
365,2007.0,561.0,453.0,16979.0,
366,1978.0,510.0,478.0,17034.0,
367,1983.0,587.0,409.0,17021.0,
368,1965.0,483.0,480.0,17072.0,
369,1993.0,470.0,451.0,17086.0,
370,2051.0,503.0,400.0,17046.0,
371,2149.0,521.0,356.0,16974.0,
372,2174.0,497.0,408.0,16921.0,
373,2284.0,473.0,474.0,16769.0,
374,2276.0,576.0,436.0,16712.0,
375,2268.0,612.0,398.0,16722.0,
376,2254.0,658.0,403.0,16685.0,
377,2286.0,641.0,473.0,16600.0,
378,2333.0,668.0,499.0,16500.0,
379,2332.0,722.0,494.0,16452.0,
380,2267.0,765.0,547.0,16421.0,
381,2236.0,918.0,480.0,16366.0,
382,2131.0,866.0,577.0,16426.0,
383,2007.0,926.0,646.0,16421.0,
384,2008.0,1077.0,628.0,16287.0,
385,1808.0,1148.0,689.0,16355.0,
386,1705.0,1147.0,670.0,16478.0,
387,1543.0,1163.0,723.0,16571.0,
388,1496.0,1129.0,676.0,16699.0,
389,1449.0,1203.0,542.0,16806.0,
390,1376.0,1041.0,641.0,16942.0,
391,1309.0,940.0,702.0,17049.0,
392,1307.0,925.0,679.0,17089.0,
393,1266.0,1031.0,620.0,17083.0,
394,1234.0,1056.0,541.0,17169.0,
395,1219.0,1127.0,497.0,17157.0,
396,1219.0,1115.0,477.0,17189.0,
397,1167.0,1142.0,436.0,17255.0,
398,1243.0,1049.0,459.0,17249.0,
399,1212.0,1059.0,378.0,17351.0,
400,1216.0,1020.0,409.0,17355.0,
401,1159.0,906.0,464.0,17471.0,
402,1151.0,944.0,498.0,17407.0,
403,1171.0,956.0,454.0,17419.0,
404,1178.0,961.0,440.0,17421.0,
405,1255.0,1005.0,422.0,17318.0,
406,1359.0,1031.0,376.0,17234.0,
407,1440.0,1085.0,366.0,17109.0,
408,1536.0,1050.0,402.0,17012.0,
409,1528.0,1021.0,360.0,17091.0,
410,1445.0,1018.0,414.0,17123.0,
411,1498.0,906.0,535.0,17061.0,
412,1453.0,854.0,584.0,17109.0,
413,1448.0,887.0,606.0,17059.0,
414,1477.0,861.0,597.0,17065.0,
415,1518.0,813.0,604.0,17065.0,
416,1526.0,778.0,678.0,17018.0,
417,1515.0,889.0,610.0,16986.0,
418,1456.0,929.0,637.0,16978.0,
419,1392.0,884.0,770.0,16954.0,
420,1423.0,850.0,694.0,17033.0,
421,1391.0,911.0,552.0,17146.0,
422,1330.0,918.0,550.0,17202.0,
423,1332.0,971.0,457.0,17240.0,
424,1343.0,920.0,492.0,17245.0,
425,1372.0,882.0,537.0,17209.0,
426,1328.0,959.0,458.0,17255.0,
427,1344.0,941.0,471.0,17244.0,
428,1538.0,767.0,495.0,17200.0,
429,1585.0,799.0,450.0,17166.0,
430,1654.0,742.0,480.0,17124.0,
431,1669.0,718.0,457.0,17156.0,
432,1686.0,704.0,406.0,17204.0,
433,1724.0,725.0,391.0,17160.0,
434,1720.0,681.0,377.0,17222.0,
435,1712.0,613.0,526.0,17149.0,
436,1769.0,642.0,469.0,17120.0,
437,1789.0,682.0,453.0,17076.0,
438,1806.0,668.0,486.0,17040.0,
439,1814.0,647.0,475.0,17064.0,
440,1752.0,730.0,534.0,16984.0,
441,1707.0,733.0,543.0,17017.0,
442,1686.0,731.0,525.0,17058.0,
443,1690.0,764.0,526.0,17020.0,
444,1659.0,824.0,527.0,16990.0,
445,1606.0,793.0,585.0,17016.0,
446,1600.0,792.0,575.0,17033.0,
447,1562.0,797.0,626.0,17015.0,
448,1594.0,823.0,547.0,17036.0,
449,1604.0,730.0,676.0,16990.0,
450,1626.0,806.0,661.0,16907.0,
451,1609.0,890.0,550.0,16951.0,
452,1615.0,853.0,610.0,16922.0,
453,1601.0,832.0,576.0,16991.0,
454,1658.0,828.0,550.0,16964.0,
455,1662.0,845.0,575.0,16918.0,
456,1648.0,845.0,518.0,16989.0,
457,1650.0,794.0,573.0,16983.0,
458,1632.0,823.0,625.0,16920.0,
459,1585.0,954.0,606.0,16855.0,
460,1495.0,1026.0,656.0,16823.0,
461,1402.0,1108.0,655.0,16835.0,
462,1388.0,1191.0,672.0,16749.0,
463,1333.0,1188.0,646.0,16833.0,
464,1300.0,1329.0,497.0,16874.0,
465,1184.0,1273.0,567.0,16976.0,
466,1171.0,1202.0,526.0,17101.0,
467,1144.0,1214.0,490.0,17152.0,
468,1123.0,1157.0,472.0,17248.0,
469,1086.0,1170.0,489.0,17255.0,
470,1110.0,1165.0,436.0,17289.0,
471,1104.0,1154.0,486.0,17256.0,
472,1101.0,1153.0,458.0,17288.0,
473,1104.0,1199.0,407.0,17290.0,
474,1080.0,1079.0,453.0,17388.0,
475,1117.0,1033.0,499.0,17351.0,
476,1140.0,989.0,443.0,17428.0,
477,1173.0,916.0,473.0,17438.0,
478,1193.0,919.0,415.0,17473.0,
479,1261.0,892.0,398.0,17449.0,
480,1307.0,822.0,378.0,17493.0,
481,1386.0,843.0,433.0,17338.0,
482,1404.0,919.0,421.0,17256.0,
483,1422.0,949.0,411.0,17218.0,
484,1462.0,935.0,491.0,17112.0,
485,1535.0,960.0,509.0,16996.0,
486,1547.0,972.0,495.0,16986.0,
487,1560.0,945.0,536.0,16959.0,
488,1604.0,992.0,597.0,16807.0,
489,1583.0,1077.0,605.0,16735.0,
490,1686.0,1167.0,614.0,16533.0,
491,1704.0,1194.0,708.0,16394.0,
492,1644.0,1277.0,713.0,16366.0,
493,1606.0,1284.0,759.0,16351.0,
494,1493.0,1344.0,904.0,16259.0,
495,1380.0,1593.0,778.0,16249.0,
496,1305.0,1603.0,743.0,16349.0,
497,1209.0,1557.0,749.0,16485.0,
498,1161.0,1589.0,673.0,16577.0,
499,1093.0,1687.0,526.0,16694.0,
500,992.0,1621.0,617.0,16770.0,
501,947.0,1539.0,583.0,16931.0,
502,974.0,1514.0,535.0,16977.0,
503,971.0,1412.0,550.0,17067.0,
504,962.0,1314.0,497.0,17227.0,
505,1029.0,1234.0,509.0,17228.0,
506,1031.0,1173.0,446.0,17350.0,
507,1143.0,1125.0,450.0,17282.0,
508,1205.0,1029.0,448.0,17318.0,
509,1214.0,1022.0,514.0,17250.0,
510,1174.0,999.0,561.0,17266.0,
511,1170.0,1003.0,543.0,17284.0,
512,1161.0,978.0,516.0,17345.0,
513,1171.0,970.0,526.0,17333.0,
514,1187.0,952.0,554.0,17307.0,
515,1200.0,912.0,512.0,17376.0,
516,1214.0,901.0,462.0,17423.0,
517,1259.0,936.0,457.0,17348.0,
518,1240.0,902.0,452.0,17406.0,
519,1260.0,850.0,438.0,17452.0,
520,1237.0,865.0,404.0,17494.0,
521,1259.0,789.0,400.0,17552.0,
522,1304.0,742.0,410.0,17544.0,
523,1345.0,759.0,375.0,17521.0,
524,1414.0,651.0,409.0,17526.0,
525,1487.0,629.0,364.0,17520.0,
526,1530.0,616.0,386.0,17468.0,
527,1615.0,642.0,402.0,17341.0,
528,1631.0,618.0,381.0,17370.0,
529,1687.0,613.0,396.0,17304.0,
530,1758.0,592.0,439.0,17211.0,
531,1756.0,598.0,420.0,17226.0,
532,1806.0,625.0,457.0,17112.0,
533,1789.0,606.0,434.0,17171.0,
534,1756.0,663.0,450.0,17131.0,
535,1689.0,606.0,557.0,17148.0,
536,1679.0,578.0,608.0,17135.0,
537,1679.0,625.0,560.0,17136.0,
538,1639.0,668.0,561.0,17132.0,
539,1615.0,685.0,580.0,17120.0,
540,1577.0,701.0,591.0,17131.0,
541,1547.0,738.0,565.0,17150.0,
542,1528.0,757.0,613.0,17102.0,
543,1505.0,796.0,515.0,17184.0,
544,1558.0,784.0,519.0,17139.0,
545,1603.0,750.0,549.0,17098.0,
546,1634.0,730.0,533.0,17103.0,
547,1675.0,761.0,475.0,17089.0,
548,1778.0,748.0,435.0,17039.0,
549,1787.0,678.0,463.0,17072.0,
550,1843.0,678.0,487.0,16992.0,
551,1977.0,688.0,486.0,16849.0,
552,2071.0,717.0,489.0,16723.0,
553,2084.0,700.0,530.0,16686.0,
554,2021.0,705.0,706.0,16568.0,
555,2029.0,842.0,579.0,16550.0,
556,1963.0,817.0,703.0,16517.0,
557,1931.0,797.0,734.0,16538.0,
558,1870.0,816.0,743.0,16571.0,
559,1842.0,851.0,780.0,16527.0,
560,1742.0,965.0,779.0,16514.0,
561,1631.0,1112.0,734.0,16523.0,
562,1526.0,1210.0,739.0,16525.0,
563,1473.0,1327.0,594.0,16606.0,
564,1420.0,1239.0,656.0,16685.0,
565,1350.0,1264.0,646.0,16740.0,
566,1299.0,1358.0,567.0,16776.0,
567,1266.0,1277.0,614.0,16843.0,
568,1298.0,1317.0,586.0,16799.0,
569,1262.0,1194.0,583.0,16961.0,
570,1228.0,1137.0,577.0,17058.0,
571,1278.0,1149.0,549.0,17024.0,
572,1293.0,1142.0,531.0,17034.0,
573,1311.0,1036.0,524.0,17129.0,
574,1327.0,949.0,538.0,17186.0,
575,1366.0,967.0,492.0,17175.0,
576,1386.0,956.0,487.0,17171.0,
577,1369.0,1003.0,480.0,17148.0,
578,1373.0,956.0,524.0,17147.0,
579,1429.0,909.0,547.0,17115.0,
580,1430.0,927.0,571.0,17072.0,
581,1392.0,967.0,540.0,17101.0,
582,1382.0,1022.0,547.0,17049.0,
583,1446.0,1018.0,509.0,17027.0,
584,1413.0,973.0,568.0,17046.0,
585,1382.0,891.0,654.0,17073.0,
586,1369.0,960.0,576.0,17095.0,
587,1370.0,955.0,551.0,17124.0,
588,1372.0,995.0,559.0,17074.0,
589,1315.0,957.0,557.0,17171.0,
590,1303.0,962.0,525.0,17210.0,
591,1284.0,947.0,495.0,17274.0,
592,1291.0,1010.0,477.0,17222.0,
593,1262.0,1006.0,541.0,17191.0,
594,1245.0,1052.0,517.0,17186.0,
595,1215.0,1078.0,454.0,17253.0,
596,1200.0,996.0,441.0,17363.0,
597,1212.0,975.0,421.0,17392.0,
598,1197.0,910.0,457.0,17436.0,
599,1242.0,902.0,382.0,17474.0,
600,1230.0,834.0,370.0,17566.0,
601,1221.0,827.0,384.0,17568.0,
602,1285.0,784.0,379.0,17552.0,
603,1325.0,825.0,359.0,17491.0,
604,1321.0,830.0,329.0,17520.0,
605,1406.0,768.0,370.0,17456.0,
606,1469.0,762.0,408.0,17361.0,
607,1498.0,784.0,373.0,17345.0,
608,1561.0,770.0,389.0,17280.0,
609,1618.0,805.0,355.0,17222.0,
610,1644.0,779.0,378.0,17199.0,
611,1619.0,775.0,421.0,17185.0,
612,1642.0,780.0,397.0,17181.0,
613,1667.0,795.0,390.0,17148.0,
614,1650.0,812.0,386.0,17152.0,
615,1692.0,811.0,463.0,17034.0,
616,1681.0,871.0,495.0,16953.0,
617,1642.0,923.0,457.0,16978.0,
618,1620.0,932.0,494.0,16954.0,
619,1572.0,909.0,574.0,16945.0,
620,1534.0,959.0,614.0,16893.0,
621,1479.0,1010.0,541.0,16970.0,
622,1450.0,1060.0,556.0,16934.0,
623,1435.0,1064.0,551.0,16950.0,
624,1452.0,1118.0,459.0,16971.0,
625,1369.0,1053.0,541.0,17037.0,
626,1321.0,1051.0,642.0,16986.0,
627,1323.0,1110.0,559.0,17008.0,
628,1402.0,1060.0,579.0,16959.0,
629,1451.0,1093.0,583.0,16873.0,
630,1439.0,1169.0,631.0,16761.0,
631,1401.0,1117.0,736.0,16746.0,
632,1348.0,1188.0,796.0,16668.0,
633,1319.0,1289.0,691.0,16701.0,
634,1281.0,1279.0,740.0,16700.0,
635,1228.0,1377.0,655.0,16740.0,
636,1200.0,1361.0,676.0,16763.0,
637,1204.0,1438.0,534.0,16824.0,
638,1131.0,1344.0,628.0,16897.0,
639,1097.0,1376.0,627.0,16900.0,
640,1073.0,1330.0,647.0,16950.0,
641,1058.0,1353.0,542.0,17047.0,
642,1050.0,1290.0,550.0,17110.0,
643,1036.0,1205.0,528.0,17231.0,
644,1023.0,1169.0,500.0,17308.0,
645,1003.0,1119.0,501.0,17377.0,
646,1013.0,1186.0,387.0,17414.0,
647,1018.0,1136.0,407.0,17439.0,
648,1053.0,1149.0,419.0,17379.0,
649,1104.0,1082.0,449.0,17365.0,
650,1112.0,1097.0,460.0,17331.0,
651,1079.0,1113.0,407.0,17401.0,
652,1100.0,1094.0,390.0,17416.0,
653,1072.0,1066.0,398.0,17464.0,
654,1064.0,1036.0,381.0,17519.0,
655,1068.0,1004.0,384.0,17544.0,
656,1090.0,995.0,408.0,17507.0,
657,1111.0,944.0,409.0,17536.0,
658,1230.0,826.0,397.0,17547.0,
659,1258.0,771.0,361.0,17610.0,
660,1352.0,657.0,304.0,17687.0,
661,1483.0,637.0,297.0,17583.0,
662,1560.0,577.0,315.0,17548.0,
663,1620.0,579.0,303.0,17498.0,
664,1677.0,599.0,315.0,17409.0,
665,1711.0,597.0,308.0,17384.0,
666,1746.0,551.0,343.0,17360.0,
667,1774.0,572.0,275.0,17379.0,
668,1772.0,579.0,264.0,17385.0,
669,1824.0,543.0,295.0,17338.0,
670,1852.0,559.0,367.0,17222.0,
671,1813.0,573.0,411.0,17203.0,
672,1777.0,668.0,385.0,17170.0,
673,1721.0,682.0,448.0,17149.0,
674,1682.0,729.0,412.0,17177.0,
675,1602.0,800.0,453.0,17145.0,
676,1584.0,839.0,519.0,17058.0,
677,1587.0,883.0,464.0,17066.0,
678,1557.0,903.0,491.0,17049.0,
679,1514.0,923.0,544.0,17019.0,
680,1421.0,966.0,623.0,16990.0,
681,1395.0,1034.0,584.0,16987.0,
682,1353.0,1063.0,554.0,17030.0,
683,1308.0,1070.0,585.0,17037.0,
684,1272.0,1025.0,562.0,17141.0,
685,1229.0,1043.0,570.0,17158.0,
686,1178.0,1018.0,576.0,17228.0,
687,1161.0,1091.0,505.0,17243.0,
688,1175.0,1010.0,486.0,17329.0,
689,1175.0,976.0,486.0,17363.0,
690,1142.0,914.0,519.0,17425.0,
691,1135.0,911.0,507.0,17447.0,
692,1126.0,887.0,482.0,17505.0,
693,1123.0,971.0,429.0,17477.0,
694,1119.0,976.0,407.0,17498.0,
695,1170.0,885.0,438.0,17507.0,
696,1171.0,807.0,503.0,17519.0,
697,1204.0,847.0,443.0,17506.0,
698,1254.0,773.0,373.0,17600.0,
699,1286.0,738.0,377.0,17599.0,
700,1293.0,703.0,386.0,17618.0,
701,1333.0,676.0,414.0,17577.0,
702,1376.0,684.0,453.0,17487.0,
703,1364.0,721.0,426.0,17489.0,
704,1373.0,726.0,404.0,17497.0,
705,1386.0,724.0,409.0,17481.0,
706,1414.0,696.0,437.0,17453.0,
707,1453.0,673.0,389.0,17485.0,
708,1473.0,671.0,381.0,17475.0,
709,1451.0,654.0,389.0,17506.0,
710,1530.0,625.0,433.0,17412.0,
711,1566.0,630.0,382.0,17422.0,
712,1590.0,683.0,383.0,17344.0,
713,1627.0,646.0,440.0,17287.0,
714,1778.0,639.0,395.0,17188.0,
715,1795.0,671.0,434.0,17100.0,
716,1859.0,675.0,423.0,17043.0,
717,1888.0,647.0,420.0,17045.0,
718,1866.0,625.0,559.0,16950.0,
719,1825.0,699.0,607.0,16869.0,
720,1827.0,727.0,597.0,16849.0,
721,1813.0,695.0,646.0,16846.0,
722,1814.0,762.0,667.0,16757.0,
723,1825.0,747.0,682.0,16746.0,
724,1943.0,774.0,693.0,16590.0,
725,2024.0,778.0,666.0,16532.0,
726,2082.0,699.0,736.0,16483.0,
727,2227.0,790.0,754.0,16229.0,
728,2193.0,842.0,814.0,16151.0,
729,2037.0,901.0,938.0,16124.0,
730,1944.0,982.0,987.0,16087.0,
