jour,S,I,E,R,
0,19980.0,20.0,0.0,0.0,
1,19963.0,20.0,17.0,0.0,
2,19902.0,24.0,74.0,0.0,
3,19786.0,42.0,172.0,0.0,
4,19576.0,104.0,318.0,2.0,
5,19078.0,222.0,686.0,14.0,
6,18160.0,453.0,1344.0,43.0,
7,16281.0,1001.0,2608.0,110.0,
8,13627.0,1609.0,4470.0,294.0,
9,10032.0,2864.0,6494.0,610.0,
10,6041.0,4098.0,8716.0,1145.0,
11,3242.0,6276.0,8687.0,1795.0,
12,1113.0,8149.0,8074.0,2664.0,
13,397.0,10684.0,5882.0,3037.0,
14,129.0,11316.0,4332.0,4223.0,
15,2.0,11743.0,2651.0,5604.0,
16,0.0,11102.0,1671.0,7227.0,
17,14.0,10074.0,905.0,9007.0,
18,26.0,9109.0,447.0,10418.0,
19,6.0,8252.0,227.0,11515.0,
20,3.0,7425.0,79.0,12493.0,
21,3.0,6720.0,64.0,13213.0,
22,166.0,6066.0,59.0,13709.0,
23,47.0,5153.0,213.0,14587.0,
24,28.0,4629.0,52.0,15291.0,
25,7.0,4201.0,35.0,15757.0,
26,9.0,3825.0,1.0,16165.0,
27,8.0,3088.0,7.0,16897.0,
28,6.0,2117.0,2.0,17875.0,
29,18.0,1746.0,3.0,18233.0,
30,32.0,1395.0,2.0,18571.0,
31,55.0,1201.0,2.0,18742.0,
32,82.0,1003.0,1.0,18914.0,
33,135.0,837.0,1.0,19027.0,
34,123.0,786.0,15.0,19076.0,
35,279.0,594.0,7.0,19120.0,
36,454.0,597.0,4.0,18945.0,
37,467.0,563.0,50.0,18920.0,
38,483.0,561.0,3.0,18953.0,
39,546.0,545.0,44.0,18865.0,
40,525.0,544.0,34.0,18897.0,
41,560.0,476.0,76.0,18888.0,
42,622.0,378.0,118.0,18882.0,
43,608.0,388.0,112.0,18892.0,
44,645.0,214.0,80.0,19061.0,
45,646.0,203.0,36.0,19115.0,
46,667.0,146.0,24.0,19163.0,
47,667.0,117.0,15.0,19201.0,
48,657.0,85.0,32.0,19226.0,
49,696.0,83.0,34.0,19187.0,
50,732.0,70.0,24.0,19174.0,
51,802.0,89.0,19.0,19090.0,
52,826.0,91.0,19.0,19064.0,
53,842.0,83.0,23.0,19052.0,
54,842.0,61.0,28.0,19069.0,
55,891.0,60.0,18.0,19031.0,
56,1061.0,53.0,12.0,18874.0,
57,1195.0,61.0,14.0,18730.0,
58,1268.0,51.0,15.0,18666.0,
59,1356.0,38.0,16.0,18590.0,
60,1361.0,35.0,13.0,18591.0,
61,1453.0,39.0,4.0,18504.0,
62,1467.0,37.0,1.0,18495.0,
63,1492.0,37.0,1.0,18470.0,
64,1512.0,32.0,1.0,18455.0,
65,1559.0,21.0,8.0,18412.0,
66,1601.0,21.0,6.0,18372.0,
67,1626.0,20.0,7.0,18347.0,
68,1683.0,18.0,8.0,18291.0,
69,1694.0,21.0,7.0,18278.0,
70,1814.0,19.0,8.0,18159.0,
71,1834.0,21.0,10.0,18135.0,
72,2011.0,19.0,5.0,17965.0,
73,2089.0,19.0,2.0,17890.0,
74,2153.0,14.0,6.0,17827.0,
75,2168.0,16.0,7.0,17809.0,
76,2189.0,12.0,14.0,17785.0,
77,2184.0,16.0,17.0,17783.0,
78,2183.0,14.0,21.0,17782.0,
79,2178.0,20.0,16.0,17786.0,
80,2174.0,23.0,21.0,17782.0,
81,2174.0,26.0,27.0,17773.0,
82,2175.0,33.0,19.0,17773.0,
83,2175.0,31.0,21.0,17773.0,
84,2177.0,30.0,23.0,17770.0,
85,2174.0,36.0,23.0,17767.0,
86,2170.0,40.0,28.0,17762.0,
87,2146.0,53.0,37.0,17764.0,
88,2298.0,65.0,31.0,17606.0,
89,2360.0,82.0,31.0,17527.0,
90,2344.0,89.0,50.0,17517.0,
91,2312.0,114.0,75.0,17499.0,
92,2257.0,139.0,92.0,17512.0,
93,2193.0,134.0,134.0,17539.0,
94,2121.0,183.0,132.0,17564.0,
95,2254.0,213.0,112.0,17421.0,
96,2262.0,224.0,116.0,17398.0,
97,2230.0,233.0,129.0,17408.0,
98,2138.0,310.0,132.0,17420.0,
99,2058.0,283.0,186.0,17473.0,
100,1978.0,278.0,231.0,17513.0,
101,1967.0,346.0,141.0,17546.0,
102,1894.0,372.0,157.0,17577.0,
103,1807.0,379.0,194.0,17620.0,
104,1725.0,403.0,222.0,17650.0,
105,1628.0,453.0,234.0,17685.0,
106,1497.0,485.0,267.0,17751.0,
107,1451.0,463.0,240.0,17846.0,
108,1377.0,499.0,194.0,17930.0,
109,1252.0,528.0,248.0,17972.0,
110,1205.0,584.0,212.0,17999.0,
111,1074.0,565.0,268.0,18093.0,
112,1040.0,580.0,282.0,18098.0,
113,1076.0,634.0,253.0,18037.0,
114,1111.0,670.0,209.0,18010.0,
115,1062.0,765.0,245.0,17928.0,
116,1051.0,824.0,221.0,17904.0,
117,939.0,822.0,289.0,17950.0,
118,843.0,947.0,257.0,17953.0,
119,845.0,925.0,158.0,18072.0,
120,850.0,876.0,149.0,18125.0,
121,887.0,821.0,158.0,18134.0,
122,771.0,852.0,194.0,18183.0,
123,703.0,877.0,217.0,18203.0,
124,616.0,881.0,178.0,18325.0,
125,548.0,874.0,196.0,18382.0,
126,588.0,857.0,142.0,18413.0,
127,558.0,816.0,128.0,18498.0,
128,601.0,812.0,67.0,18520.0,
129,594.0,752.0,116.0,18538.0,
130,608.0,728.0,125.0,18539.0,
131,647.0,761.0,105.0,18487.0,
132,728.0,711.0,74.0,18487.0,
133,816.0,671.0,78.0,18435.0,
134,882.0,620.0,50.0,18448.0,
135,913.0,552.0,123.0,18412.0,
136,939.0,540.0,136.0,18385.0,
137,912.0,549.0,158.0,18381.0,
138,911.0,522.0,136.0,18431.0,
139,926.0,546.0,87.0,18441.0,
140,912.0,436.0,111.0,18541.0,
141,915.0,369.0,106.0,18610.0,
142,944.0,305.0,142.0,18609.0,
143,928.0,320.0,157.0,18595.0,
144,974.0,364.0,116.0,18546.0,
145,992.0,339.0,154.0,18515.0,
146,988.0,351.0,118.0,18543.0,
147,954.0,364.0,129.0,18553.0,
148,949.0,332.0,100.0,18619.0,
149,980.0,364.0,85.0,18571.0,
150,988.0,343.0,111.0,18558.0,
151,976.0,393.0,82.0,18549.0,
152,998.0,377.0,97.0,18528.0,
153,984.0,297.0,129.0,18590.0,
154,973.0,313.0,124.0,18590.0,
155,992.0,302.0,72.0,18634.0,
156,1003.0,290.0,69.0,18638.0,
157,1039.0,318.0,83.0,18560.0,
158,1065.0,270.0,106.0,18559.0,
159,1084.0,280.0,76.0,18560.0,
160,1211.0,252.0,73.0,18464.0,
161,1298.0,262.0,105.0,18335.0,
162,1335.0,273.0,91.0,18301.0,
163,1354.0,252.0,112.0,18282.0,
164,1364.0,225.0,110.0,18301.0,
165,1395.0,245.0,90.0,18270.0,
166,1381.0,220.0,122.0,18277.0,
167,1386.0,214.0,116.0,18284.0,
168,1432.0,209.0,135.0,18224.0,
169,1434.0,226.0,119.0,18221.0,
170,1422.0,270.0,120.0,18188.0,
171,1431.0,221.0,149.0,18199.0,
172,1421.0,277.0,108.0,18194.0,
173,1398.0,265.0,138.0,18199.0,
174,1393.0,299.0,134.0,18174.0,
175,1374.0,340.0,123.0,18163.0,
176,1356.0,352.0,131.0,18161.0,
177,1336.0,374.0,156.0,18134.0,
178,1414.0,376.0,165.0,18045.0,
179,1352.0,387.0,209.0,18052.0,
180,1342.0,416.0,150.0,18092.0,
181,1336.0,441.0,133.0,18090.0,
182,1393.0,395.0,155.0,18057.0,
183,1331.0,437.0,168.0,18064.0,
184,1373.0,473.0,156.0,17998.0,
185,1328.0,433.0,229.0,18010.0,
186,1348.0,479.0,164.0,18009.0,
187,1414.0,487.0,173.0,17926.0,
188,1443.0,460.0,151.0,17946.0,
189,1407.0,438.0,155.0,18000.0,
190,1413.0,410.0,187.0,17990.0,
191,1404.0,420.0,160.0,18016.0,
192,1465.0,388.0,229.0,17918.0,
193,1464.0,421.0,184.0,17931.0,
194,1411.0,450.0,248.0,17891.0,
195,1393.0,464.0,300.0,17843.0,
196,1344.0,491.0,333.0,17832.0,
197,1269.0,599.0,317.0,17815.0,
198,1198.0,681.0,277.0,17844.0,
199,1201.0,710.0,248.0,17841.0,
200,1138.0,728.0,266.0,17868.0,
201,1097.0,703.0,254.0,17946.0,
202,1135.0,681.0,278.0,17906.0,
203,1116.0,676.0,234.0,17974.0,
204,1052.0,671.0,243.0,18034.0,
205,989.0,649.0,239.0,18123.0,
206,922.0,622.0,299.0,18157.0,
207,1073.0,611.0,269.0,18047.0,
208,1111.0,626.0,233.0,18030.0,
209,1175.0,668.0,226.0,17931.0,
210,1247.0,701.0,167.0,17885.0,
211,1276.0,654.0,201.0,17869.0,
212,1200.0,634.0,267.0,17899.0,
213,1120.0,687.0,236.0,17957.0,
214,1063.0,777.0,207.0,17953.0,
215,999.0,759.0,177.0,18065.0,
216,1100.0,749.0,229.0,17922.0,
217,1139.0,649.0,229.0,17983.0,
218,1358.0,697.0,175.0,17770.0,
219,1391.0,704.0,319.0,17586.0,
220,1425.0,703.0,384.0,17488.0,
221,1452.0,818.0,404.0,17326.0,
222,1416.0,862.0,327.0,17395.0,
223,1421.0,837.0,307.0,17435.0,
224,1427.0,829.0,412.0,17332.0,
225,1544.0,755.0,469.0,17232.0,
226,1567.0,814.0,438.0,17181.0,
227,1463.0,902.0,453.0,17182.0,
228,1341.0,925.0,471.0,17263.0,
229,1360.0,1154.0,385.0,17101.0,
230,1264.0,1141.0,442.0,17153.0,
231,1114.0,1193.0,516.0,17177.0,
232,1169.0,1350.0,410.0,17071.0,
233,1049.0,1511.0,368.0,17072.0,
234,968.0,1480.0,350.0,17202.0,
235,945.0,1576.0,295.0,17184.0,
236,1071.0,1603.0,285.0,17041.0,
237,1019.0,1624.0,372.0,16985.0,
238,982.0,1659.0,381.0,16978.0,
239,976.0,1684.0,529.0,16811.0,
240,953.0,1748.0,500.0,16799.0,
241,879.0,1858.0,495.0,16768.0,
242,828.0,1861.0,481.0,16830.0,
243,612.0,1795.0,616.0,16977.0,
244,536.0,1705.0,579.0,17180.0,
245,470.0,1639.0,566.0,17325.0,
246,444.0,1735.0,318.0,17503.0,
247,559.0,1741.0,285.0,17415.0,
248,589.0,1653.0,240.0,17518.0,
249,574.0,1510.0,281.0,17635.0,
250,546.0,1385.0,314.0,17755.0,
251,544.0,1229.0,208.0,18019.0,
252,498.0,1101.0,173.0,18228.0,
253,508.0,966.0,205.0,18321.0,
254,543.0,910.0,166.0,18381.0,
255,595.0,821.0,135.0,18449.0,
256,637.0,752.0,142.0,18469.0,
257,642.0,672.0,155.0,18531.0,
258,761.0,539.0,158.0,18542.0,
259,849.0,553.0,174.0,18424.0,
260,904.0,504.0,242.0,18350.0,
261,1128.0,445.0,217.0,18210.0,
262,1097.0,423.0,273.0,18207.0,
263,1099.0,448.0,238.0,18215.0,
264,1130.0,396.0,225.0,18249.0,
265,1099.0,412.0,205.0,18284.0,
266,1123.0,425.0,213.0,18239.0,
267,1098.0,394.0,235.0,18273.0,
268,1138.0,443.0,164.0,18255.0,
269,1108.0,431.0,198.0,18263.0,
270,1123.0,473.0,134.0,18270.0,
271,1128.0,478.0,146.0,18248.0,
272,1116.0,452.0,139.0,18293.0,
273,1093.0,447.0,184.0,18276.0,
274,1072.0,450.0,207.0,18271.0,
275,1084.0,501.0,164.0,18251.0,
276,1056.0,492.0,184.0,18268.0,
277,1027.0,531.0,207.0,18235.0,
278,1025.0,509.0,192.0,18274.0,
279,1040.0,491.0,225.0,18244.0,
280,1024.0,540.0,215.0,18221.0,
281,1024.0,508.0,236.0,18232.0,
282,1041.0,480.0,231.0,18248.0,
283,1039.0,456.0,199.0,18306.0,
284,1045.0,434.0,198.0,18323.0,
285,1071.0,489.0,173.0,18267.0,
286,1095.0,426.0,210.0,18269.0,
287,1118.0,463.0,168.0,18251.0,
288,1150.0,455.0,169.0,18226.0,
289,1142.0,476.0,148.0,18234.0,
290,1197.0,467.0,198.0,18138.0,
291,1198.0,471.0,201.0,18130.0,
292,1215.0,516.0,201.0,18068.0,
293,1205.0,471.0,211.0,18113.0,
294,1173.0,500.0,222.0,18105.0,
295,1155.0,499.0,190.0,18156.0,
296,1117.0,478.0,229.0,18176.0,
297,1070.0,534.0,206.0,18190.0,
298,1093.0,534.0,170.0,18203.0,
299,1116.0,462.0,197.0,18225.0,
300,1177.0,483.0,190.0,18150.0,
301,1243.0,483.0,204.0,18070.0,
302,1368.0,426.0,258.0,17948.0,
303,1415.0,438.0,283.0,17864.0,
304,1410.0,469.0,284.0,17837.0,
305,1437.0,515.0,252.0,17796.0,
306,1432.0,493.0,314.0,17761.0,
307,1406.0,568.0,290.0,17736.0,
308,1450.0,553.0,307.0,17690.0,
309,1518.0,636.0,256.0,17590.0,
310,1523.0,652.0,283.0,17542.0,
311,1482.0,618.0,314.0,17586.0,
312,1431.0,637.0,342.0,17590.0,
313,1434.0,665.0,379.0,17522.0,
314,1393.0,657.0,411.0,17539.0,
315,1301.0,704.0,464.0,17531.0,
316,1194.0,788.0,412.0,17606.0,
317,1103.0,835.0,417.0,17645.0,
318,1054.0,868.0,343.0,17735.0,
319,951.0,883.0,379.0,17787.0,
320,900.0,901.0,321.0,17878.0,
321,781.0,939.0,348.0,17932.0,
322,721.0,938.0,354.0,17987.0,
323,684.0,883.0,316.0,18117.0,
324,705.0,945.0,243.0,18107.0,
325,678.0,833.0,237.0,18252.0,
326,681.0,765.0,214.0,18340.0,
327,672.0,764.0,214.0,18350.0,
328,691.0,707.0,221.0,18381.0,
329,745.0,704.0,194.0,18357.0,
330,805.0,708.0,195.0,18292.0,
331,844.0,736.0,209.0,18211.0,
332,862.0,608.0,207.0,18323.0,
333,875.0,548.0,204.0,18373.0,
334,870.0,524.0,247.0,18359.0,
335,1135.0,510.0,258.0,18097.0,
336,1182.0,512.0,236.0,18070.0,
337,1321.0,453.0,320.0,17906.0,
338,1315.0,485.0,376.0,17824.0,
339,1282.0,497.0,382.0,17839.0,
340,1288.0,519.0,368.0,17825.0,
341,1263.0,556.0,373.0,17808.0,
342,1285.0,628.0,293.0,17794.0,
343,1276.0,657.0,204.0,17863.0,
344,1245.0,650.0,224.0,17881.0,
345,1233.0,633.0,275.0,17859.0,
346,1213.0,668.0,231.0,17888.0,
347,1258.0,648.0,203.0,17891.0,
348,1222.0,675.0,195.0,17908.0,
349,1190.0,654.0,281.0,17875.0,
350,1253.0,708.0,288.0,17751.0,
351,1293.0,709.0,309.0,17689.0,
352,1197.0,730.0,364.0,17709.0,
353,1204.0,701.0,335.0,17760.0,
354,1213.0,794.0,295.0,17698.0,
355,1156.0,763.0,373.0,17708.0,
356,1090.0,878.0,251.0,17781.0,
357,995.0,855.0,292.0,17858.0,
358,958.0,926.0,225.0,17891.0,
359,1005.0,930.0,252.0,17813.0,
360,883.0,886.0,317.0,17914.0,
361,893.0,857.0,285.0,17965.0,
362,860.0,906.0,217.0,18017.0,
363,782.0,912.0,250.0,18056.0,
364,769.0,929.0,220.0,18082.0,
365,710.0,934.0,258.0,18098.0,
366,730.0,908.0,268.0,18094.0,
367,755.0,931.0,202.0,18112.0,
368,760.0,867.0,144.0,18229.0,
369,768.0,804.0,147.0,18281.0,
370,783.0,745.0,143.0,18329.0,
371,828.0,628.0,156.0,18388.0,
372,846.0,575.0,174.0,18405.0,
373,857.0,539.0,145.0,18459.0,
374,874.0,478.0,170.0,18478.0,
375,932.0,490.0,113.0,18465.0,
376,956.0,433.0,150.0,18461.0,
377,1006.0,445.0,126.0,18423.0,
378,1039.0,413.0,129.0,18419.0,
379,1085.0,360.0,117.0,18438.0,
380,1126.0,332.0,97.0,18445.0,
381,1182.0,294.0,142.0,18382.0,
382,1230.0,325.0,99.0,18346.0,
383,1275.0,300.0,116.0,18309.0,
384,1305.0,323.0,124.0,18248.0,
385,1329.0,322.0,121.0,18228.0,
386,1357.0,338.0,122.0,18183.0,
387,1369.0,356.0,121.0,18154.0,
388,1383.0,387.0,124.0,18106.0,
389,1398.0,397.0,120.0,18085.0,
390,1383.0,374.0,154.0,18089.0,
391,1414.0,397.0,119.0,18070.0,
392,1393.0,426.0,129.0,18052.0,
393,1396.0,423.0,203.0,17978.0,
394,1404.0,438.0,182.0,17976.0,
395,1452.0,442.0,144.0,17962.0,
396,1488.0,389.0,188.0,17935.0,
397,1527.0,402.0,204.0,17867.0,
398,1506.0,420.0,192.0,17882.0,
399,1483.0,428.0,198.0,17891.0,
400,1515.0,412.0,252.0,17821.0,
401,1518.0,442.0,232.0,17808.0,
402,1485.0,439.0,260.0,17816.0,
403,1449.0,481.0,277.0,17793.0,
404,1418.0,527.0,309.0,17746.0,
405,1349.0,578.0,322.0,17751.0,
406,1282.0,604.0,333.0,17781.0,
407,1231.0,687.0,307.0,17775.0,
408,1183.0,726.0,274.0,17817.0,
409,1178.0,756.0,270.0,17796.0,
410,1172.0,720.0,263.0,17845.0,
411,1119.0,770.0,252.0,17859.0,
412,1123.0,729.0,221.0,17927.0,
413,1087.0,750.0,225.0,17938.0,
414,1038.0,723.0,318.0,17921.0,
415,999.0,779.0,252.0,17970.0,
416,951.0,816.0,206.0,18027.0,
417,945.0,782.0,178.0,18095.0,
418,922.0,712.0,209.0,18157.0,
419,938.0,733.0,187.0,18142.0,
420,929.0,720.0,200.0,18151.0,
421,929.0,724.0,166.0,18181.0,
422,1054.0,694.0,197.0,18055.0,
423,1179.0,661.0,228.0,17932.0,
424,1157.0,725.0,201.0,17917.0,
425,1182.0,740.0,262.0,17816.0,
426,1209.0,775.0,246.0,17770.0,
427,1223.0,800.0,244.0,17733.0,
428,1217.0,759.0,345.0,17679.0,
429,1167.0,758.0,376.0,17699.0,
430,1148.0,889.0,291.0,17672.0,
431,1041.0,945.0,401.0,17613.0,
432,1019.0,1036.0,380.0,17565.0,
433,1018.0,1079.0,319.0,17584.0,
434,936.0,929.0,437.0,17698.0,
435,924.0,926.0,479.0,17671.0,
436,924.0,970.0,419.0,17687.0,
437,917.0,1064.0,411.0,17608.0,
438,867.0,1050.0,524.0,17559.0,
439,908.0,1115.0,425.0,17552.0,
440,996.0,1151.0,347.0,17506.0,
441,1027.0,1057.0,428.0,17488.0,
442,1018.0,1119.0,294.0,17569.0,
443,1105.0,1147.0,275.0,17473.0,
444,1156.0,1141.0,326.0,17377.0,
445,1204.0,1142.0,393.0,17261.0,
446,1186.0,1139.0,420.0,17255.0,
447,1180.0,1201.0,513.0,17106.0,
448,1343.0,1271.0,490.0,16896.0,
449,1310.0,1259.0,509.0,16922.0,
450,1326.0,1182.0,558.0,16934.0,
451,1337.0,1139.0,706.0,16818.0,
452,1372.0,1198.0,636.0,16794.0,
453,1271.0,1196.0,713.0,16820.0,
454,1160.0,1186.0,746.0,16908.0,
455,1026.0,1179.0,742.0,17053.0,
456,933.0,1252.0,760.0,17055.0,
457,834.0,1288.0,751.0,17127.0,
458,792.0,1256.0,689.0,17263.0,
459,736.0,1407.0,570.0,17287.0,
460,737.0,1452.0,449.0,17362.0,
461,729.0,1510.0,444.0,17317.0,
462,656.0,1466.0,475.0,17403.0,
463,708.0,1532.0,386.0,17374.0,
464,648.0,1502.0,373.0,17477.0,
465,679.0,1601.0,333.0,17387.0,
466,629.0,1672.0,372.0,17327.0,
467,619.0,1578.0,329.0,17474.0,
468,639.0,1564.0,211.0,17586.0,
469,650.0,1500.0,288.0,17562.0,
470,623.0,1395.0,279.0,17703.0,
471,634.0,1392.0,245.0,17729.0,
472,751.0,1350.0,243.0,17656.0,
473,774.0,1315.0,259.0,17652.0,
474,743.0,1285.0,363.0,17609.0,
475,739.0,1228.0,393.0,17640.0,
476,736.0,1175.0,340.0,17749.0,
477,730.0,1226.0,281.0,17763.0,
478,706.0,1164.0,272.0,17858.0,
479,687.0,1172.0,244.0,17897.0,
480,664.0,985.0,275.0,18076.0,
481,662.0,866.0,254.0,18218.0,
482,685.0,810.0,216.0,18289.0,
483,688.0,754.0,196.0,18362.0,
484,701.0,739.0,103.0,18457.0,
485,709.0,601.0,148.0,18542.0,
486,739.0,535.0,193.0,18533.0,
487,827.0,511.0,161.0,18501.0,
488,873.0,494.0,141.0,18492.0,
489,1029.0,481.0,123.0,18367.0,
490,1124.0,426.0,156.0,18294.0,
491,1186.0,394.0,180.0,18240.0,
492,1243.0,392.0,183.0,18182.0,
493,1234.0,410.0,214.0,18142.0,
494,1237.0,443.0,179.0,18141.0,
495,1229.0,457.0,161.0,18153.0,
496,1173.0,477.0,240.0,18110.0,
497,1149.0,471.0,275.0,18105.0,
498,1140.0,463.0,307.0,18090.0,
499,1178.0,549.0,266.0,18007.0,
500,1212.0,545.0,234.0,18009.0,
501,1194.0,539.0,274.0,17993.0,
502,1212.0,593.0,247.0,17948.0,
503,1198.0,659.0,282.0,17861.0,
504,1113.0,612.0,340.0,17935.0,
505,1069.0,594.0,312.0,18025.0,
506,1062.0,640.0,235.0,18063.0,
507,1073.0,626.0,188.0,18113.0,
508,1074.0,690.0,155.0,18081.0,
509,1060.0,646.0,202.0,18092.0,
510,1043.0,683.0,229.0,18045.0,
511,1064.0,705.0,213.0,18018.0,
512,1028.0,703.0,261.0,18008.0,
513,1002.0,585.0,322.0,18091.0,
514,1044.0,540.0,300.0,18116.0,
515,1040.0,586.0,252.0,18122.0,
516,1049.0,603.0,255.0,18093.0,
517,1039.0,624.0,225.0,18112.0,
518,1015.0,627.0,255.0,18103.0,
519,995.0,607.0,247.0,18151.0,
520,979.0,578.0,246.0,18197.0,
521,982.0,555.0,197.0,18266.0,
522,985.0,543.0,169.0,18303.0,
523,1003.0,497.0,189.0,18311.0,
524,1006.0,511.0,165.0,18318.0,
525,1016.0,534.0,187.0,18263.0,
526,1011.0,543.0,172.0,18274.0,
527,1008.0,538.0,148.0,18306.0,
528,1007.0,525.0,172.0,18296.0,
529,1023.0,499.0,195.0,18283.0,
530,1040.0,442.0,188.0,18330.0,
531,1054.0,455.0,144.0,18347.0,
532,1095.0,443.0,134.0,18328.0,
533,1141.0,479.0,152.0,18228.0,
534,1285.0,443.0,163.0,18109.0,
535,1301.0,441.0,148.0,18110.0,
536,1375.0,447.0,151.0,18027.0,
537,1462.0,473.0,175.0,17890.0,
538,1555.0,436.0,238.0,17771.0,
539,1514.0,387.0,338.0,17761.0,
540,1563.0,430.0,306.0,17701.0,
541,1568.0,464.0,366.0,17602.0,
542,1517.0,542.0,360.0,17581.0,
543,1542.0,553.0,358.0,17547.0,
544,1524.0,588.0,329.0,17559.0,
545,1525.0,635.0,376.0,17464.0,
546,1480.0,650.0,388.0,17482.0,
547,1501.0,683.0,445.0,17371.0,
548,1467.0,707.0,464.0,17362.0,
549,1448.0,743.0,415.0,17394.0,
550,1438.0,759.0,428.0,17375.0,
551,1520.0,822.0,427.0,17231.0,
552,1384.0,961.0,441.0,17214.0,
553,1318.0,1036.0,460.0,17186.0,
554,1310.0,1086.0,471.0,17133.0,
555,1251.0,1157.0,473.0,17119.0,
556,1050.0,1315.0,491.0,17144.0,
557,878.0,1275.0,569.0,17278.0,
558,840.0,1403.0,482.0,17275.0,
559,770.0,1518.0,413.0,17299.0,
560,716.0,1500.0,340.0,17444.0,
561,743.0,1490.0,290.0,17477.0,
562,767.0,1339.0,325.0,17569.0,
563,758.0,1294.0,356.0,17592.0,
564,662.0,1270.0,286.0,17782.0,
565,649.0,1170.0,233.0,17948.0,
566,660.0,1100.0,193.0,18047.0,
567,673.0,1025.0,177.0,18125.0,
568,635.0,1021.0,202.0,18142.0,
569,677.0,1009.0,171.0,18143.0,
570,702.0,919.0,176.0,18203.0,
571,746.0,925.0,228.0,18101.0,
572,739.0,950.0,229.0,18082.0,
573,786.0,963.0,216.0,18035.0,
574,771.0,963.0,189.0,18077.0,
575,860.0,941.0,217.0,17982.0,
576,885.0,916.0,241.0,17958.0,
577,983.0,939.0,212.0,17866.0,
578,1135.0,916.0,192.0,17757.0,
579,1183.0,825.0,278.0,17714.0,
580,1076.0,808.0,329.0,17787.0,
581,1037.0,964.0,285.0,17714.0,
582,1010.0,909.0,287.0,17794.0,
583,978.0,828.0,299.0,17895.0,
584,967.0,855.0,281.0,17897.0,
585,971.0,864.0,196.0,17969.0,
586,958.0,768.0,254.0,18020.0,
587,955.0,727.0,299.0,18019.0,
588,955.0,715.0,262.0,18068.0,
589,978.0,716.0,236.0,18070.0,
590,1001.0,698.0,233.0,18068.0,
591,1003.0,667.0,240.0,18090.0,
592,1013.0,652.0,217.0,18118.0,
593,1012.0,640.0,173.0,18175.0,
594,1016.0,634.0,189.0,18161.0,
595,1146.0,632.0,259.0,17963.0,
596,1159.0,672.0,240.0,17929.0,
597,1183.0,677.0,248.0,17892.0,
598,1150.0,605.0,318.0,17927.0,
599,1157.0,629.0,269.0,17945.0,
600,1171.0,631.0,267.0,17931.0,
601,1169.0,641.0,263.0,17927.0,
602,1202.0,635.0,244.0,17919.0,
603,1194.0,673.0,223.0,17910.0,
604,1251.0,655.0,251.0,17843.0,
605,1237.0,660.0,293.0,17810.0,
606,1220.0,627.0,351.0,17802.0,
607,1303.0,676.0,309.0,17712.0,
608,1382.0,711.0,335.0,17572.0,
609,1370.0,724.0,376.0,17530.0,
610,1439.0,738.0,379.0,17444.0,
611,1354.0,793.0,465.0,17388.0,
612,1288.0,866.0,441.0,17405.0,
613,1246.0,928.0,416.0,17410.0,
614,1232.0,997.0,450.0,17321.0,
615,1121.0,1087.0,543.0,17249.0,
616,1047.0,1186.0,425.0,17342.0,
617,1002.0,1233.0,438.0,17327.0,
618,956.0,1245.0,376.0,17423.0,
619,881.0,1283.0,430.0,17406.0,
620,819.0,1433.0,333.0,17415.0,
621,742.0,1480.0,344.0,17434.0,
622,700.0,1469.0,339.0,17492.0,
623,666.0,1500.0,319.0,17515.0,
624,635.0,1387.0,340.0,17638.0,
625,596.0,1346.0,332.0,17726.0,
626,611.0,1242.0,271.0,17876.0,
627,594.0,1260.0,167.0,17979.0,
628,579.0,1151.0,193.0,18077.0,
629,558.0,1011.0,217.0,18214.0,
630,577.0,1011.0,122.0,18290.0,
631,615.0,911.0,161.0,18313.0,
632,610.0,782.0,188.0,18420.0,
633,607.0,776.0,175.0,18442.0,
634,632.0,746.0,188.0,18434.0,
635,669.0,731.0,150.0,18450.0,
636,710.0,685.0,134.0,18471.0,
637,731.0,690.0,118.0,18461.0,
638,789.0,662.0,151.0,18398.0,
639,803.0,617.0,140.0,18440.0,
640,848.0,604.0,133.0,18415.0,
641,898.0,569.0,171.0,18362.0,
642,947.0,559.0,176.0,18318.0,
643,969.0,540.0,180.0,18311.0,
644,1030.0,528.0,150.0,18292.0,
645,1085.0,524.0,177.0,18214.0,
646,1125.0,489.0,154.0,18232.0,
647,1177.0,504.0,117.0,18202.0,
648,1241.0,449.0,129.0,18181.0,
649,1280.0,454.0,121.0,18145.0,
650,1299.0,388.0,157.0,18156.0,
651,1351.0,358.0,169.0,18122.0,
652,1431.0,359.0,157.0,18053.0,
653,1519.0,386.0,193.0,17902.0,
654,1521.0,422.0,190.0,17867.0,
655,1587.0,464.0,207.0,17742.0,
656,1658.0,477.0,242.0,17623.0,
657,1771.0,456.0,380.0,17393.0,
658,1769.0,497.0,442.0,17292.0,
659,1818.0,495.0,519.0,17168.0,
660,1805.0,551.0,519.0,17125.0,
661,1769.0,657.0,565.0,17009.0,
662,1710.0,698.0,593.0,16999.0,
663,1737.0,717.0,550.0,16996.0,
664,1714.0,726.0,513.0,17047.0,
665,1705.0,725.0,568.0,17002.0,
666,1678.0,771.0,546.0,17005.0,
667,1657.0,761.0,590.0,16992.0,
668,1561.0,839.0,581.0,17019.0,
669,1511.0,904.0,535.0,17050.0,
670,1422.0,874.0,598.0,17106.0,
671,1373.0,931.0,595.0,17101.0,
672,1328.0,962.0,662.0,17048.0,
673,1295.0,1033.0,538.0,17134.0,
674,1252.0,1093.0,495.0,17160.0,
675,1218.0,1093.0,486.0,17203.0,
676,1174.0,1110.0,485.0,17231.0,
677,1133.0,1147.0,476.0,17244.0,
678,1074.0,1224.0,487.0,17215.0,
679,1015.0,1299.0,469.0,17217.0,
680,1019.0,1341.0,415.0,17225.0,
681,932.0,1356.0,477.0,17235.0,
682,846.0,1398.0,492.0,17264.0,
683,799.0,1318.0,483.0,17400.0,
684,920.0,1377.0,399.0,17304.0,
685,888.0,1324.0,390.0,17398.0,
686,850.0,1337.0,397.0,17416.0,
687,757.0,1301.0,492.0,17450.0,
688,698.0,1480.0,356.0,17466.0,
689,683.0,1370.0,270.0,17677.0,
690,668.0,1339.0,211.0,17782.0,
691,666.0,1248.0,239.0,17847.0,
692,691.0,1093.0,208.0,18008.0,
693,821.0,968.0,240.0,17971.0,
694,826.0,970.0,224.0,17980.0,
695,853.0,996.0,196.0,17955.0,
696,906.0,947.0,246.0,17901.0,
697,906.0,963.0,216.0,17915.0,
698,1051.0,874.0,275.0,17800.0,
699,1053.0,831.0,278.0,17838.0,
700,1021.0,854.0,273.0,17852.0,
701,1054.0,827.0,312.0,17807.0,
702,1002.0,798.0,425.0,17775.0,
703,1055.0,866.0,354.0,17725.0,
704,1081.0,840.0,350.0,17729.0,
705,1025.0,816.0,343.0,17816.0,
706,1037.0,824.0,322.0,17817.0,
707,1071.0,871.0,264.0,17794.0,
708,1088.0,866.0,295.0,17751.0,
709,1097.0,806.0,290.0,17807.0,
710,1071.0,764.0,378.0,17787.0,
711,1082.0,746.0,271.0,17901.0,
712,1094.0,806.0,191.0,17909.0,
713,1097.0,746.0,188.0,17969.0,
714,1084.0,708.0,227.0,17981.0,
715,1058.0,663.0,264.0,18015.0,
716,1079.0,660.0,236.0,18025.0,
717,1077.0,605.0,264.0,18054.0,
718,1101.0,556.0,232.0,18111.0,
719,1093.0,610.0,204.0,18093.0,
720,1068.0,570.0,230.0,18132.0,
721,1013.0,598.0,282.0,18107.0,
722,1034.0,617.0,240.0,18109.0,
723,1016.0,584.0,263.0,18137.0,
724,1006.0,614.0,217.0,18163.0,
725,998.0,620.0,224.0,18158.0,
726,1013.0,626.0,210.0,18151.0,
727,998.0,596.0,204.0,18202.0,
728,1011.0,605.0,198.0,18186.0,
729,1025.0,604.0,193.0,18178.0,
730,1039.0,505.0,226.0,18230.0,
