jour,S,I,E,R,
0,19980.0,20.0,0.0,0.0,
1,19963.0,20.0,17.0,0.0,
2,19908.0,22.0,70.0,0.0,
3,19807.0,47.0,146.0,0.0,
4,19617.0,61.0,299.0,23.0,
5,19243.0,129.0,600.0,28.0,
6,18498.0,295.0,1165.0,42.0,
7,17329.0,551.0,2054.0,66.0,
8,15004.0,1051.0,3837.0,108.0,
9,11941.0,2184.0,5652.0,223.0,
10,7360.0,3833.0,8355.0,452.0,
11,3812.0,5828.0,9498.0,862.0,
12,1306.0,8183.0,8855.0,1656.0,
13,239.0,9479.0,7540.0,2742.0,
14,84.0,10645.0,5258.0,4013.0,
15,1.0,10112.0,3746.0,6141.0,
16,16.0,9699.0,2597.0,7688.0,
17,41.0,8730.0,1708.0,9521.0,
18,61.0,8466.0,973.0,10500.0,
19,81.0,7373.0,661.0,11885.0,
20,70.0,6927.0,416.0,12587.0,
21,155.0,6097.0,372.0,13376.0,
22,323.0,5302.0,423.0,13952.0,
23,298.0,4761.0,515.0,14426.0,
24,267.0,4286.0,402.0,15045.0,
25,300.0,4059.0,358.0,15283.0,
26,172.0,3620.0,372.0,15836.0,
27,222.0,3439.0,273.0,16066.0,
28,191.0,2678.0,254.0,16877.0,
29,235.0,2090.0,211.0,17464.0,
30,284.0,1629.0,224.0,17863.0,
31,257.0,1037.0,192.0,18514.0,
32,311.0,609.0,103.0,18977.0,
33,424.0,428.0,107.0,19041.0,
34,561.0,301.0,86.0,19052.0,
35,769.0,245.0,77.0,18909.0,
36,966.0,220.0,52.0,18762.0,
37,1036.0,102.0,100.0,18762.0,
38,1123.0,123.0,89.0,18665.0,
39,1195.0,143.0,71.0,18591.0,
40,1205.0,84.0,87.0,18624.0,
41,1394.0,65.0,91.0,18450.0,
42,1475.0,56.0,71.0,18398.0,
43,1667.0,70.0,67.0,18196.0,
44,1881.0,76.0,55.0,17988.0,
45,1957.0,91.0,51.0,17901.0,
46,2068.0,75.0,69.0,17788.0,
47,2063.0,79.0,54.0,17804.0,
48,2228.0,82.0,51.0,17639.0,
49,2368.0,82.0,64.0,17486.0,
50,2426.0,87.0,122.0,17365.0,
51,2423.0,130.0,121.0,17326.0,
52,2513.0,165.0,123.0,17199.0,
53,2462.0,204.0,132.0,17202.0,
54,2369.0,210.0,205.0,17216.0,
55,2307.0,300.0,171.0,17222.0,
56,2180.0,311.0,268.0,17241.0,
57,2073.0,359.0,299.0,17269.0,
58,2050.0,365.0,268.0,17317.0,
59,2020.0,346.0,303.0,17331.0,
60,1949.0,293.0,354.0,17404.0,
61,1854.0,334.0,346.0,17466.0,
62,1752.0,373.0,385.0,17490.0,
63,1626.0,460.0,430.0,17484.0,
64,1449.0,550.0,481.0,17520.0,
65,1320.0,582.0,527.0,17571.0,
66,1191.0,670.0,566.0,17573.0,
67,1176.0,763.0,533.0,17528.0,
68,1135.0,838.0,512.0,17515.0,
69,1026.0,868.0,483.0,17623.0,
70,983.0,848.0,527.0,17642.0,
71,931.0,874.0,467.0,17728.0,
72,882.0,826.0,535.0,17757.0,
73,869.0,817.0,479.0,17835.0,
74,903.0,728.0,489.0,17880.0,
75,1008.0,736.0,428.0,17828.0,
76,1163.0,630.0,517.0,17690.0,
77,1241.0,654.0,520.0,17585.0,
78,1241.0,678.0,543.0,17538.0,
79,1252.0,754.0,483.0,17511.0,
80,1290.0,793.0,459.0,17458.0,
81,1592.0,766.0,509.0,17133.0,
82,1643.0,727.0,544.0,17086.0,
83,1622.0,718.0,599.0,17061.0,
84,1573.0,804.0,573.0,17050.0,
85,1413.0,787.0,666.0,17134.0,
86,1365.0,844.0,581.0,17210.0,
87,1245.0,857.0,673.0,17225.0,
88,1097.0,1014.0,625.0,17264.0,
89,979.0,1006.0,609.0,17406.0,
90,918.0,1019.0,574.0,17489.0,
91,902.0,1033.0,436.0,17629.0,
92,900.0,985.0,413.0,17702.0,
93,885.0,1003.0,418.0,17694.0,
94,835.0,940.0,415.0,17810.0,
95,869.0,998.0,298.0,17835.0,
96,859.0,962.0,328.0,17851.0,
97,949.0,952.0,354.0,17745.0,
98,985.0,912.0,380.0,17723.0,
99,1017.0,933.0,411.0,17639.0,
100,1046.0,1005.0,392.0,17557.0,
101,1005.0,1023.0,412.0,17560.0,
102,968.0,940.0,509.0,17583.0,
103,1093.0,909.0,597.0,17401.0,
104,1086.0,979.0,541.0,17394.0,
105,1136.0,1019.0,595.0,17250.0,
106,1077.0,1151.0,615.0,17157.0,
107,1076.0,1202.0,556.0,17166.0,
108,981.0,1166.0,504.0,17349.0,
109,913.0,1152.0,549.0,17386.0,
110,929.0,1136.0,577.0,17358.0,
111,936.0,1039.0,617.0,17408.0,
112,941.0,1039.0,562.0,17458.0,
113,973.0,939.0,515.0,17573.0,
114,927.0,889.0,577.0,17607.0,
115,878.0,987.0,477.0,17658.0,
116,812.0,961.0,499.0,17728.0,
117,830.0,960.0,446.0,17764.0,
118,944.0,916.0,438.0,17702.0,
119,1019.0,1011.0,376.0,17594.0,
120,1071.0,944.0,362.0,17623.0,
121,1138.0,929.0,369.0,17564.0,
122,1213.0,884.0,367.0,17536.0,
123,1277.0,837.0,380.0,17506.0,
124,1324.0,763.0,358.0,17555.0,
125,1344.0,712.0,370.0,17574.0,
126,1478.0,684.0,469.0,17369.0,
127,1464.0,668.0,575.0,17293.0,
128,1496.0,775.0,478.0,17251.0,
129,1560.0,879.0,436.0,17125.0,
130,1486.0,906.0,498.0,17110.0,
131,1549.0,962.0,511.0,16978.0,
132,1527.0,1017.0,552.0,16904.0,
133,1451.0,1009.0,638.0,16902.0,
134,1415.0,1002.0,576.0,17007.0,
135,1440.0,1071.0,570.0,16919.0,
136,1356.0,1059.0,713.0,16872.0,
137,1245.0,1172.0,701.0,16882.0,
138,1232.0,1320.0,611.0,16837.0,
139,1148.0,1403.0,532.0,16917.0,
140,1208.0,1231.0,605.0,16956.0,
141,1124.0,1164.0,622.0,17090.0,
142,1061.0,1153.0,729.0,17057.0,
143,1060.0,1225.0,668.0,17047.0,
144,1075.0,1131.0,677.0,17117.0,
145,1062.0,1146.0,617.0,17175.0,
146,1049.0,1122.0,643.0,17186.0,
147,1102.0,989.0,676.0,17233.0,
148,1136.0,1010.0,718.0,17136.0,
149,1249.0,1085.0,691.0,16975.0,
150,1276.0,1077.0,732.0,16915.0,
151,1300.0,1108.0,734.0,16858.0,
152,1375.0,1061.0,777.0,16787.0,
153,1321.0,1110.0,856.0,16713.0,
154,1339.0,1289.0,766.0,16606.0,
155,1241.0,1276.0,848.0,16635.0,
156,1276.0,1271.0,849.0,16604.0,
157,1179.0,1188.0,854.0,16779.0,
158,1128.0,1419.0,692.0,16761.0,
159,1074.0,1358.0,706.0,16862.0,
160,963.0,1373.0,640.0,17024.0,
161,929.0,1336.0,559.0,17176.0,
162,907.0,1346.0,450.0,17297.0,
163,917.0,1205.0,511.0,17367.0,
164,904.0,1161.0,490.0,17445.0,
165,898.0,1097.0,494.0,17511.0,
166,911.0,1156.0,444.0,17489.0,
167,858.0,1149.0,490.0,17503.0,
168,848.0,1227.0,422.0,17503.0,
169,800.0,1200.0,411.0,17589.0,
170,787.0,1126.0,450.0,17637.0,
171,777.0,1026.0,465.0,17732.0,
172,772.0,1064.0,462.0,17702.0,
173,755.0,1149.0,414.0,17682.0,
174,748.0,1052.0,386.0,17814.0,
175,753.0,1059.0,340.0,17848.0,
176,727.0,1022.0,363.0,17888.0,
177,778.0,989.0,338.0,17895.0,
178,794.0,958.0,355.0,17893.0,
179,798.0,945.0,367.0,17890.0,
180,810.0,870.0,391.0,17929.0,
181,911.0,855.0,354.0,17880.0,
182,1009.0,796.0,363.0,17832.0,
183,1075.0,742.0,346.0,17837.0,
184,1245.0,695.0,334.0,17726.0,
185,1547.0,604.0,372.0,17477.0,
186,1668.0,642.0,329.0,17361.0,
187,1629.0,626.0,425.0,17320.0,
188,1594.0,617.0,435.0,17354.0,
189,1596.0,678.0,461.0,17265.0,
190,1627.0,659.0,425.0,17289.0,
191,1650.0,762.0,347.0,17241.0,
192,1627.0,660.0,496.0,17217.0,
193,1579.0,677.0,458.0,17286.0,
194,1512.0,683.0,609.0,17196.0,
195,1496.0,847.0,517.0,17140.0,
196,1520.0,773.0,586.0,17121.0,
197,1490.0,812.0,588.0,17110.0,
198,1518.0,807.0,556.0,17119.0,
199,1556.0,772.0,653.0,17019.0,
200,1546.0,774.0,668.0,17012.0,
201,1539.0,731.0,658.0,17072.0,
202,1560.0,744.0,623.0,17073.0,
203,1653.0,832.0,597.0,16918.0,
204,1648.0,842.0,573.0,16937.0,
205,1659.0,1001.0,481.0,16859.0,
206,1704.0,988.0,632.0,16676.0,
207,1701.0,1070.0,624.0,16605.0,
208,1574.0,1107.0,645.0,16674.0,
209,1481.0,1104.0,745.0,16670.0,
210,1336.0,1176.0,798.0,16690.0,
211,1232.0,1219.0,743.0,16806.0,
212,1173.0,1324.0,735.0,16768.0,
213,1104.0,1334.0,721.0,16841.0,
214,1055.0,1431.0,598.0,16916.0,
215,931.0,1443.0,587.0,17039.0,
216,870.0,1421.0,649.0,17060.0,
217,830.0,1425.0,613.0,17132.0,
218,815.0,1368.0,608.0,17209.0,
219,800.0,1340.0,568.0,17292.0,
220,790.0,1171.0,541.0,17498.0,
221,831.0,1116.0,536.0,17517.0,
222,845.0,1031.0,451.0,17673.0,
223,867.0,984.0,383.0,17766.0,
224,936.0,893.0,411.0,17760.0,
225,971.0,795.0,462.0,17772.0,
226,1014.0,797.0,417.0,17772.0,
227,1073.0,726.0,478.0,17723.0,
228,1115.0,700.0,495.0,17690.0,
229,1185.0,677.0,453.0,17685.0,
230,1247.0,695.0,393.0,17665.0,
231,1339.0,626.0,436.0,17599.0,
232,1436.0,631.0,396.0,17537.0,
233,1439.0,563.0,515.0,17483.0,
234,1484.0,642.0,445.0,17429.0,
235,1471.0,739.0,429.0,17361.0,
236,1496.0,746.0,412.0,17346.0,
237,1507.0,761.0,495.0,17237.0,
238,1527.0,781.0,536.0,17156.0,
239,1480.0,789.0,605.0,17126.0,
240,1485.0,923.0,553.0,17039.0,
241,1512.0,1063.0,469.0,16956.0,
242,1470.0,1020.0,542.0,16968.0,
243,1453.0,1092.0,529.0,16926.0,
244,1374.0,1131.0,631.0,16864.0,
245,1358.0,1236.0,670.0,16736.0,
246,1293.0,1349.0,711.0,16647.0,
247,1217.0,1479.0,678.0,16626.0,
248,1173.0,1481.0,633.0,16713.0,
249,1150.0,1469.0,764.0,16617.0,
250,998.0,1532.0,822.0,16648.0,
251,938.0,1542.0,742.0,16778.0,
252,885.0,1568.0,770.0,16777.0,
253,872.0,1533.0,736.0,16859.0,
254,934.0,1511.0,625.0,16930.0,
255,993.0,1591.0,657.0,16759.0,
256,956.0,1589.0,706.0,16749.0,
257,1006.0,1490.0,726.0,16778.0,
258,943.0,1443.0,713.0,16901.0,
259,943.0,1518.0,625.0,16914.0,
260,865.0,1489.0,686.0,16960.0,
261,795.0,1465.0,750.0,16990.0,
262,768.0,1448.0,718.0,17066.0,
263,776.0,1400.0,707.0,17117.0,
264,766.0,1438.0,618.0,17178.0,
265,764.0,1416.0,529.0,17291.0,
266,829.0,1305.0,461.0,17405.0,
267,862.0,1265.0,505.0,17368.0,
268,918.0,1261.0,477.0,17344.0,
269,1020.0,1186.0,505.0,17289.0,
270,1036.0,1079.0,553.0,17332.0,
271,1035.0,1008.0,557.0,17400.0,
272,1049.0,918.0,627.0,17406.0,
273,1079.0,992.0,567.0,17362.0,
274,1092.0,1023.0,577.0,17308.0,
275,1051.0,1025.0,621.0,17303.0,
276,1040.0,1044.0,637.0,17279.0,
277,1056.0,1024.0,573.0,17347.0,
278,1159.0,1008.0,541.0,17292.0,
279,1221.0,928.0,566.0,17285.0,
280,1276.0,1037.0,381.0,17306.0,
281,1267.0,866.0,440.0,17427.0,
282,1287.0,793.0,533.0,17387.0,
283,1292.0,811.0,521.0,17376.0,
284,1303.0,839.0,462.0,17396.0,
285,1304.0,832.0,496.0,17368.0,
286,1320.0,810.0,547.0,17323.0,
287,1365.0,765.0,539.0,17331.0,
288,1391.0,766.0,546.0,17297.0,
289,1435.0,804.0,487.0,17274.0,
290,1489.0,797.0,523.0,17191.0,
291,1502.0,805.0,498.0,17195.0,
292,1490.0,826.0,477.0,17207.0,
293,1594.0,819.0,511.0,17076.0,
294,1659.0,796.0,518.0,17027.0,
295,1720.0,855.0,426.0,16999.0,
296,1712.0,804.0,515.0,16969.0,
297,1733.0,850.0,497.0,16920.0,
298,1750.0,870.0,463.0,16917.0,
299,1713.0,859.0,549.0,16879.0,
300,1685.0,871.0,572.0,16872.0,
301,1611.0,928.0,578.0,16883.0,
302,1760.0,1018.0,556.0,16666.0,
303,1724.0,1038.0,679.0,16559.0,
304,1674.0,1098.0,780.0,16448.0,
305,1551.0,1094.0,829.0,16526.0,
306,1423.0,1215.0,864.0,16498.0,
307,1333.0,1308.0,890.0,16469.0,
308,1258.0,1382.0,922.0,16438.0,
309,1142.0,1519.0,793.0,16546.0,
310,1056.0,1453.0,743.0,16748.0,
311,994.0,1373.0,683.0,16950.0,
312,956.0,1366.0,690.0,16988.0,
313,929.0,1502.0,557.0,17012.0,
314,1068.0,1470.0,557.0,16905.0,
315,1045.0,1415.0,567.0,16973.0,
316,1056.0,1347.0,553.0,17044.0,
317,1027.0,1304.0,623.0,17046.0,
318,1045.0,1295.0,602.0,17058.0,
319,985.0,1172.0,625.0,17218.0,
320,1079.0,1070.0,577.0,17274.0,
321,1188.0,1013.0,608.0,17191.0,
322,1282.0,991.0,561.0,17166.0,
323,1309.0,1080.0,501.0,17110.0,
324,1344.0,1113.0,475.0,17068.0,
325,1369.0,1114.0,553.0,16964.0,
326,1402.0,1117.0,626.0,16855.0,
327,1378.0,1164.0,638.0,16820.0,
328,1340.0,1188.0,596.0,16876.0,
329,1264.0,1141.0,652.0,16943.0,
330,1192.0,1059.0,734.0,17015.0,
331,1121.0,1060.0,730.0,17089.0,
332,1075.0,1150.0,694.0,17081.0,
333,1050.0,1282.0,610.0,17058.0,
334,1061.0,1257.0,527.0,17155.0,
335,1013.0,1221.0,550.0,17216.0,
336,1005.0,1007.0,616.0,17372.0,
337,951.0,1019.0,593.0,17437.0,
338,993.0,945.0,587.0,17475.0,
339,1031.0,930.0,525.0,17514.0,
340,1034.0,897.0,549.0,17520.0,
341,1035.0,946.0,524.0,17495.0,
342,1019.0,841.0,586.0,17554.0,
343,1070.0,890.0,521.0,17519.0,
344,1064.0,865.0,520.0,17551.0,
345,1089.0,884.0,499.0,17528.0,
346,1067.0,843.0,489.0,17601.0,
347,1215.0,850.0,499.0,17436.0,
348,1238.0,912.0,452.0,17398.0,
349,1295.0,870.0,501.0,17334.0,
350,1289.0,866.0,488.0,17357.0,
351,1324.0,831.0,479.0,17366.0,
352,1293.0,888.0,511.0,17308.0,
353,1238.0,910.0,519.0,17333.0,
354,1208.0,914.0,521.0,17357.0,
355,1229.0,915.0,527.0,17329.0,
356,1239.0,936.0,460.0,17365.0,
357,1319.0,928.0,463.0,17290.0,
358,1481.0,943.0,562.0,17014.0,
359,1480.0,1007.0,458.0,17055.0,
360,1534.0,1016.0,466.0,16984.0,
361,1676.0,1052.0,425.0,16847.0,
362,1705.0,1009.0,521.0,16765.0,
363,1832.0,1000.0,566.0,16602.0,
364,1855.0,943.0,607.0,16595.0,
365,1826.0,995.0,638.0,16541.0,
366,1730.0,1094.0,813.0,16363.0,
367,1669.0,1057.0,835.0,16439.0,
368,1537.0,1229.0,831.0,16403.0,
369,1466.0,1320.0,907.0,16307.0,
370,1421.0,1453.0,845.0,16281.0,
371,1264.0,1522.0,936.0,16278.0,
372,1220.0,1651.0,840.0,16289.0,
373,1103.0,1726.0,867.0,16304.0,
374,1064.0,1775.0,778.0,16383.0,
375,1092.0,1702.0,758.0,16448.0,
376,1072.0,1701.0,758.0,16469.0,
377,1106.0,1767.0,717.0,16410.0,
378,1128.0,1661.0,773.0,16438.0,
379,1161.0,1789.0,674.0,16376.0,
380,1128.0,1804.0,733.0,16335.0,
381,1068.0,1877.0,788.0,16267.0,
382,1064.0,1961.0,740.0,16235.0,
383,960.0,2159.0,637.0,16244.0,
384,886.0,2057.0,705.0,16352.0,
385,924.0,2077.0,686.0,16313.0,
386,1085.0,2013.0,677.0,16225.0,
387,1041.0,2050.0,728.0,16181.0,
388,1085.0,2179.0,778.0,15958.0,
389,1033.0,2139.0,760.0,16068.0,
390,925.0,2149.0,864.0,16062.0,
391,932.0,2029.0,892.0,16147.0,
392,899.0,2140.0,785.0,16176.0,
393,872.0,2096.0,791.0,16241.0,
394,845.0,2101.0,778.0,16276.0,
395,829.0,2111.0,761.0,16299.0,
396,856.0,2014.0,757.0,16373.0,
397,880.0,1812.0,790.0,16518.0,
398,930.0,1661.0,805.0,16604.0,
399,954.0,1586.0,704.0,16756.0,
400,984.0,1464.0,753.0,16799.0,
401,1030.0,1409.0,712.0,16849.0,
402,1074.0,1393.0,700.0,16833.0,
403,1177.0,1302.0,702.0,16819.0,
404,1241.0,1214.0,729.0,16816.0,
405,1280.0,1225.0,680.0,16815.0,
406,1281.0,1247.0,661.0,16811.0,
407,1311.0,1256.0,568.0,16865.0,
408,1307.0,1209.0,589.0,16895.0,
409,1307.0,1191.0,622.0,16880.0,
410,1270.0,1195.0,639.0,16896.0,
411,1252.0,1220.0,646.0,16882.0,
412,1199.0,1281.0,593.0,16927.0,
413,1130.0,1246.0,694.0,16930.0,
414,1096.0,1283.0,631.0,16990.0,
415,1019.0,1214.0,702.0,17065.0,
416,1009.0,1262.0,558.0,17171.0,
417,947.0,1334.0,532.0,17187.0,
418,919.0,1240.0,538.0,17303.0,
419,889.0,1153.0,554.0,17404.0,
420,864.0,1143.0,557.0,17436.0,
421,866.0,1191.0,460.0,17483.0,
422,860.0,1138.0,464.0,17538.0,
423,849.0,1121.0,474.0,17556.0,
424,868.0,1090.0,362.0,17680.0,
425,914.0,987.0,366.0,17733.0,
426,968.0,891.0,409.0,17732.0,
427,1020.0,818.0,377.0,17785.0,
428,1173.0,800.0,375.0,17652.0,
429,1343.0,762.0,396.0,17499.0,
430,1456.0,744.0,478.0,17322.0,
431,1454.0,772.0,511.0,17263.0,
432,1433.0,783.0,547.0,17237.0,
433,1405.0,780.0,612.0,17203.0,
434,1415.0,791.0,570.0,17224.0,
435,1421.0,713.0,607.0,17259.0,
436,1383.0,784.0,583.0,17250.0,
437,1340.0,825.0,621.0,17214.0,
438,1337.0,923.0,501.0,17239.0,
439,1269.0,913.0,530.0,17288.0,
440,1206.0,895.0,535.0,17364.0,
441,1215.0,899.0,429.0,17457.0,
442,1229.0,836.0,434.0,17501.0,
443,1242.0,734.0,493.0,17531.0,
444,1307.0,794.0,451.0,17448.0,
445,1304.0,809.0,369.0,17518.0,
446,1360.0,743.0,410.0,17487.0,
447,1382.0,756.0,395.0,17467.0,
448,1415.0,752.0,372.0,17461.0,
449,1457.0,690.0,382.0,17471.0,
450,1508.0,689.0,487.0,17316.0,
451,1538.0,704.0,515.0,17243.0,
452,1530.0,690.0,499.0,17281.0,
453,1535.0,770.0,508.0,17187.0,
454,1532.0,855.0,515.0,17098.0,
455,1485.0,909.0,446.0,17160.0,
456,1457.0,857.0,475.0,17211.0,
457,1420.0,864.0,510.0,17206.0,
458,1387.0,864.0,527.0,17222.0,
459,1344.0,815.0,608.0,17233.0,
460,1340.0,899.0,562.0,17199.0,
461,1314.0,949.0,571.0,17166.0,
462,1326.0,983.0,584.0,17107.0,
463,1295.0,980.0,613.0,17112.0,
464,1322.0,964.0,628.0,17086.0,
465,1303.0,999.0,631.0,17067.0,
466,1394.0,1011.0,597.0,16998.0,
467,1356.0,1106.0,565.0,16973.0,
468,1329.0,1098.0,557.0,17016.0,
469,1286.0,1064.0,621.0,17029.0,
470,1227.0,1068.0,689.0,17016.0,
471,1186.0,1059.0,756.0,16999.0,
472,1186.0,1051.0,802.0,16961.0,
473,1171.0,1122.0,788.0,16919.0,
474,1182.0,1165.0,750.0,16903.0,
475,1148.0,1181.0,710.0,16961.0,
476,1090.0,1253.0,711.0,16946.0,
477,1074.0,1233.0,733.0,16960.0,
478,1074.0,1284.0,664.0,16978.0,
479,1079.0,1225.0,620.0,17076.0,
480,1081.0,1193.0,606.0,17120.0,
481,1075.0,1160.0,580.0,17185.0,
482,1040.0,1210.0,542.0,17208.0,
483,1096.0,1058.0,555.0,17291.0,
484,1070.0,1098.0,544.0,17288.0,
485,1068.0,1122.0,504.0,17306.0,
486,1177.0,1100.0,572.0,17151.0,
487,1212.0,1096.0,525.0,17167.0,
488,1336.0,1069.0,581.0,17014.0,
489,1351.0,1157.0,576.0,16916.0,
490,1386.0,1184.0,583.0,16847.0,
491,1279.0,1203.0,592.0,16926.0,
492,1373.0,1325.0,529.0,16773.0,
493,1230.0,1307.0,702.0,16761.0,
494,1170.0,1418.0,662.0,16750.0,
495,1093.0,1394.0,772.0,16741.0,
496,1038.0,1405.0,770.0,16787.0,
497,1029.0,1325.0,780.0,16866.0,
498,1005.0,1491.0,706.0,16798.0,
499,930.0,1530.0,673.0,16867.0,
500,879.0,1417.0,712.0,16992.0,
501,903.0,1371.0,705.0,17021.0,
502,888.0,1304.0,695.0,17113.0,
503,891.0,1284.0,648.0,17177.0,
504,1027.0,1279.0,566.0,17128.0,
505,1204.0,1252.0,546.0,16998.0,
506,1280.0,1210.0,542.0,16968.0,
507,1341.0,1143.0,686.0,16830.0,
508,1425.0,1175.0,636.0,16764.0,
509,1384.0,1076.0,724.0,16816.0,
510,1315.0,1060.0,828.0,16797.0,
511,1273.0,1025.0,895.0,16807.0,
512,1270.0,1090.0,854.0,16786.0,
513,1269.0,1241.0,688.0,16802.0,
514,1237.0,1272.0,685.0,16806.0,
515,1191.0,1342.0,672.0,16795.0,
516,1146.0,1338.0,736.0,16780.0,
517,1100.0,1398.0,743.0,16759.0,
518,1078.0,1360.0,752.0,16810.0,
519,1063.0,1256.0,782.0,16899.0,
520,1086.0,1310.0,679.0,16925.0,
521,1114.0,1202.0,755.0,16929.0,
522,1135.0,1266.0,675.0,16924.0,
523,1125.0,1233.0,705.0,16937.0,
524,1129.0,1256.0,753.0,16862.0,
525,1136.0,1237.0,748.0,16879.0,
526,1083.0,1330.0,641.0,16946.0,
527,1082.0,1353.0,627.0,16938.0,
528,1127.0,1256.0,641.0,16976.0,
529,1079.0,1268.0,629.0,17024.0,
530,1084.0,1116.0,668.0,17132.0,
531,1122.0,1044.0,642.0,17192.0,
532,1133.0,1065.0,617.0,17185.0,
533,1149.0,1046.0,623.0,17182.0,
534,1171.0,1084.0,631.0,17114.0,
535,1159.0,1022.0,601.0,17218.0,
536,1183.0,940.0,655.0,17222.0,
537,1250.0,978.0,558.0,17214.0,
538,1242.0,1017.0,576.0,17165.0,
539,1242.0,1025.0,611.0,17122.0,
540,1270.0,1043.0,580.0,17107.0,
541,1251.0,1079.0,542.0,17128.0,
542,1261.0,1091.0,623.0,17025.0,
543,1244.0,1053.0,601.0,17102.0,
544,1307.0,1062.0,530.0,17101.0,
545,1312.0,1088.0,575.0,17025.0,
546,1304.0,1074.0,628.0,16994.0,
547,1282.0,1015.0,682.0,17021.0,
548,1306.0,1099.0,587.0,17008.0,
549,1283.0,1024.0,558.0,17135.0,
550,1281.0,983.0,511.0,17225.0,
551,1338.0,930.0,477.0,17255.0,
552,1368.0,913.0,437.0,17282.0,
553,1338.0,915.0,415.0,17332.0,
554,1327.0,840.0,457.0,17376.0,
555,1370.0,809.0,405.0,17416.0,
556,1412.0,819.0,375.0,17394.0,
557,1450.0,771.0,479.0,17300.0,
558,1449.0,757.0,441.0,17353.0,
559,1441.0,759.0,465.0,17335.0,
560,1546.0,734.0,494.0,17226.0,
561,1624.0,704.0,515.0,17157.0,
562,1633.0,820.0,483.0,17064.0,
563,1626.0,845.0,480.0,17049.0,
564,1556.0,858.0,528.0,17058.0,
565,1529.0,837.0,628.0,17006.0,
566,1445.0,1037.0,557.0,16961.0,
567,1382.0,1082.0,593.0,16943.0,
568,1264.0,1159.0,627.0,16950.0,
569,1204.0,1067.0,624.0,17105.0,
570,1179.0,1136.0,586.0,17099.0,
571,1161.0,1046.0,568.0,17225.0,
572,1189.0,1089.0,607.0,17115.0,
573,1147.0,1114.0,614.0,17125.0,
574,1195.0,1140.0,505.0,17160.0,
575,1199.0,1162.0,438.0,17201.0,
576,1141.0,1113.0,576.0,17170.0,
577,1149.0,1088.0,566.0,17197.0,
578,1188.0,1139.0,542.0,17131.0,
579,1213.0,1068.0,589.0,17130.0,
580,1213.0,1093.0,521.0,17173.0,
581,1257.0,1071.0,490.0,17182.0,
582,1303.0,1099.0,517.0,17081.0,
583,1335.0,1117.0,459.0,17089.0,
584,1363.0,1068.0,537.0,17032.0,
585,1413.0,1025.0,511.0,17051.0,
586,1444.0,1061.0,553.0,16942.0,
587,1401.0,1051.0,660.0,16888.0,
588,1400.0,1043.0,639.0,16918.0,
589,1399.0,1115.0,669.0,16817.0,
590,1350.0,1191.0,709.0,16750.0,
591,1329.0,1200.0,715.0,16756.0,
592,1305.0,1171.0,753.0,16771.0,
593,1280.0,1350.0,753.0,16617.0,
594,1244.0,1305.0,823.0,16628.0,
595,1240.0,1322.0,763.0,16675.0,
596,1233.0,1398.0,732.0,16637.0,
597,1294.0,1380.0,717.0,16609.0,
598,1280.0,1333.0,701.0,16686.0,
599,1316.0,1356.0,718.0,16610.0,
600,1330.0,1306.0,678.0,16686.0,
601,1295.0,1294.0,720.0,16691.0,
602,1297.0,1277.0,681.0,16745.0,
603,1323.0,1238.0,690.0,16749.0,
604,1397.0,1257.0,685.0,16661.0,
605,1496.0,1272.0,656.0,16576.0,
606,1622.0,1234.0,719.0,16425.0,
607,1522.0,1225.0,878.0,16375.0,
608,1476.0,1316.0,899.0,16309.0,
609,1505.0,1470.0,805.0,16220.0,
610,1502.0,1509.0,840.0,16149.0,
611,1450.0,1596.0,796.0,16158.0,
612,1392.0,1600.0,739.0,16269.0,
613,1342.0,1564.0,730.0,16364.0,
614,1244.0,1591.0,821.0,16344.0,
615,1114.0,1540.0,908.0,16438.0,
616,1074.0,1671.0,876.0,16379.0,
617,1003.0,1623.0,891.0,16483.0,
618,956.0,1671.0,801.0,16572.0,
619,892.0,1567.0,890.0,16651.0,
620,869.0,1552.0,822.0,16757.0,
621,995.0,1643.0,722.0,16640.0,
622,952.0,1687.0,679.0,16682.0,
623,958.0,1682.0,718.0,16642.0,
624,938.0,1679.0,677.0,16706.0,
625,889.0,1731.0,605.0,16775.0,
626,839.0,1720.0,646.0,16795.0,
627,831.0,1693.0,676.0,16800.0,
628,824.0,1695.0,598.0,16883.0,
629,775.0,1635.0,625.0,16965.0,
630,761.0,1564.0,633.0,17042.0,
631,748.0,1489.0,665.0,17098.0,
632,790.0,1453.0,648.0,17109.0,
633,833.0,1352.0,618.0,17197.0,
634,823.0,1366.0,610.0,17201.0,
635,838.0,1309.0,629.0,17224.0,
636,836.0,1326.0,584.0,17254.0,
637,890.0,1371.0,537.0,17202.0,
638,858.0,1368.0,598.0,17176.0,
639,903.0,1370.0,514.0,17213.0,
640,949.0,1347.0,548.0,17156.0,
641,938.0,1335.0,525.0,17202.0,
642,984.0,1233.0,478.0,17305.0,
643,1025.0,1118.0,547.0,17310.0,
644,1110.0,1121.0,520.0,17249.0,
645,1161.0,1153.0,530.0,17156.0,
646,1176.0,1111.0,436.0,17277.0,
647,1189.0,1092.0,459.0,17260.0,
648,1165.0,980.0,510.0,17345.0,
649,1177.0,944.0,561.0,17318.0,
650,1239.0,879.0,503.0,17379.0,
651,1294.0,893.0,503.0,17310.0,
652,1311.0,829.0,588.0,17272.0,
653,1343.0,756.0,579.0,17322.0,
654,1340.0,784.0,532.0,17344.0,
655,1369.0,803.0,575.0,17253.0,
656,1384.0,786.0,605.0,17225.0,
657,1387.0,759.0,602.0,17252.0,
658,1386.0,786.0,554.0,17274.0,
659,1399.0,832.0,512.0,17257.0,
660,1432.0,865.0,464.0,17239.0,
661,1395.0,844.0,493.0,17268.0,
662,1357.0,823.0,506.0,17314.0,
663,1285.0,772.0,529.0,17414.0,
664,1310.0,749.0,532.0,17409.0,
665,1333.0,678.0,550.0,17439.0,
666,1392.0,607.0,535.0,17466.0,
667,1456.0,567.0,572.0,17405.0,
668,1491.0,620.0,496.0,17393.0,
669,1474.0,693.0,524.0,17309.0,
670,1504.0,650.0,522.0,17324.0,
671,1509.0,623.0,549.0,17319.0,
672,1495.0,709.0,481.0,17315.0,
673,1529.0,774.0,444.0,17253.0,
674,1541.0,772.0,467.0,17220.0,
675,1533.0,808.0,477.0,17182.0,
676,1497.0,755.0,526.0,17222.0,
677,1476.0,781.0,556.0,17187.0,
678,1420.0,786.0,627.0,17167.0,
679,1417.0,727.0,626.0,17230.0,
680,1414.0,766.0,578.0,17242.0,
681,1403.0,824.0,517.0,17256.0,
682,1358.0,860.0,562.0,17220.0,
683,1309.0,847.0,618.0,17226.0,
684,1265.0,883.0,550.0,17302.0,
685,1240.0,900.0,526.0,17334.0,
686,1262.0,970.0,470.0,17298.0,
687,1232.0,928.0,506.0,17334.0,
688,1316.0,895.0,534.0,17255.0,
689,1317.0,947.0,536.0,17200.0,
690,1475.0,956.0,526.0,17043.0,
691,1441.0,928.0,611.0,17020.0,
692,1319.0,1033.0,647.0,17001.0,
693,1282.0,1122.0,533.0,17063.0,
694,1223.0,1139.0,577.0,17061.0,
695,1198.0,1070.0,607.0,17125.0,
696,1190.0,1056.0,545.0,17209.0,
697,1165.0,1021.0,551.0,17263.0,
698,1167.0,1041.0,537.0,17255.0,
699,1115.0,1022.0,610.0,17253.0,
700,1089.0,1085.0,627.0,17199.0,
701,1036.0,1099.0,618.0,17247.0,
702,1024.0,1176.0,558.0,17242.0,
703,995.0,1165.0,543.0,17297.0,
704,1012.0,1178.0,532.0,17278.0,
705,1010.0,1132.0,544.0,17314.0,
706,1018.0,1148.0,507.0,17327.0,
707,1033.0,1067.0,509.0,17391.0,
708,1042.0,1102.0,477.0,17379.0,
709,1040.0,1010.0,489.0,17461.0,
710,1068.0,1023.0,423.0,17486.0,
711,1108.0,999.0,431.0,17462.0,
712,1196.0,967.0,425.0,17412.0,
713,1233.0,954.0,413.0,17400.0,
714,1270.0,947.0,442.0,17341.0,
715,1324.0,1030.0,520.0,17126.0,
716,1380.0,1058.0,486.0,17076.0,
717,1491.0,1031.0,581.0,16897.0,
718,1518.0,1055.0,578.0,16849.0,
719,1598.0,1092.0,565.0,16745.0,
720,1600.0,1073.0,643.0,16684.0,
721,1590.0,1120.0,750.0,16540.0,
722,1573.0,1263.0,684.0,16480.0,
723,1519.0,1322.0,724.0,16435.0,
724,1400.0,1449.0,746.0,16405.0,
725,1301.0,1547.0,730.0,16422.0,
726,1205.0,1614.0,765.0,16416.0,
727,1172.0,1590.0,791.0,16447.0,
728,1154.0,1621.0,759.0,16466.0,
729,1110.0,1633.0,795.0,16462.0,
730,1030.0,1603.0,766.0,16601.0,
