jour,S,I,E,R,
0,19980.0,20.0,0.0,0.0,
1,19968.0,20.0,12.0,0.0,
2,19903.0,22.0,75.0,0.0,
3,19831.0,41.0,128.0,0.0,
4,19609.0,84.0,306.0,1.0,
5,19206.0,159.0,628.0,7.0,
6,18554.0,322.0,1106.0,18.0,
7,17340.0,613.0,1992.0,55.0,
8,14754.0,1078.0,4070.0,98.0,
9,11109.0,2510.0,6213.0,168.0,
10,6928.0,3952.0,8821.0,299.0,
11,2938.0,6233.0,9884.0,945.0,
12,596.0,7913.0,9868.0,1623.0,
13,113.0,9265.0,8087.0,2535.0,
14,17.0,9813.0,6445.0,3725.0,
15,1.0,10214.0,4720.0,5065.0,
16,0.0,9479.0,3943.0,6578.0,
17,0.0,8871.0,3114.0,8015.0,
18,0.0,8244.0,2356.0,9400.0,
19,0.0,7767.0,1820.0,10413.0,
20,0.0,6987.0,1404.0,11609.0,
21,0.0,6383.0,940.0,12677.0,
22,0.0,5905.0,569.0,13526.0,
23,10.0,5508.0,296.0,14186.0,
24,6.0,5008.0,138.0,14848.0,
25,51.0,4646.0,17.0,15286.0,
26,36.0,4143.0,42.0,15779.0,
27,174.0,3398.0,61.0,16367.0,
28,202.0,2987.0,147.0,16664.0,
29,238.0,2584.0,231.0,16947.0,
30,187.0,2272.0,274.0,17267.0,
31,97.0,2105.0,328.0,17470.0,
32,59.0,1976.0,366.0,17599.0,
33,93.0,1866.0,288.0,17753.0,
34,116.0,1623.0,299.0,17962.0,
35,137.0,1536.0,340.0,17987.0,
36,149.0,1443.0,369.0,18039.0,
37,147.0,1446.0,278.0,18129.0,
38,153.0,1112.0,248.0,18487.0,
39,104.0,916.0,227.0,18753.0,
40,88.0,793.0,222.0,18897.0,
41,74.0,760.0,234.0,18932.0,
42,104.0,741.0,234.0,18921.0,
43,101.0,574.0,234.0,19091.0,
44,218.0,554.0,237.0,18991.0,
45,333.0,501.0,232.0,18934.0,
46,498.0,514.0,204.0,18784.0,
47,691.0,502.0,197.0,18610.0,
48,757.0,449.0,199.0,18595.0,
49,958.0,473.0,279.0,18290.0,
50,923.0,525.0,329.0,18223.0,
51,1011.0,555.0,304.0,18130.0,
52,1109.0,673.0,261.0,17957.0,
53,992.0,649.0,356.0,18003.0,
54,946.0,640.0,375.0,18039.0,
55,881.0,577.0,400.0,18142.0,
56,879.0,647.0,291.0,18183.0,
57,811.0,553.0,322.0,18314.0,
58,867.0,544.0,295.0,18294.0,
59,1024.0,465.0,296.0,18215.0,
60,1062.0,422.0,286.0,18230.0,
61,1025.0,445.0,330.0,18200.0,
62,1012.0,471.0,340.0,18177.0,
63,972.0,429.0,327.0,18272.0,
64,909.0,399.0,322.0,18370.0,
65,912.0,428.0,300.0,18360.0,
66,829.0,418.0,401.0,18352.0,
67,814.0,412.0,430.0,18344.0,
68,828.0,408.0,380.0,18384.0,
69,818.0,443.0,360.0,18379.0,
70,841.0,425.0,350.0,18384.0,
71,864.0,422.0,372.0,18342.0,
72,849.0,495.0,318.0,18338.0,
73,789.0,491.0,313.0,18407.0,
74,834.0,494.0,275.0,18397.0,
75,789.0,483.0,276.0,18452.0,
76,815.0,491.0,286.0,18408.0,
77,801.0,514.0,261.0,18424.0,
78,845.0,481.0,302.0,18372.0,
79,808.0,461.0,320.0,18411.0,
80,796.0,400.0,343.0,18461.0,
81,745.0,422.0,364.0,18469.0,
82,705.0,431.0,380.0,18484.0,
83,734.0,464.0,329.0,18473.0,
84,666.0,442.0,371.0,18521.0,
85,665.0,431.0,413.0,18491.0,
86,680.0,518.0,327.0,18475.0,
87,706.0,515.0,330.0,18449.0,
88,772.0,477.0,362.0,18389.0,
89,828.0,469.0,332.0,18371.0,
90,827.0,540.0,318.0,18315.0,
91,964.0,557.0,294.0,18185.0,
92,1014.0,557.0,264.0,18165.0,
93,1147.0,498.0,316.0,18039.0,
94,1351.0,456.0,375.0,17818.0,
95,1341.0,511.0,351.0,17797.0,
96,1431.0,608.0,222.0,17739.0,
97,1372.0,612.0,314.0,17702.0,
98,1324.0,620.0,445.0,17611.0,
99,1436.0,769.0,429.0,17366.0,
100,1471.0,853.0,385.0,17291.0,
101,1334.0,880.0,473.0,17313.0,
102,1288.0,849.0,499.0,17364.0,
103,1416.0,818.0,510.0,17256.0,
104,1274.0,832.0,594.0,17300.0,
105,1204.0,915.0,524.0,17357.0,
106,1132.0,877.0,537.0,17454.0,
107,1062.0,827.0,554.0,17557.0,
108,936.0,930.0,619.0,17515.0,
109,905.0,1005.0,493.0,17597.0,
110,881.0,972.0,490.0,17657.0,
111,777.0,955.0,513.0,17755.0,
112,717.0,915.0,548.0,17820.0,
113,701.0,933.0,482.0,17884.0,
114,642.0,915.0,529.0,17914.0,
115,627.0,895.0,559.0,17919.0,
116,621.0,851.0,557.0,17971.0,
117,612.0,809.0,524.0,18055.0,
118,621.0,823.0,448.0,18108.0,
119,617.0,743.0,454.0,18186.0,
120,628.0,661.0,452.0,18259.0,
121,610.0,723.0,379.0,18288.0,
122,686.0,686.0,377.0,18251.0,
123,689.0,659.0,379.0,18273.0,
124,685.0,650.0,354.0,18311.0,
125,724.0,639.0,276.0,18361.0,
126,787.0,590.0,278.0,18345.0,
127,793.0,530.0,312.0,18365.0,
128,791.0,512.0,254.0,18443.0,
129,773.0,490.0,299.0,18438.0,
130,739.0,464.0,369.0,18428.0,
131,729.0,444.0,394.0,18433.0,
132,733.0,478.0,349.0,18440.0,
133,802.0,478.0,358.0,18362.0,
134,821.0,430.0,354.0,18395.0,
135,890.0,417.0,334.0,18359.0,
136,857.0,406.0,343.0,18394.0,
137,1019.0,373.0,407.0,18201.0,
138,1031.0,394.0,433.0,18142.0,
139,1042.0,450.0,385.0,18123.0,
140,1024.0,512.0,375.0,18089.0,
141,1021.0,576.0,325.0,18078.0,
142,1007.0,531.0,347.0,18115.0,
143,1017.0,534.0,349.0,18100.0,
144,999.0,546.0,403.0,18052.0,
145,973.0,584.0,378.0,18065.0,
146,928.0,573.0,380.0,18119.0,
147,921.0,602.0,398.0,18079.0,
148,933.0,623.0,410.0,18034.0,
149,886.0,601.0,442.0,18071.0,
150,851.0,632.0,422.0,18095.0,
151,865.0,578.0,480.0,18077.0,
152,878.0,547.0,483.0,18092.0,
153,880.0,558.0,442.0,18120.0,
154,859.0,547.0,431.0,18163.0,
155,840.0,595.0,429.0,18136.0,
156,946.0,507.0,442.0,18105.0,
157,950.0,536.0,370.0,18144.0,
158,1073.0,506.0,357.0,18064.0,
159,1180.0,524.0,391.0,17905.0,
160,1153.0,519.0,459.0,17869.0,
161,1113.0,507.0,472.0,17908.0,
162,1114.0,501.0,496.0,17889.0,
163,1105.0,512.0,519.0,17864.0,
164,1156.0,521.0,475.0,17848.0,
165,1397.0,524.0,479.0,17600.0,
166,1533.0,596.0,492.0,17379.0,
167,1488.0,627.0,486.0,17399.0,
168,1439.0,657.0,506.0,17398.0,
169,1455.0,609.0,514.0,17422.0,
170,1523.0,551.0,481.0,17445.0,
171,1669.0,487.0,477.0,17367.0,
172,1789.0,429.0,445.0,17337.0,
173,1810.0,411.0,597.0,17182.0,
174,1928.0,505.0,566.0,17001.0,
175,1947.0,550.0,566.0,16937.0,
176,2015.0,615.0,630.0,16740.0,
177,2025.0,631.0,698.0,16646.0,
178,1987.0,710.0,671.0,16632.0,
179,1881.0,786.0,679.0,16654.0,
180,1815.0,828.0,710.0,16647.0,
181,1878.0,888.0,668.0,16566.0,
182,1786.0,969.0,712.0,16533.0,
183,1787.0,999.0,828.0,16386.0,
184,1854.0,1208.0,719.0,16219.0,
185,1677.0,1220.0,829.0,16274.0,
186,1469.0,1302.0,1020.0,16209.0,
187,1276.0,1474.0,1099.0,16151.0,
188,1055.0,1611.0,1132.0,16202.0,
189,1016.0,1602.0,1056.0,16326.0,
190,877.0,1729.0,1027.0,16367.0,
191,735.0,1835.0,1056.0,16374.0,
192,687.0,1831.0,952.0,16530.0,
193,642.0,1984.0,768.0,16606.0,
194,599.0,1930.0,802.0,16669.0,
195,614.0,1950.0,769.0,16667.0,
196,554.0,2033.0,664.0,16749.0,
197,695.0,1953.0,579.0,16773.0,
198,626.0,1868.0,642.0,16864.0,
199,594.0,1766.0,724.0,16916.0,
200,569.0,1721.0,683.0,17027.0,
201,582.0,1512.0,700.0,17206.0,
202,547.0,1310.0,700.0,17443.0,
203,544.0,1391.0,584.0,17481.0,
204,583.0,1337.0,492.0,17588.0,
205,622.0,1352.0,562.0,17464.0,
206,620.0,1229.0,492.0,17659.0,
207,578.0,1206.0,464.0,17752.0,
208,555.0,1139.0,471.0,17835.0,
209,565.0,1147.0,365.0,17923.0,
210,558.0,1080.0,352.0,18010.0,
211,551.0,974.0,370.0,18105.0,
212,619.0,954.0,380.0,18047.0,
213,718.0,958.0,326.0,17998.0,
214,787.0,920.0,310.0,17983.0,
215,741.0,875.0,391.0,17993.0,
216,720.0,874.0,413.0,17993.0,
217,693.0,860.0,390.0,18057.0,
218,656.0,918.0,377.0,18049.0,
219,651.0,931.0,379.0,18039.0,
220,644.0,861.0,389.0,18106.0,
221,640.0,785.0,375.0,18200.0,
222,691.0,780.0,375.0,18154.0,
223,712.0,759.0,385.0,18144.0,
224,708.0,683.0,392.0,18217.0,
225,721.0,656.0,384.0,18239.0,
226,736.0,540.0,313.0,18411.0,
227,820.0,452.0,332.0,18396.0,
228,840.0,373.0,342.0,18445.0,
229,885.0,349.0,317.0,18449.0,
230,897.0,332.0,314.0,18457.0,
231,980.0,345.0,306.0,18369.0,
232,1258.0,340.0,287.0,18115.0,
233,1433.0,358.0,279.0,17930.0,
234,1471.0,419.0,222.0,17888.0,
235,1558.0,399.0,236.0,17807.0,
236,1547.0,412.0,308.0,17733.0,
237,1591.0,446.0,334.0,17629.0,
238,1560.0,473.0,436.0,17531.0,
239,1503.0,574.0,412.0,17511.0,
240,1417.0,591.0,516.0,17476.0,
241,1304.0,610.0,649.0,17437.0,
242,1377.0,696.0,558.0,17369.0,
243,1404.0,716.0,674.0,17206.0,
244,1368.0,754.0,758.0,17120.0,
245,1246.0,781.0,899.0,17074.0,
246,1180.0,865.0,846.0,17109.0,
247,1045.0,1028.0,815.0,17112.0,
248,1118.0,1092.0,678.0,17112.0,
249,999.0,1122.0,736.0,17143.0,
250,954.0,1164.0,736.0,17146.0,
251,871.0,1265.0,665.0,17199.0,
252,746.0,1312.0,688.0,17254.0,
253,694.0,1316.0,630.0,17360.0,
254,597.0,1353.0,607.0,17443.0,
255,531.0,1353.0,608.0,17508.0,
256,508.0,1313.0,569.0,17610.0,
257,456.0,1242.0,606.0,17696.0,
258,439.0,1202.0,546.0,17813.0,
259,438.0,1159.0,576.0,17827.0,
260,440.0,1145.0,508.0,17907.0,
261,435.0,1153.0,484.0,17928.0,
262,423.0,1135.0,454.0,17988.0,
263,445.0,1059.0,478.0,18018.0,
264,482.0,1020.0,441.0,18057.0,
265,546.0,1044.0,384.0,18026.0,
266,554.0,1015.0,348.0,18083.0,
267,606.0,1006.0,362.0,18026.0,
268,657.0,993.0,323.0,18027.0,
269,746.0,957.0,351.0,17946.0,
270,772.0,998.0,339.0,17891.0,
271,805.0,1027.0,296.0,17872.0,
272,873.0,1047.0,299.0,17781.0,
273,931.0,1002.0,336.0,17731.0,
274,938.0,994.0,410.0,17658.0,
275,938.0,1045.0,339.0,17678.0,
276,935.0,1017.0,348.0,17700.0,
277,955.0,1060.0,307.0,17678.0,
278,955.0,1038.0,366.0,17641.0,
279,870.0,1051.0,472.0,17607.0,
280,882.0,1077.0,441.0,17600.0,
281,814.0,1021.0,548.0,17617.0,
282,801.0,1034.0,482.0,17683.0,
283,830.0,1056.0,438.0,17676.0,
284,821.0,932.0,506.0,17741.0,
285,837.0,916.0,468.0,17779.0,
286,859.0,938.0,445.0,17758.0,
287,968.0,919.0,481.0,17632.0,
288,1007.0,818.0,459.0,17716.0,
289,1061.0,795.0,468.0,17676.0,
290,1175.0,772.0,516.0,17537.0,
291,1190.0,777.0,538.0,17495.0,
292,1208.0,800.0,525.0,17467.0,
293,1218.0,740.0,533.0,17509.0,
294,1244.0,806.0,517.0,17433.0,
295,1249.0,802.0,518.0,17431.0,
296,1273.0,865.0,540.0,17322.0,
297,1264.0,900.0,508.0,17328.0,
298,1241.0,930.0,544.0,17285.0,
299,1178.0,841.0,652.0,17329.0,
300,1095.0,956.0,606.0,17343.0,
301,1098.0,965.0,563.0,17374.0,
302,1013.0,1009.0,552.0,17426.0,
303,888.0,1022.0,668.0,17422.0,
304,886.0,1042.0,600.0,17472.0,
305,844.0,1087.0,562.0,17507.0,
306,920.0,1061.0,560.0,17459.0,
307,840.0,1023.0,595.0,17542.0,
308,796.0,1007.0,675.0,17522.0,
309,795.0,1013.0,685.0,17507.0,
310,783.0,990.0,699.0,17528.0,
311,742.0,1029.0,615.0,17614.0,
312,713.0,992.0,554.0,17741.0,
313,705.0,927.0,483.0,17885.0,
314,697.0,859.0,408.0,18036.0,
315,711.0,780.0,389.0,18120.0,
316,751.0,808.0,366.0,18075.0,
317,777.0,746.0,400.0,18077.0,
318,798.0,660.0,403.0,18139.0,
319,863.0,593.0,375.0,18169.0,
320,983.0,519.0,390.0,18108.0,
321,1109.0,487.0,432.0,17972.0,
322,1170.0,490.0,458.0,17882.0,
323,1261.0,517.0,463.0,17759.0,
324,1348.0,562.0,401.0,17689.0,
325,1416.0,545.0,394.0,17645.0,
326,1408.0,554.0,434.0,17604.0,
327,1371.0,622.0,407.0,17600.0,
328,1341.0,597.0,542.0,17520.0,
329,1461.0,713.0,470.0,17356.0,
330,1537.0,714.0,446.0,17303.0,
331,1492.0,675.0,506.0,17327.0,
332,1605.0,707.0,599.0,17089.0,
333,1574.0,702.0,642.0,17082.0,
334,1682.0,779.0,683.0,16856.0,
335,1649.0,859.0,686.0,16806.0,
336,1610.0,956.0,759.0,16675.0,
337,1439.0,1091.0,796.0,16674.0,
338,1348.0,1046.0,954.0,16652.0,
339,1197.0,1054.0,1052.0,16697.0,
340,1158.0,1147.0,1015.0,16680.0,
341,1098.0,1276.0,982.0,16644.0,
342,1058.0,1266.0,1052.0,16624.0,
343,1050.0,1285.0,1002.0,16663.0,
344,1070.0,1321.0,997.0,16612.0,
345,1086.0,1338.0,980.0,16596.0,
346,1056.0,1274.0,918.0,16752.0,
347,1131.0,1227.0,933.0,16709.0,
348,1049.0,1279.0,948.0,16724.0,
349,1057.0,1418.0,861.0,16664.0,
350,1001.0,1561.0,799.0,16639.0,
351,933.0,1619.0,796.0,16652.0,
352,822.0,1670.0,904.0,16604.0,
353,874.0,1739.0,817.0,16570.0,
354,881.0,1775.0,727.0,16617.0,
355,864.0,1780.0,715.0,16641.0,
356,829.0,1624.0,746.0,16801.0,
357,931.0,1515.0,796.0,16758.0,
358,926.0,1495.0,726.0,16853.0,
359,962.0,1463.0,810.0,16765.0,
360,934.0,1458.0,877.0,16731.0,
361,1008.0,1529.0,749.0,16714.0,
362,1041.0,1491.0,780.0,16688.0,
363,1017.0,1535.0,810.0,16638.0,
364,1015.0,1461.0,886.0,16638.0,
365,990.0,1576.0,814.0,16620.0,
366,930.0,1583.0,802.0,16685.0,
367,840.0,1514.0,891.0,16755.0,
368,766.0,1517.0,897.0,16820.0,
369,729.0,1554.0,859.0,16858.0,
370,684.0,1675.0,768.0,16873.0,
371,615.0,1663.0,800.0,16922.0,
372,600.0,1623.0,778.0,16999.0,
373,563.0,1693.0,627.0,17117.0,
374,627.0,1534.0,664.0,17175.0,
375,598.0,1547.0,680.0,17175.0,
376,595.0,1431.0,651.0,17323.0,
377,635.0,1475.0,685.0,17205.0,
378,641.0,1393.0,691.0,17275.0,
379,583.0,1369.0,704.0,17344.0,
380,573.0,1297.0,680.0,17450.0,
381,638.0,1162.0,692.0,17508.0,
382,650.0,1122.0,681.0,17547.0,
383,641.0,952.0,729.0,17678.0,
384,793.0,895.0,676.0,17636.0,
385,966.0,878.0,673.0,17483.0,
386,1019.0,802.0,693.0,17486.0,
387,1181.0,706.0,751.0,17362.0,
388,1258.0,659.0,771.0,17312.0,
389,1219.0,622.0,841.0,17318.0,
390,1262.0,722.0,755.0,17261.0,
391,1256.0,756.0,743.0,17245.0,
392,1160.0,731.0,774.0,17335.0,
393,1173.0,832.0,662.0,17333.0,
394,1168.0,818.0,658.0,17356.0,
395,1160.0,792.0,646.0,17402.0,
396,1137.0,856.0,595.0,17412.0,
397,1125.0,817.0,529.0,17529.0,
398,1120.0,829.0,477.0,17574.0,
399,1130.0,863.0,504.0,17503.0,
400,1134.0,786.0,625.0,17455.0,
401,1168.0,860.0,611.0,17361.0,
402,1101.0,893.0,595.0,17411.0,
403,1091.0,898.0,596.0,17415.0,
404,1045.0,827.0,609.0,17519.0,
405,1029.0,857.0,600.0,17514.0,
406,1087.0,834.0,614.0,17465.0,
407,1044.0,919.0,553.0,17484.0,
408,1064.0,970.0,562.0,17404.0,
409,1004.0,1009.0,556.0,17431.0,
410,1032.0,1002.0,546.0,17420.0,
411,953.0,1004.0,594.0,17449.0,
412,837.0,1141.0,585.0,17437.0,
413,820.0,1229.0,467.0,17484.0,
414,771.0,1207.0,515.0,17507.0,
415,724.0,1140.0,478.0,17658.0,
416,679.0,1171.0,423.0,17727.0,
417,714.0,1024.0,455.0,17807.0,
418,720.0,989.0,490.0,17801.0,
419,701.0,963.0,543.0,17793.0,
420,748.0,892.0,482.0,17878.0,
421,736.0,877.0,434.0,17953.0,
422,717.0,893.0,394.0,17996.0,
423,708.0,815.0,436.0,18041.0,
424,696.0,746.0,433.0,18125.0,
425,717.0,765.0,407.0,18111.0,
426,696.0,797.0,344.0,18163.0,
427,706.0,735.0,377.0,18182.0,
428,711.0,692.0,378.0,18219.0,
429,726.0,682.0,319.0,18273.0,
430,739.0,666.0,332.0,18263.0,
431,734.0,638.0,358.0,18270.0,
432,740.0,652.0,325.0,18283.0,
433,752.0,654.0,275.0,18319.0,
434,776.0,658.0,315.0,18251.0,
435,792.0,660.0,292.0,18256.0,
436,804.0,625.0,299.0,18272.0,
437,931.0,614.0,273.0,18182.0,
438,932.0,588.0,267.0,18213.0,
439,994.0,577.0,311.0,18118.0,
440,1065.0,559.0,318.0,18058.0,
441,1055.0,516.0,351.0,18078.0,
442,1083.0,508.0,421.0,17988.0,
443,1128.0,499.0,471.0,17902.0,
444,1151.0,527.0,481.0,17841.0,
445,1209.0,548.0,466.0,17777.0,
446,1204.0,543.0,466.0,17787.0,
447,1196.0,508.0,504.0,17792.0,
448,1269.0,543.0,535.0,17653.0,
449,1314.0,614.0,522.0,17550.0,
450,1382.0,661.0,591.0,17366.0,
451,1300.0,737.0,616.0,17347.0,
452,1286.0,842.0,680.0,17192.0,
453,1186.0,925.0,706.0,17183.0,
454,1132.0,982.0,727.0,17159.0,
455,1090.0,1068.0,660.0,17182.0,
456,1030.0,1051.0,647.0,17272.0,
457,1056.0,962.0,633.0,17349.0,
458,1046.0,892.0,593.0,17469.0,
459,1076.0,817.0,608.0,17499.0,
460,1085.0,809.0,598.0,17508.0,
461,1231.0,850.0,569.0,17350.0,
462,1228.0,836.0,563.0,17373.0,
463,1292.0,868.0,582.0,17258.0,
464,1218.0,923.0,660.0,17199.0,
465,1200.0,1006.0,530.0,17264.0,
466,1251.0,948.0,575.0,17226.0,
467,1225.0,918.0,628.0,17229.0,
468,1169.0,916.0,705.0,17210.0,
469,1144.0,903.0,710.0,17243.0,
470,1134.0,922.0,825.0,17119.0,
471,1270.0,967.0,809.0,16954.0,
472,1251.0,989.0,783.0,16977.0,
473,1158.0,1009.0,878.0,16955.0,
474,1150.0,1045.0,816.0,16989.0,
475,1092.0,1073.0,810.0,17025.0,
476,1022.0,1114.0,793.0,17071.0,
477,967.0,1078.0,815.0,17140.0,
478,872.0,1182.0,836.0,17110.0,
479,889.0,1204.0,793.0,17114.0,
480,858.0,1257.0,704.0,17181.0,
481,869.0,1086.0,794.0,17251.0,
482,864.0,1115.0,686.0,17335.0,
483,910.0,1140.0,667.0,17283.0,
484,882.0,1121.0,717.0,17280.0,
485,911.0,1087.0,671.0,17331.0,
486,923.0,1095.0,603.0,17379.0,
487,928.0,1052.0,571.0,17449.0,
488,920.0,1092.0,584.0,17404.0,
489,904.0,1031.0,708.0,17357.0,
490,910.0,1059.0,671.0,17360.0,
491,977.0,1035.0,699.0,17289.0,
492,982.0,1029.0,650.0,17339.0,
493,1001.0,998.0,613.0,17388.0,
494,997.0,1014.0,589.0,17400.0,
495,982.0,945.0,621.0,17452.0,
496,943.0,922.0,688.0,17447.0,
497,973.0,997.0,608.0,17422.0,
498,981.0,1023.0,590.0,17406.0,
499,960.0,983.0,614.0,17443.0,
500,971.0,966.0,596.0,17467.0,
501,970.0,860.0,631.0,17539.0,
502,974.0,874.0,616.0,17536.0,
503,945.0,889.0,625.0,17541.0,
504,967.0,937.0,558.0,17538.0,
505,955.0,894.0,528.0,17623.0,
506,962.0,887.0,499.0,17652.0,
507,995.0,836.0,579.0,17590.0,
508,987.0,876.0,506.0,17631.0,
509,972.0,913.0,486.0,17629.0,
510,976.0,937.0,469.0,17618.0,
511,977.0,884.0,438.0,17701.0,
512,993.0,852.0,479.0,17676.0,
513,1041.0,817.0,475.0,17667.0,
514,1081.0,796.0,426.0,17697.0,
515,1084.0,795.0,541.0,17580.0,
516,1099.0,805.0,515.0,17581.0,
517,1093.0,843.0,468.0,17596.0,
518,1090.0,869.0,440.0,17601.0,
519,1073.0,883.0,464.0,17580.0,
520,1040.0,876.0,544.0,17540.0,
521,1058.0,820.0,597.0,17525.0,
522,1074.0,908.0,536.0,17482.0,
523,1028.0,888.0,638.0,17446.0,
524,978.0,909.0,642.0,17471.0,
525,1005.0,869.0,600.0,17526.0,
526,1006.0,946.0,550.0,17498.0,
527,1051.0,989.0,556.0,17404.0,
528,1051.0,1010.0,553.0,17386.0,
529,1098.0,988.0,570.0,17344.0,
530,1091.0,993.0,591.0,17325.0,
531,1064.0,1033.0,569.0,17334.0,
532,1012.0,1058.0,502.0,17428.0,
533,1034.0,1033.0,539.0,17394.0,
534,1072.0,1048.0,589.0,17291.0,
535,1111.0,1082.0,622.0,17185.0,
536,1070.0,1083.0,703.0,17144.0,
537,1061.0,1155.0,688.0,17096.0,
538,1082.0,1196.0,690.0,17032.0,
539,980.0,1172.0,816.0,17032.0,
540,1045.0,1222.0,722.0,17011.0,
541,1140.0,1316.0,677.0,16867.0,
542,1103.0,1425.0,716.0,16756.0,
543,956.0,1593.0,726.0,16725.0,
544,890.0,1701.0,689.0,16720.0,
545,751.0,1819.0,693.0,16737.0,
546,650.0,1910.0,690.0,16750.0,
547,569.0,1911.0,736.0,16784.0,
548,535.0,1932.0,747.0,16786.0,
549,501.0,1880.0,657.0,16962.0,
550,469.0,1928.0,575.0,17028.0,
551,463.0,1895.0,549.0,17093.0,
552,462.0,1896.0,480.0,17162.0,
553,429.0,1687.0,488.0,17396.0,
554,403.0,1666.0,495.0,17436.0,
555,408.0,1612.0,458.0,17522.0,
556,405.0,1447.0,465.0,17683.0,
557,406.0,1351.0,446.0,17797.0,
558,402.0,1280.0,404.0,17914.0,
559,437.0,1208.0,399.0,17956.0,
560,473.0,1139.0,396.0,17992.0,
561,530.0,1085.0,382.0,18003.0,
562,593.0,934.0,369.0,18104.0,
563,611.0,897.0,310.0,18182.0,
564,710.0,826.0,311.0,18153.0,
565,745.0,803.0,288.0,18164.0,
566,795.0,713.0,303.0,18189.0,
567,851.0,656.0,296.0,18197.0,
568,929.0,652.0,286.0,18133.0,
569,946.0,616.0,284.0,18154.0,
570,967.0,596.0,296.0,18141.0,
571,932.0,539.0,362.0,18167.0,
572,1003.0,545.0,341.0,18111.0,
573,1059.0,567.0,333.0,18041.0,
574,1106.0,516.0,395.0,17983.0,
575,1108.0,501.0,398.0,17993.0,
576,1287.0,509.0,448.0,17756.0,
577,1356.0,511.0,499.0,17634.0,
578,1427.0,568.0,499.0,17506.0,
579,1419.0,592.0,506.0,17483.0,
580,1413.0,627.0,498.0,17462.0,
581,1350.0,653.0,571.0,17426.0,
582,1339.0,659.0,563.0,17439.0,
583,1320.0,784.0,584.0,17312.0,
584,1279.0,818.0,572.0,17331.0,
585,1204.0,802.0,593.0,17401.0,
586,1165.0,842.0,622.0,17371.0,
587,1078.0,921.0,644.0,17357.0,
588,1092.0,962.0,626.0,17320.0,
589,1045.0,963.0,641.0,17351.0,
590,1003.0,978.0,639.0,17380.0,
591,956.0,998.0,592.0,17454.0,
592,946.0,1004.0,560.0,17490.0,
593,910.0,954.0,579.0,17557.0,
594,903.0,991.0,536.0,17570.0,
595,878.0,1005.0,580.0,17537.0,
596,846.0,1045.0,644.0,17465.0,
597,795.0,1095.0,609.0,17501.0,
598,772.0,1163.0,569.0,17496.0,
599,743.0,1231.0,573.0,17453.0,
600,711.0,1226.0,601.0,17462.0,
601,717.0,1249.0,554.0,17480.0,
602,734.0,1222.0,556.0,17488.0,
603,756.0,1186.0,588.0,17470.0,
604,754.0,1154.0,589.0,17503.0,
605,765.0,1120.0,575.0,17540.0,
606,713.0,1131.0,675.0,17481.0,
607,675.0,1150.0,630.0,17545.0,
608,654.0,1165.0,561.0,17620.0,
609,670.0,1072.0,561.0,17697.0,
610,645.0,1074.0,524.0,17757.0,
611,633.0,1041.0,497.0,17829.0,
612,642.0,962.0,477.0,17919.0,
613,630.0,930.0,493.0,17947.0,
614,635.0,842.0,489.0,18034.0,
615,665.0,772.0,477.0,18086.0,
616,669.0,743.0,436.0,18152.0,
617,717.0,758.0,402.0,18123.0,
618,767.0,727.0,372.0,18134.0,
619,801.0,694.0,368.0,18137.0,
620,853.0,658.0,396.0,18093.0,
621,946.0,641.0,421.0,17992.0,
622,982.0,638.0,441.0,17939.0,
623,1024.0,642.0,411.0,17923.0,
624,1083.0,651.0,436.0,17830.0,
625,1116.0,625.0,479.0,17780.0,
626,1133.0,627.0,504.0,17736.0,
627,1154.0,620.0,470.0,17756.0,
628,1157.0,614.0,466.0,17763.0,
629,1204.0,561.0,467.0,17768.0,
630,1230.0,622.0,349.0,17799.0,
631,1230.0,599.0,358.0,17813.0,
632,1287.0,588.0,409.0,17716.0,
633,1307.0,561.0,440.0,17692.0,
634,1326.0,606.0,466.0,17602.0,
635,1295.0,695.0,467.0,17543.0,
636,1283.0,732.0,503.0,17482.0,
637,1254.0,805.0,485.0,17456.0,
638,1204.0,766.0,592.0,17438.0,
639,1229.0,799.0,615.0,17357.0,
640,1219.0,876.0,550.0,17355.0,
641,1210.0,796.0,591.0,17403.0,
642,1209.0,818.0,545.0,17428.0,
643,1227.0,729.0,608.0,17436.0,
644,1242.0,774.0,604.0,17380.0,
645,1180.0,809.0,636.0,17375.0,
646,1125.0,840.0,718.0,17317.0,
647,1086.0,876.0,666.0,17372.0,
648,1060.0,885.0,702.0,17353.0,
649,1014.0,899.0,762.0,17325.0,
650,1037.0,944.0,730.0,17289.0,
651,1096.0,1017.0,704.0,17183.0,
652,1088.0,1080.0,661.0,17171.0,
653,1080.0,1078.0,699.0,17143.0,
654,1043.0,1032.0,724.0,17201.0,
655,1302.0,1091.0,672.0,16935.0,
656,1216.0,1155.0,827.0,16802.0,
657,1283.0,1176.0,892.0,16649.0,
658,1204.0,1224.0,1006.0,16566.0,
659,1095.0,1333.0,949.0,16623.0,
660,1110.0,1399.0,878.0,16613.0,
661,1097.0,1380.0,800.0,16723.0,
662,978.0,1407.0,850.0,16765.0,
663,954.0,1393.0,840.0,16813.0,
664,902.0,1354.0,894.0,16850.0,
665,806.0,1329.0,997.0,16868.0,
666,793.0,1168.0,973.0,17066.0,
667,894.0,1180.0,864.0,17062.0,
668,931.0,1085.0,835.0,17149.0,
669,978.0,900.0,837.0,17285.0,
670,1004.0,902.0,729.0,17365.0,
671,1061.0,900.0,698.0,17341.0,
672,1060.0,804.0,720.0,17416.0,
673,1097.0,853.0,650.0,17400.0,
674,1049.0,857.0,714.0,17380.0,
675,1045.0,854.0,686.0,17415.0,
676,1056.0,831.0,685.0,17428.0,
677,1077.0,778.0,690.0,17455.0,
678,1136.0,755.0,663.0,17446.0,
679,1187.0,752.0,651.0,17410.0,
680,1173.0,781.0,611.0,17435.0,
681,1159.0,813.0,628.0,17400.0,
682,1189.0,738.0,613.0,17460.0,
683,1249.0,759.0,585.0,17407.0,
684,1303.0,802.0,632.0,17263.0,
685,1349.0,825.0,678.0,17148.0,
686,1387.0,867.0,668.0,17078.0,
687,1419.0,938.0,652.0,16991.0,
688,1464.0,970.0,641.0,16925.0,
689,1463.0,1054.0,660.0,16823.0,
690,1533.0,1103.0,723.0,16641.0,
691,1482.0,1152.0,788.0,16578.0,
692,1380.0,1248.0,809.0,16563.0,
693,1260.0,1368.0,763.0,16609.0,
694,1183.0,1285.0,845.0,16687.0,
695,1157.0,1350.0,780.0,16713.0,
696,1091.0,1297.0,816.0,16796.0,
697,1013.0,1297.0,897.0,16793.0,
698,963.0,1269.0,828.0,16940.0,
699,910.0,1304.0,822.0,16964.0,
700,897.0,1377.0,823.0,16903.0,
701,809.0,1410.0,830.0,16951.0,
702,781.0,1433.0,817.0,16969.0,
703,810.0,1502.0,791.0,16897.0,
704,791.0,1534.0,744.0,16931.0,
705,821.0,1579.0,735.0,16865.0,
706,811.0,1598.0,805.0,16786.0,
707,892.0,1584.0,774.0,16750.0,
708,958.0,1640.0,701.0,16701.0,
709,931.0,1578.0,717.0,16774.0,
710,879.0,1639.0,693.0,16789.0,
711,831.0,1566.0,772.0,16831.0,
712,797.0,1540.0,819.0,16844.0,
713,783.0,1578.0,825.0,16814.0,
714,765.0,1522.0,863.0,16850.0,
715,790.0,1456.0,954.0,16800.0,
716,790.0,1446.0,963.0,16801.0,
717,852.0,1447.0,983.0,16718.0,
718,863.0,1537.0,994.0,16606.0,
719,862.0,1670.0,891.0,16577.0,
720,811.0,1754.0,930.0,16505.0,
721,774.0,1905.0,869.0,16452.0,
722,707.0,1936.0,929.0,16428.0,
723,687.0,2078.0,890.0,16345.0,
724,634.0,2134.0,885.0,16347.0,
725,571.0,2169.0,785.0,16475.0,
726,539.0,2184.0,684.0,16593.0,
727,487.0,2143.0,715.0,16655.0,
728,445.0,2071.0,741.0,16743.0,
729,412.0,2030.0,742.0,16816.0,
730,455.0,2095.0,678.0,16772.0,
