jour,S,I,E,R,
0,19980.0,20.0,0.0,0.0,
1,19965.0,20.0,15.0,0.0,
2,19896.0,25.0,79.0,0.0,
3,19783.0,40.0,176.0,1.0,
4,19583.0,87.0,327.0,3.0,
5,19236.0,173.0,579.0,12.0,
6,18608.0,334.0,1035.0,23.0,
7,17339.0,580.0,2023.0,58.0,
8,15040.0,1065.0,3783.0,112.0,
9,12178.0,1948.0,5577.0,297.0,
10,8227.0,3250.0,7908.0,615.0,
11,3875.0,5617.0,9601.0,907.0,
12,1544.0,7181.0,9728.0,1547.0,
13,600.0,9064.0,8171.0,2165.0,
14,57.0,9696.0,6898.0,3349.0,
15,8.0,9685.0,5767.0,4540.0,
16,0.0,9659.0,4797.0,5544.0,
17,0.0,10027.0,3141.0,6832.0,
18,0.0,9716.0,2392.0,7892.0,
19,0.0,9905.0,1305.0,8790.0,
20,0.0,8965.0,759.0,10276.0,
21,0.0,7553.0,582.0,11865.0,
22,9.0,6558.0,525.0,12908.0,
23,37.0,5889.0,526.0,13548.0,
24,35.0,5278.0,451.0,14236.0,
25,145.0,4689.0,404.0,14762.0,
26,150.0,4059.0,371.0,15420.0,
27,172.0,3640.0,272.0,15916.0,
28,104.0,3418.0,110.0,16368.0,
29,26.0,2968.0,106.0,16900.0,
30,7.0,2543.0,21.0,17429.0,
31,7.0,2234.0,0.0,17759.0,
32,7.0,1834.0,0.0,18159.0,
33,6.0,1544.0,1.0,18449.0,
34,6.0,1433.0,2.0,18559.0,
35,6.0,1321.0,0.0,18673.0,
36,5.0,1162.0,1.0,18832.0,
37,11.0,1063.0,0.0,18926.0,
38,16.0,762.0,0.0,19222.0,
39,36.0,708.0,2.0,19254.0,
40,39.0,663.0,0.0,19298.0,
41,172.0,649.0,2.0,19177.0,
42,389.0,370.0,12.0,19229.0,
43,452.0,265.0,32.0,19251.0,
44,463.0,231.0,38.0,19268.0,
45,469.0,241.0,16.0,19274.0,
46,468.0,251.0,1.0,19280.0,
47,468.0,76.0,4.0,19452.0,
48,467.0,75.0,5.0,19453.0,
49,470.0,54.0,0.0,19476.0,
50,558.0,48.0,6.0,19388.0,
51,568.0,52.0,1.0,19379.0,
52,614.0,31.0,1.0,19354.0,
53,638.0,9.0,2.0,19351.0,
54,659.0,10.0,1.0,19330.0,
55,667.0,11.0,0.0,19322.0,
56,668.0,10.0,0.0,19322.0,
57,692.0,7.0,0.0,19301.0,
58,714.0,7.0,0.0,19279.0,
59,729.0,2.0,0.0,19269.0,
60,758.0,2.0,0.0,19240.0,
61,759.0,2.0,0.0,19239.0,
62,827.0,1.0,1.0,19171.0,
63,843.0,1.0,1.0,19155.0,
64,1022.0,2.0,0.0,18976.0,
65,1022.0,2.0,0.0,18976.0,
66,1076.0,2.0,0.0,18922.0,
67,1219.0,2.0,1.0,18778.0,
68,1230.0,3.0,0.0,18767.0,
69,1247.0,2.0,0.0,18751.0,
70,1304.0,1.0,0.0,18695.0,
71,1325.0,1.0,0.0,18674.0,
72,1425.0,1.0,0.0,18574.0,
73,1468.0,1.0,0.0,18531.0,
74,1497.0,1.0,0.0,18502.0,
75,1545.0,1.0,0.0,18454.0,
76,1605.0,0.0,0.0,18395.0,
77,1607.0,0.0,0.0,18393.0,
78,1807.0,0.0,0.0,18193.0,
79,1990.0,0.0,0.0,18010.0,
80,2012.0,0.0,0.0,17988.0,
81,2182.0,0.0,0.0,17818.0,
82,2213.0,0.0,0.0,17787.0,
83,2349.0,0.0,0.0,17651.0,
84,2406.0,0.0,0.0,17594.0,
85,2416.0,0.0,0.0,17584.0,
86,2473.0,0.0,0.0,17527.0,
87,2619.0,0.0,0.0,17381.0,
88,2639.0,0.0,0.0,17361.0,
89,2641.0,0.0,0.0,17359.0,
90,2641.0,0.0,0.0,17359.0,
91,2645.0,0.0,0.0,17355.0,
92,2648.0,0.0,0.0,17352.0,
93,2654.0,0.0,0.0,17346.0,
94,2682.0,0.0,0.0,17318.0,
95,2700.0,0.0,0.0,17300.0,
96,2727.0,0.0,0.0,17273.0,
97,2770.0,0.0,0.0,17230.0,
98,2823.0,0.0,0.0,17177.0,
99,2862.0,0.0,0.0,17138.0,
100,3082.0,0.0,0.0,16918.0,
101,3355.0,0.0,0.0,16645.0,
102,3410.0,0.0,0.0,16590.0,
103,3518.0,0.0,0.0,16482.0,
104,3587.0,0.0,0.0,16413.0,
105,3661.0,0.0,0.0,16339.0,
106,3714.0,0.0,0.0,16286.0,
107,3722.0,0.0,0.0,16278.0,
108,3778.0,0.0,0.0,16222.0,
109,3843.0,0.0,0.0,16157.0,
110,3845.0,0.0,0.0,16155.0,
111,3858.0,0.0,0.0,16142.0,
112,3941.0,0.0,0.0,16059.0,
113,3951.0,0.0,0.0,16049.0,
114,4007.0,0.0,0.0,15993.0,
115,4008.0,0.0,0.0,15992.0,
116,4009.0,0.0,0.0,15991.0,
117,4009.0,0.0,0.0,15991.0,
118,4009.0,0.0,0.0,15991.0,
119,4009.0,0.0,0.0,15991.0,
120,4009.0,0.0,0.0,15991.0,
121,4018.0,0.0,0.0,15982.0,
122,4018.0,0.0,0.0,15982.0,
123,4023.0,0.0,0.0,15977.0,
124,4057.0,0.0,0.0,15943.0,
125,4063.0,0.0,0.0,15937.0,
126,4156.0,0.0,0.0,15844.0,
127,4245.0,0.0,0.0,15755.0,
128,4372.0,0.0,0.0,15628.0,
129,4379.0,0.0,0.0,15621.0,
130,4504.0,0.0,0.0,15496.0,
131,4569.0,0.0,0.0,15431.0,
132,4578.0,0.0,0.0,15422.0,
133,4578.0,0.0,0.0,15422.0,
134,4581.0,0.0,0.0,15419.0,
135,4581.0,0.0,0.0,15419.0,
136,4631.0,0.0,0.0,15369.0,
137,4769.0,0.0,0.0,15231.0,
138,4801.0,0.0,0.0,15199.0,
139,4801.0,0.0,0.0,15199.0,
140,4801.0,0.0,0.0,15199.0,
141,4801.0,0.0,0.0,15199.0,
142,4801.0,0.0,0.0,15199.0,
143,4801.0,0.0,0.0,15199.0,
144,4803.0,0.0,0.0,15197.0,
145,4807.0,0.0,0.0,15193.0,
146,4812.0,0.0,0.0,15188.0,
147,4826.0,0.0,0.0,15174.0,
148,4826.0,0.0,0.0,15174.0,
149,4839.0,0.0,0.0,15161.0,
150,4851.0,0.0,0.0,15149.0,
151,4860.0,0.0,0.0,15140.0,
152,5024.0,0.0,0.0,14976.0,
153,5092.0,0.0,0.0,14908.0,
154,5275.0,0.0,0.0,14725.0,
155,5277.0,0.0,0.0,14723.0,
156,5361.0,0.0,0.0,14639.0,
157,5386.0,0.0,0.0,14614.0,
158,5391.0,0.0,0.0,14609.0,
159,5458.0,0.0,0.0,14542.0,
160,5465.0,0.0,0.0,14535.0,
161,5576.0,0.0,0.0,14424.0,
162,5646.0,0.0,0.0,14354.0,
163,5682.0,0.0,0.0,14318.0,
164,5740.0,0.0,0.0,14260.0,
165,5805.0,0.0,0.0,14195.0,
166,5806.0,0.0,0.0,14194.0,
167,5870.0,0.0,0.0,14130.0,
168,5943.0,0.0,0.0,14057.0,
169,6014.0,0.0,0.0,13986.0,
170,6108.0,0.0,0.0,13892.0,
171,6167.0,0.0,0.0,13833.0,
172,6234.0,0.0,0.0,13766.0,
173,6304.0,0.0,0.0,13696.0,
174,6399.0,0.0,0.0,13601.0,
175,6417.0,0.0,0.0,13583.0,
176,6417.0,0.0,0.0,13583.0,
177,6444.0,0.0,0.0,13556.0,
178,6444.0,0.0,0.0,13556.0,
179,6444.0,0.0,0.0,13556.0,
180,6444.0,0.0,0.0,13556.0,
181,6444.0,0.0,0.0,13556.0,
182,6492.0,0.0,0.0,13508.0,
183,6556.0,0.0,0.0,13444.0,
184,6587.0,0.0,0.0,13413.0,
185,6602.0,0.0,0.0,13398.0,
186,6602.0,0.0,0.0,13398.0,
187,6628.0,0.0,0.0,13372.0,
188,6670.0,0.0,0.0,13330.0,
189,6727.0,0.0,0.0,13273.0,
190,6794.0,0.0,0.0,13206.0,
191,6867.0,0.0,0.0,13133.0,
192,6867.0,0.0,0.0,13133.0,
193,6886.0,0.0,0.0,13114.0,
194,6899.0,0.0,0.0,13101.0,
195,6984.0,0.0,0.0,13016.0,
196,7091.0,0.0,0.0,12909.0,
197,7126.0,0.0,0.0,12874.0,
198,7134.0,0.0,0.0,12866.0,
199,7134.0,0.0,0.0,12866.0,
200,7136.0,0.0,0.0,12864.0,
201,7137.0,0.0,0.0,12863.0,
202,7137.0,0.0,0.0,12863.0,
203,7137.0,0.0,0.0,12863.0,
204,7137.0,0.0,0.0,12863.0,
205,7137.0,0.0,0.0,12863.0,
206,7137.0,0.0,0.0,12863.0,
207,7137.0,0.0,0.0,12863.0,
208,7137.0,0.0,0.0,12863.0,
209,7137.0,0.0,0.0,12863.0,
210,7137.0,0.0,0.0,12863.0,
211,7137.0,0.0,0.0,12863.0,
212,7137.0,0.0,0.0,12863.0,
213,7137.0,0.0,0.0,12863.0,
214,7137.0,0.0,0.0,12863.0,
215,7137.0,0.0,0.0,12863.0,
216,7137.0,0.0,0.0,12863.0,
217,7137.0,0.0,0.0,12863.0,
218,7139.0,0.0,0.0,12861.0,
219,7149.0,0.0,0.0,12851.0,
220,7167.0,0.0,0.0,12833.0,
221,7201.0,0.0,0.0,12799.0,
222,7240.0,0.0,0.0,12760.0,
223,7290.0,0.0,0.0,12710.0,
224,7415.0,0.0,0.0,12585.0,
225,7515.0,0.0,0.0,12485.0,
226,7659.0,0.0,0.0,12341.0,
227,7682.0,0.0,0.0,12318.0,
228,7725.0,0.0,0.0,12275.0,
229,7743.0,0.0,0.0,12257.0,
230,7820.0,0.0,0.0,12180.0,
231,7829.0,0.0,0.0,12171.0,
232,8017.0,0.0,0.0,11983.0,
233,8131.0,0.0,0.0,11869.0,
234,8212.0,0.0,0.0,11788.0,
235,8242.0,0.0,0.0,11758.0,
236,8247.0,0.0,0.0,11753.0,
237,8251.0,0.0,0.0,11749.0,
238,8269.0,0.0,0.0,11731.0,
239,8269.0,0.0,0.0,11731.0,
240,8324.0,0.0,0.0,11676.0,
241,8393.0,0.0,0.0,11607.0,
242,8393.0,0.0,0.0,11607.0,
243,8393.0,0.0,0.0,11607.0,
244,8450.0,0.0,0.0,11550.0,
245,8453.0,0.0,0.0,11547.0,
246,8455.0,0.0,0.0,11545.0,
247,8455.0,0.0,0.0,11545.0,
248,8455.0,0.0,0.0,11545.0,
249,8455.0,0.0,0.0,11545.0,
250,8457.0,0.0,0.0,11543.0,
251,8466.0,0.0,0.0,11534.0,
252,8466.0,0.0,0.0,11534.0,
253,8472.0,0.0,0.0,11528.0,
254,8486.0,0.0,0.0,11514.0,
255,8493.0,0.0,0.0,11507.0,
256,8530.0,0.0,0.0,11470.0,
257,8530.0,0.0,0.0,11470.0,
258,8576.0,0.0,0.0,11424.0,
259,8725.0,0.0,0.0,11275.0,
260,8928.0,0.0,0.0,11072.0,
261,9000.0,0.0,0.0,11000.0,
262,9000.0,0.0,0.0,11000.0,
263,9007.0,0.0,0.0,10993.0,
264,9007.0,0.0,0.0,10993.0,
265,9007.0,0.0,0.0,10993.0,
266,9007.0,0.0,0.0,10993.0,
267,9007.0,0.0,0.0,10993.0,
268,9011.0,0.0,0.0,10989.0,
269,9017.0,0.0,0.0,10983.0,
270,9017.0,0.0,0.0,10983.0,
271,9044.0,0.0,0.0,10956.0,
272,9044.0,0.0,0.0,10956.0,
273,9045.0,0.0,0.0,10955.0,
274,9045.0,0.0,0.0,10955.0,
275,9118.0,0.0,0.0,10882.0,
276,9120.0,0.0,0.0,10880.0,
277,9120.0,0.0,0.0,10880.0,
278,9120.0,0.0,0.0,10880.0,
279,9272.0,0.0,0.0,10728.0,
280,9282.0,0.0,0.0,10718.0,
281,9282.0,0.0,0.0,10718.0,
282,9282.0,0.0,0.0,10718.0,
283,9282.0,0.0,0.0,10718.0,
284,9282.0,0.0,0.0,10718.0,
285,9288.0,0.0,0.0,10712.0,
286,9288.0,0.0,0.0,10712.0,
287,9290.0,0.0,0.0,10710.0,
288,9324.0,0.0,0.0,10676.0,
289,9394.0,0.0,0.0,10606.0,
290,9523.0,0.0,0.0,10477.0,
291,9541.0,0.0,0.0,10459.0,
292,9640.0,0.0,0.0,10360.0,
293,9766.0,0.0,0.0,10234.0,
294,10127.0,0.0,0.0,9873.0,
295,10328.0,0.0,0.0,9672.0,
296,10382.0,0.0,0.0,9618.0,
297,10389.0,0.0,0.0,9611.0,
298,10413.0,0.0,0.0,9587.0,
299,10481.0,0.0,0.0,9519.0,
300,10506.0,0.0,0.0,9494.0,
301,10664.0,0.0,0.0,9336.0,
302,10857.0,0.0,0.0,9143.0,
303,10948.0,0.0,0.0,9052.0,
304,11050.0,0.0,0.0,8950.0,
305,11117.0,0.0,0.0,8883.0,
306,11214.0,0.0,0.0,8786.0,
307,11345.0,0.0,0.0,8655.0,
308,11408.0,0.0,0.0,8592.0,
309,11450.0,0.0,0.0,8550.0,
310,11484.0,0.0,0.0,8516.0,
311,11485.0,0.0,0.0,8515.0,
312,11488.0,0.0,0.0,8512.0,
313,11489.0,0.0,0.0,8511.0,
314,11489.0,0.0,0.0,8511.0,
315,11500.0,0.0,0.0,8500.0,
316,11534.0,0.0,0.0,8466.0,
317,11546.0,0.0,0.0,8454.0,
318,11556.0,0.0,0.0,8444.0,
319,11806.0,0.0,0.0,8194.0,
320,11856.0,0.0,0.0,8144.0,
321,12033.0,0.0,0.0,7967.0,
322,12153.0,0.0,0.0,7847.0,
323,12237.0,0.0,0.0,7763.0,
324,12333.0,0.0,0.0,7667.0,
325,12469.0,0.0,0.0,7531.0,
326,12472.0,0.0,0.0,7528.0,
327,12577.0,0.0,0.0,7423.0,
328,12591.0,0.0,0.0,7409.0,
329,12593.0,0.0,0.0,7407.0,
330,12598.0,0.0,0.0,7402.0,
331,12604.0,0.0,0.0,7396.0,
332,12604.0,0.0,0.0,7396.0,
333,12606.0,0.0,0.0,7394.0,
334,12656.0,0.0,0.0,7344.0,
335,12656.0,0.0,0.0,7344.0,
336,12690.0,0.0,0.0,7310.0,
337,12808.0,0.0,0.0,7192.0,
338,12864.0,0.0,0.0,7136.0,
339,12869.0,0.0,0.0,7131.0,
340,12872.0,0.0,0.0,7128.0,
341,12872.0,0.0,0.0,7128.0,
342,12872.0,0.0,0.0,7128.0,
343,12872.0,0.0,0.0,7128.0,
344,12872.0,0.0,0.0,7128.0,
345,12872.0,0.0,0.0,7128.0,
346,12872.0,0.0,0.0,7128.0,
347,12872.0,0.0,0.0,7128.0,
348,12872.0,0.0,0.0,7128.0,
349,12872.0,0.0,0.0,7128.0,
350,12872.0,0.0,0.0,7128.0,
351,12872.0,0.0,0.0,7128.0,
352,12872.0,0.0,0.0,7128.0,
353,12872.0,0.0,0.0,7128.0,
354,12872.0,0.0,0.0,7128.0,
355,12872.0,0.0,0.0,7128.0,
356,12879.0,0.0,0.0,7121.0,
357,12892.0,0.0,0.0,7108.0,
358,12892.0,0.0,0.0,7108.0,
359,12892.0,0.0,0.0,7108.0,
360,12893.0,0.0,0.0,7107.0,
361,12998.0,0.0,0.0,7002.0,
362,12999.0,0.0,0.0,7001.0,
363,13129.0,0.0,0.0,6871.0,
364,13148.0,0.0,0.0,6852.0,
365,13149.0,0.0,0.0,6851.0,
366,13149.0,0.0,0.0,6851.0,
367,13149.0,0.0,0.0,6851.0,
368,13149.0,0.0,0.0,6851.0,
369,13149.0,0.0,0.0,6851.0,
370,13149.0,0.0,0.0,6851.0,
371,13149.0,0.0,0.0,6851.0,
372,13149.0,0.0,0.0,6851.0,
373,13149.0,0.0,0.0,6851.0,
374,13149.0,0.0,0.0,6851.0,
375,13149.0,0.0,0.0,6851.0,
376,13149.0,0.0,0.0,6851.0,
377,13149.0,0.0,0.0,6851.0,
378,13149.0,0.0,0.0,6851.0,
379,13149.0,0.0,0.0,6851.0,
380,13149.0,0.0,0.0,6851.0,
381,13149.0,0.0,0.0,6851.0,
382,13149.0,0.0,0.0,6851.0,
383,13149.0,0.0,0.0,6851.0,
384,13149.0,0.0,0.0,6851.0,
385,13149.0,0.0,0.0,6851.0,
386,13149.0,0.0,0.0,6851.0,
387,13149.0,0.0,0.0,6851.0,
388,13149.0,0.0,0.0,6851.0,
389,13149.0,0.0,0.0,6851.0,
390,13149.0,0.0,0.0,6851.0,
391,13149.0,0.0,0.0,6851.0,
392,13149.0,0.0,0.0,6851.0,
393,13149.0,0.0,0.0,6851.0,
394,13149.0,0.0,0.0,6851.0,
395,13149.0,0.0,0.0,6851.0,
396,13149.0,0.0,0.0,6851.0,
397,13149.0,0.0,0.0,6851.0,
398,13149.0,0.0,0.0,6851.0,
399,13149.0,0.0,0.0,6851.0,
400,13149.0,0.0,0.0,6851.0,
401,13149.0,0.0,0.0,6851.0,
402,13149.0,0.0,0.0,6851.0,
403,13149.0,0.0,0.0,6851.0,
404,13151.0,0.0,0.0,6849.0,
405,13152.0,0.0,0.0,6848.0,
406,13152.0,0.0,0.0,6848.0,
407,13153.0,0.0,0.0,6847.0,
408,13153.0,0.0,0.0,6847.0,
409,13154.0,0.0,0.0,6846.0,
410,13268.0,0.0,0.0,6732.0,
411,13268.0,0.0,0.0,6732.0,
412,13389.0,0.0,0.0,6611.0,
413,13403.0,0.0,0.0,6597.0,
414,13407.0,0.0,0.0,6593.0,
415,13407.0,0.0,0.0,6593.0,
416,13408.0,0.0,0.0,6592.0,
417,13408.0,0.0,0.0,6592.0,
418,13408.0,0.0,0.0,6592.0,
419,13408.0,0.0,0.0,6592.0,
420,13408.0,0.0,0.0,6592.0,
421,13408.0,0.0,0.0,6592.0,
422,13408.0,0.0,0.0,6592.0,
423,13408.0,0.0,0.0,6592.0,
424,13408.0,0.0,0.0,6592.0,
425,13408.0,0.0,0.0,6592.0,
426,13408.0,0.0,0.0,6592.0,
427,13408.0,0.0,0.0,6592.0,
428,13408.0,0.0,0.0,6592.0,
429,13408.0,0.0,0.0,6592.0,
430,13410.0,0.0,0.0,6590.0,
431,13410.0,0.0,0.0,6590.0,
432,13410.0,0.0,0.0,6590.0,
433,13413.0,0.0,0.0,6587.0,
434,13438.0,0.0,0.0,6562.0,
435,13438.0,0.0,0.0,6562.0,
436,13438.0,0.0,0.0,6562.0,
437,13475.0,0.0,0.0,6525.0,
438,13589.0,0.0,0.0,6411.0,
439,13661.0,0.0,0.0,6339.0,
440,13803.0,0.0,0.0,6197.0,
441,13870.0,0.0,0.0,6130.0,
442,13880.0,0.0,0.0,6120.0,
443,13957.0,0.0,0.0,6043.0,
444,13961.0,0.0,0.0,6039.0,
445,13961.0,0.0,0.0,6039.0,
446,13961.0,0.0,0.0,6039.0,
447,13961.0,0.0,0.0,6039.0,
448,13961.0,0.0,0.0,6039.0,
449,13961.0,0.0,0.0,6039.0,
450,13961.0,0.0,0.0,6039.0,
451,13965.0,0.0,0.0,6035.0,
452,13975.0,0.0,0.0,6025.0,
453,13975.0,0.0,0.0,6025.0,
454,14004.0,0.0,0.0,5996.0,
455,14007.0,0.0,0.0,5993.0,
456,14015.0,0.0,0.0,5985.0,
457,14043.0,0.0,0.0,5957.0,
458,14062.0,0.0,0.0,5938.0,
459,14076.0,0.0,0.0,5924.0,
460,14159.0,0.0,0.0,5841.0,
461,14160.0,0.0,0.0,5840.0,
462,14237.0,0.0,0.0,5763.0,
463,14240.0,0.0,0.0,5760.0,
464,14240.0,0.0,0.0,5760.0,
465,14240.0,0.0,0.0,5760.0,
466,14240.0,0.0,0.0,5760.0,
467,14240.0,0.0,0.0,5760.0,
468,14240.0,0.0,0.0,5760.0,
469,14240.0,0.0,0.0,5760.0,
470,14240.0,0.0,0.0,5760.0,
471,14240.0,0.0,0.0,5760.0,
472,14240.0,0.0,0.0,5760.0,
473,14240.0,0.0,0.0,5760.0,
474,14240.0,0.0,0.0,5760.0,
475,14240.0,0.0,0.0,5760.0,
476,14240.0,0.0,0.0,5760.0,
477,14240.0,0.0,0.0,5760.0,
478,14240.0,0.0,0.0,5760.0,
479,14240.0,0.0,0.0,5760.0,
480,14240.0,0.0,0.0,5760.0,
481,14240.0,0.0,0.0,5760.0,
482,14244.0,0.0,0.0,5756.0,
483,14244.0,0.0,0.0,5756.0,
484,14257.0,0.0,0.0,5743.0,
485,14263.0,0.0,0.0,5737.0,
486,14266.0,0.0,0.0,5734.0,
487,14329.0,0.0,0.0,5671.0,
488,14409.0,0.0,0.0,5591.0,
489,14527.0,0.0,0.0,5473.0,
490,14593.0,0.0,0.0,5407.0,
491,14802.0,0.0,0.0,5198.0,
492,14807.0,0.0,0.0,5193.0,
493,14866.0,0.0,0.0,5134.0,
494,15042.0,0.0,0.0,4958.0,
495,15043.0,0.0,0.0,4957.0,
496,15068.0,0.0,0.0,4932.0,
497,15070.0,0.0,0.0,4930.0,
498,15070.0,0.0,0.0,4930.0,
499,15070.0,0.0,0.0,4930.0,
500,15070.0,0.0,0.0,4930.0,
501,15070.0,0.0,0.0,4930.0,
502,15070.0,0.0,0.0,4930.0,
503,15070.0,0.0,0.0,4930.0,
504,15070.0,0.0,0.0,4930.0,
505,15070.0,0.0,0.0,4930.0,
506,15070.0,0.0,0.0,4930.0,
507,15070.0,0.0,0.0,4930.0,
508,15070.0,0.0,0.0,4930.0,
509,15070.0,0.0,0.0,4930.0,
510,15070.0,0.0,0.0,4930.0,
511,15070.0,0.0,0.0,4930.0,
512,15070.0,0.0,0.0,4930.0,
513,15070.0,0.0,0.0,4930.0,
514,15070.0,0.0,0.0,4930.0,
515,15070.0,0.0,0.0,4930.0,
516,15070.0,0.0,0.0,4930.0,
517,15070.0,0.0,0.0,4930.0,
518,15070.0,0.0,0.0,4930.0,
519,15070.0,0.0,0.0,4930.0,
520,15070.0,0.0,0.0,4930.0,
521,15070.0,0.0,0.0,4930.0,
522,15070.0,0.0,0.0,4930.0,
523,15070.0,0.0,0.0,4930.0,
524,15070.0,0.0,0.0,4930.0,
525,15070.0,0.0,0.0,4930.0,
526,15070.0,0.0,0.0,4930.0,
527,15070.0,0.0,0.0,4930.0,
528,15070.0,0.0,0.0,4930.0,
529,15070.0,0.0,0.0,4930.0,
530,15070.0,0.0,0.0,4930.0,
531,15070.0,0.0,0.0,4930.0,
532,15070.0,0.0,0.0,4930.0,
533,15070.0,0.0,0.0,4930.0,
534,15070.0,0.0,0.0,4930.0,
535,15070.0,0.0,0.0,4930.0,
536,15070.0,0.0,0.0,4930.0,
537,15070.0,0.0,0.0,4930.0,
538,15070.0,0.0,0.0,4930.0,
539,15070.0,0.0,0.0,4930.0,
540,15070.0,0.0,0.0,4930.0,
541,15070.0,0.0,0.0,4930.0,
542,15070.0,0.0,0.0,4930.0,
543,15070.0,0.0,0.0,4930.0,
544,15070.0,0.0,0.0,4930.0,
545,15070.0,0.0,0.0,4930.0,
546,15070.0,0.0,0.0,4930.0,
547,15070.0,0.0,0.0,4930.0,
548,15070.0,0.0,0.0,4930.0,
549,15070.0,0.0,0.0,4930.0,
550,15070.0,0.0,0.0,4930.0,
551,15070.0,0.0,0.0,4930.0,
552,15070.0,0.0,0.0,4930.0,
553,15070.0,0.0,0.0,4930.0,
554,15070.0,0.0,0.0,4930.0,
555,15070.0,0.0,0.0,4930.0,
556,15070.0,0.0,0.0,4930.0,
557,15070.0,0.0,0.0,4930.0,
558,15070.0,0.0,0.0,4930.0,
559,15070.0,0.0,0.0,4930.0,
560,15070.0,0.0,0.0,4930.0,
561,15070.0,0.0,0.0,4930.0,
562,15070.0,0.0,0.0,4930.0,
563,15070.0,0.0,0.0,4930.0,
564,15070.0,0.0,0.0,4930.0,
565,15070.0,0.0,0.0,4930.0,
566,15070.0,0.0,0.0,4930.0,
567,15070.0,0.0,0.0,4930.0,
568,15070.0,0.0,0.0,4930.0,
569,15070.0,0.0,0.0,4930.0,
570,15070.0,0.0,0.0,4930.0,
571,15070.0,0.0,0.0,4930.0,
572,15070.0,0.0,0.0,4930.0,
573,15070.0,0.0,0.0,4930.0,
574,15070.0,0.0,0.0,4930.0,
575,15070.0,0.0,0.0,4930.0,
576,15070.0,0.0,0.0,4930.0,
577,15070.0,0.0,0.0,4930.0,
578,15070.0,0.0,0.0,4930.0,
579,15070.0,0.0,0.0,4930.0,
580,15070.0,0.0,0.0,4930.0,
581,15070.0,0.0,0.0,4930.0,
582,15070.0,0.0,0.0,4930.0,
583,15070.0,0.0,0.0,4930.0,
584,15070.0,0.0,0.0,4930.0,
585,15070.0,0.0,0.0,4930.0,
586,15070.0,0.0,0.0,4930.0,
587,15070.0,0.0,0.0,4930.0,
588,15070.0,0.0,0.0,4930.0,
589,15070.0,0.0,0.0,4930.0,
590,15070.0,0.0,0.0,4930.0,
591,15070.0,0.0,0.0,4930.0,
592,15070.0,0.0,0.0,4930.0,
593,15070.0,0.0,0.0,4930.0,
594,15074.0,0.0,0.0,4926.0,
595,15074.0,0.0,0.0,4926.0,
596,15078.0,0.0,0.0,4922.0,
597,15078.0,0.0,0.0,4922.0,
598,15107.0,0.0,0.0,4893.0,
599,15107.0,0.0,0.0,4893.0,
600,15107.0,0.0,0.0,4893.0,
601,15107.0,0.0,0.0,4893.0,
602,15107.0,0.0,0.0,4893.0,
603,15234.0,0.0,0.0,4766.0,
604,15346.0,0.0,0.0,4654.0,
605,15347.0,0.0,0.0,4653.0,
606,15347.0,0.0,0.0,4653.0,
607,15348.0,0.0,0.0,4652.0,
608,15348.0,0.0,0.0,4652.0,
609,15348.0,0.0,0.0,4652.0,
610,15348.0,0.0,0.0,4652.0,
611,15348.0,0.0,0.0,4652.0,
612,15348.0,0.0,0.0,4652.0,
613,15348.0,0.0,0.0,4652.0,
614,15348.0,0.0,0.0,4652.0,
615,15348.0,0.0,0.0,4652.0,
616,15348.0,0.0,0.0,4652.0,
617,15348.0,0.0,0.0,4652.0,
618,15348.0,0.0,0.0,4652.0,
619,15348.0,0.0,0.0,4652.0,
620,15356.0,0.0,0.0,4644.0,
621,15356.0,0.0,0.0,4644.0,
622,15373.0,0.0,0.0,4627.0,
623,15373.0,0.0,0.0,4627.0,
624,15374.0,0.0,0.0,4626.0,
625,15375.0,0.0,0.0,4625.0,
626,15551.0,0.0,0.0,4449.0,
627,15552.0,0.0,0.0,4448.0,
628,15565.0,0.0,0.0,4435.0,
629,15628.0,0.0,0.0,4372.0,
630,15631.0,0.0,0.0,4369.0,
631,15632.0,0.0,0.0,4368.0,
632,15663.0,0.0,0.0,4337.0,
633,15822.0,0.0,0.0,4178.0,
634,15869.0,0.0,0.0,4131.0,
635,15902.0,0.0,0.0,4098.0,
636,15902.0,0.0,0.0,4098.0,
637,15902.0,0.0,0.0,4098.0,
638,15902.0,0.0,0.0,4098.0,
639,15902.0,0.0,0.0,4098.0,
640,15902.0,0.0,0.0,4098.0,
641,15902.0,0.0,0.0,4098.0,
642,15902.0,0.0,0.0,4098.0,
643,15902.0,0.0,0.0,4098.0,
644,15902.0,0.0,0.0,4098.0,
645,15910.0,0.0,0.0,4090.0,
646,15910.0,0.0,0.0,4090.0,
647,15938.0,0.0,0.0,4062.0,
648,15985.0,0.0,0.0,4015.0,
649,16029.0,0.0,0.0,3971.0,
650,16058.0,0.0,0.0,3942.0,
651,16075.0,0.0,0.0,3925.0,
652,16077.0,0.0,0.0,3923.0,
653,16077.0,0.0,0.0,3923.0,
654,16089.0,0.0,0.0,3911.0,
655,16089.0,0.0,0.0,3911.0,
656,16093.0,0.0,0.0,3907.0,
657,16150.0,0.0,0.0,3850.0,
658,16207.0,0.0,0.0,3793.0,
659,16258.0,0.0,0.0,3742.0,
660,16264.0,0.0,0.0,3736.0,
661,16277.0,0.0,0.0,3723.0,
662,16285.0,0.0,0.0,3715.0,
663,16285.0,0.0,0.0,3715.0,
664,16286.0,0.0,0.0,3714.0,
665,16286.0,0.0,0.0,3714.0,
666,16334.0,0.0,0.0,3666.0,
667,16398.0,0.0,0.0,3602.0,
668,16462.0,0.0,0.0,3538.0,
669,16488.0,0.0,0.0,3512.0,
670,16550.0,0.0,0.0,3450.0,
671,16560.0,0.0,0.0,3440.0,
672,16562.0,0.0,0.0,3438.0,
673,16562.0,0.0,0.0,3438.0,
674,16562.0,0.0,0.0,3438.0,
675,16562.0,0.0,0.0,3438.0,
676,16562.0,0.0,0.0,3438.0,
677,16562.0,0.0,0.0,3438.0,
678,16562.0,0.0,0.0,3438.0,
679,16562.0,0.0,0.0,3438.0,
680,16562.0,0.0,0.0,3438.0,
681,16562.0,0.0,0.0,3438.0,
682,16562.0,0.0,0.0,3438.0,
683,16562.0,0.0,0.0,3438.0,
684,16562.0,0.0,0.0,3438.0,
685,16562.0,0.0,0.0,3438.0,
686,16562.0,0.0,0.0,3438.0,
687,16562.0,0.0,0.0,3438.0,
688,16562.0,0.0,0.0,3438.0,
689,16562.0,0.0,0.0,3438.0,
690,16562.0,0.0,0.0,3438.0,
691,16562.0,0.0,0.0,3438.0,
692,16562.0,0.0,0.0,3438.0,
693,16562.0,0.0,0.0,3438.0,
694,16562.0,0.0,0.0,3438.0,
695,16562.0,0.0,0.0,3438.0,
696,16562.0,0.0,0.0,3438.0,
697,16562.0,0.0,0.0,3438.0,
698,16562.0,0.0,0.0,3438.0,
699,16562.0,0.0,0.0,3438.0,
700,16562.0,0.0,0.0,3438.0,
701,16562.0,0.0,0.0,3438.0,
702,16562.0,0.0,0.0,3438.0,
703,16562.0,0.0,0.0,3438.0,
704,16562.0,0.0,0.0,3438.0,
705,16562.0,0.0,0.0,3438.0,
706,16562.0,0.0,0.0,3438.0,
707,16562.0,0.0,0.0,3438.0,
708,16562.0,0.0,0.0,3438.0,
709,16562.0,0.0,0.0,3438.0,
710,16562.0,0.0,0.0,3438.0,
711,16562.0,0.0,0.0,3438.0,
712,16562.0,0.0,0.0,3438.0,
713,16562.0,0.0,0.0,3438.0,
714,16562.0,0.0,0.0,3438.0,
715,16562.0,0.0,0.0,3438.0,
716,16562.0,0.0,0.0,3438.0,
717,16562.0,0.0,0.0,3438.0,
718,16562.0,0.0,0.0,3438.0,
719,16562.0,0.0,0.0,3438.0,
720,16562.0,0.0,0.0,3438.0,
721,16562.0,0.0,0.0,3438.0,
722,16562.0,0.0,0.0,3438.0,
723,16562.0,0.0,0.0,3438.0,
724,16562.0,0.0,0.0,3438.0,
725,16562.0,0.0,0.0,3438.0,
726,16562.0,0.0,0.0,3438.0,
727,16562.0,0.0,0.0,3438.0,
728,16564.0,0.0,0.0,3436.0,
729,16566.0,0.0,0.0,3434.0,
730,16574.0,0.0,0.0,3426.0,
