jour,S,I,E,R,
0,19980.0,20.0,0.0,0.0,
1,19964.0,20.0,16.0,0.0,
2,19874.0,23.0,103.0,0.0,
3,19790.0,49.0,161.0,0.0,
4,19508.0,98.0,390.0,4.0,
5,19151.0,173.0,661.0,15.0,
6,18063.0,407.0,1482.0,48.0,
7,16196.0,770.0,2939.0,95.0,
8,13408.0,1485.0,4925.0,182.0,
9,9765.0,2742.0,7083.0,410.0,
10,6362.0,3934.0,8901.0,803.0,
11,3201.0,5985.0,9546.0,1268.0,
12,956.0,7867.0,8757.0,2420.0,
13,181.0,9409.0,6802.0,3608.0,
14,15.0,9945.0,4920.0,5120.0,
15,39.0,10083.0,3376.0,6502.0,
16,6.0,9548.0,2672.0,7774.0,
17,4.0,9094.0,1833.0,9069.0,
18,53.0,8382.0,1257.0,10308.0,
19,134.0,8051.0,793.0,11022.0,
20,59.0,7567.0,621.0,11753.0,
21,20.0,7032.0,461.0,12487.0,
22,18.0,6399.0,228.0,13355.0,
23,159.0,5684.0,150.0,14007.0,
24,148.0,4933.0,148.0,14771.0,
25,194.0,4626.0,148.0,15032.0,
26,197.0,3923.0,105.0,15775.0,
27,226.0,3300.0,175.0,16299.0,
28,263.0,2078.0,248.0,17411.0,
29,346.0,1571.0,263.0,17820.0,
30,349.0,1329.0,234.0,18088.0,
31,300.0,1267.0,268.0,18165.0,
32,257.0,1309.0,156.0,18278.0,
33,368.0,1301.0,107.0,18224.0,
34,317.0,1093.0,123.0,18467.0,
35,232.0,883.0,215.0,18670.0,
36,245.0,757.0,130.0,18868.0,
37,240.0,639.0,121.0,19000.0,
38,237.0,602.0,76.0,19085.0,
39,348.0,464.0,71.0,19117.0,
40,432.0,395.0,44.0,19129.0,
41,607.0,372.0,42.0,18979.0,
42,775.0,326.0,36.0,18863.0,
43,971.0,322.0,91.0,18616.0,
44,1118.0,304.0,116.0,18462.0,
45,1130.0,328.0,134.0,18408.0,
46,1192.0,326.0,175.0,18307.0,
47,1229.0,329.0,166.0,18276.0,
48,1194.0,368.0,160.0,18278.0,
49,1140.0,306.0,184.0,18370.0,
50,1139.0,278.0,178.0,18405.0,
51,1108.0,261.0,126.0,18505.0,
52,1137.0,284.0,75.0,18504.0,
53,1141.0,271.0,80.0,18508.0,
54,1179.0,243.0,47.0,18531.0,
55,1164.0,198.0,88.0,18550.0,
56,1210.0,142.0,95.0,18553.0,
57,1249.0,121.0,95.0,18535.0,
58,1450.0,146.0,103.0,18301.0,
59,1532.0,145.0,100.0,18223.0,
60,1742.0,153.0,100.0,18005.0,
61,1844.0,146.0,89.0,17921.0,
62,1852.0,145.0,83.0,17920.0,
63,1867.0,136.0,71.0,17926.0,
64,1914.0,124.0,90.0,17872.0,
65,2010.0,123.0,107.0,17760.0,
66,2054.0,110.0,140.0,17696.0,
67,2108.0,117.0,148.0,17627.0,
68,2098.0,113.0,158.0,17631.0,
69,2092.0,153.0,126.0,17629.0,
70,2115.0,174.0,158.0,17553.0,
71,2121.0,198.0,181.0,17500.0,
72,2266.0,165.0,231.0,17338.0,
73,2363.0,194.0,246.0,17197.0,
74,2584.0,218.0,265.0,16933.0,
75,2533.0,299.0,240.0,16928.0,
76,2522.0,351.0,243.0,16884.0,
77,2442.0,410.0,238.0,16910.0,
78,2358.0,411.0,283.0,16948.0,
79,2253.0,390.0,438.0,16919.0,
80,2172.0,437.0,417.0,16974.0,
81,2062.0,473.0,446.0,17019.0,
82,1988.0,549.0,491.0,16972.0,
83,1921.0,633.0,541.0,16905.0,
84,1847.0,592.0,553.0,17008.0,
85,1796.0,678.0,516.0,17010.0,
86,1738.0,775.0,420.0,17067.0,
87,1560.0,866.0,403.0,17171.0,
88,1413.0,785.0,465.0,17337.0,
89,1361.0,679.0,470.0,17490.0,
90,1264.0,746.0,352.0,17638.0,
91,1235.0,739.0,380.0,17646.0,
92,1275.0,697.0,339.0,17689.0,
93,1224.0,700.0,311.0,17765.0,
94,1344.0,748.0,301.0,17607.0,
95,1383.0,720.0,307.0,17590.0,
96,1514.0,629.0,306.0,17551.0,
97,1665.0,592.0,399.0,17344.0,
98,1757.0,562.0,425.0,17256.0,
99,1783.0,567.0,422.0,17228.0,
100,1832.0,617.0,475.0,17076.0,
101,1850.0,616.0,562.0,16972.0,
102,1768.0,635.0,618.0,16979.0,
103,1647.0,685.0,647.0,17021.0,
104,1588.0,725.0,577.0,17110.0,
105,1437.0,810.0,596.0,17157.0,
106,1272.0,870.0,582.0,17276.0,
107,1171.0,885.0,594.0,17350.0,
108,1104.0,881.0,616.0,17399.0,
109,1066.0,968.0,579.0,17387.0,
110,1057.0,1073.0,460.0,17410.0,
111,1003.0,1063.0,472.0,17462.0,
112,983.0,1119.0,469.0,17429.0,
113,1041.0,1024.0,558.0,17377.0,
114,1004.0,1006.0,557.0,17433.0,
115,893.0,1081.0,603.0,17423.0,
116,835.0,1036.0,574.0,17555.0,
117,823.0,1108.0,527.0,17542.0,
118,821.0,1006.0,603.0,17570.0,
119,851.0,1010.0,546.0,17593.0,
120,974.0,1028.0,503.0,17495.0,
121,1001.0,1026.0,503.0,17470.0,
122,1088.0,1015.0,492.0,17405.0,
123,1026.0,1088.0,418.0,17468.0,
124,893.0,1080.0,517.0,17510.0,
125,916.0,1124.0,465.0,17495.0,
126,956.0,1203.0,395.0,17446.0,
127,989.0,1189.0,396.0,17426.0,
128,1025.0,1161.0,385.0,17429.0,
129,1027.0,1142.0,494.0,17337.0,
130,1063.0,1196.0,543.0,17198.0,
131,1049.0,1183.0,616.0,17152.0,
132,1084.0,1197.0,549.0,17170.0,
133,1115.0,1209.0,612.0,17064.0,
134,1162.0,1271.0,730.0,16837.0,
135,1161.0,1321.0,655.0,16863.0,
136,1044.0,1261.0,724.0,16971.0,
137,1048.0,1254.0,685.0,17013.0,
138,1014.0,1305.0,683.0,16998.0,
139,1100.0,1417.0,563.0,16920.0,
140,988.0,1365.0,537.0,17110.0,
141,1053.0,1309.0,594.0,17044.0,
142,1037.0,1313.0,532.0,17118.0,
143,1072.0,1328.0,512.0,17088.0,
144,1180.0,1310.0,499.0,17011.0,
145,1056.0,1414.0,493.0,17037.0,
146,1003.0,1280.0,485.0,17232.0,
147,973.0,1131.0,582.0,17314.0,
148,931.0,1191.0,505.0,17373.0,
149,893.0,1166.0,466.0,17475.0,
150,863.0,1129.0,444.0,17564.0,
151,887.0,1118.0,333.0,17662.0,
152,897.0,1053.0,310.0,17740.0,
153,837.0,1049.0,280.0,17834.0,
154,820.0,982.0,264.0,17934.0,
155,814.0,891.0,272.0,18023.0,
156,855.0,765.0,266.0,18114.0,
157,885.0,697.0,261.0,18157.0,
158,896.0,674.0,219.0,18211.0,
159,911.0,618.0,247.0,18224.0,
160,908.0,616.0,292.0,18184.0,
161,969.0,503.0,334.0,18194.0,
162,1002.0,526.0,260.0,18212.0,
163,1069.0,515.0,256.0,18160.0,
164,1102.0,541.0,252.0,18105.0,
165,1106.0,438.0,289.0,18167.0,
166,1147.0,480.0,200.0,18173.0,
167,1151.0,476.0,140.0,18233.0,
168,1282.0,400.0,167.0,18151.0,
169,1292.0,408.0,160.0,18140.0,
170,1308.0,353.0,162.0,18177.0,
171,1314.0,292.0,163.0,18231.0,
172,1503.0,309.0,148.0,18040.0,
173,1519.0,312.0,170.0,17999.0,
174,1534.0,307.0,182.0,17977.0,
175,1521.0,294.0,207.0,17978.0,
176,1563.0,267.0,225.0,17945.0,
177,1567.0,286.0,198.0,17949.0,
178,1557.0,290.0,191.0,17962.0,
179,1563.0,320.0,147.0,17970.0,
180,1582.0,303.0,158.0,17957.0,
181,1588.0,274.0,197.0,17941.0,
182,1606.0,222.0,198.0,17974.0,
183,1696.0,229.0,191.0,17884.0,
184,1797.0,283.0,154.0,17766.0,
185,1865.0,263.0,217.0,17655.0,
186,1996.0,268.0,193.0,17543.0,
187,2051.0,256.0,232.0,17461.0,
188,2229.0,297.0,257.0,17217.0,
189,2255.0,286.0,240.0,17219.0,
190,2435.0,304.0,194.0,17067.0,
191,2536.0,305.0,259.0,16900.0,
192,2538.0,320.0,337.0,16805.0,
193,2596.0,377.0,319.0,16708.0,
194,2631.0,388.0,379.0,16602.0,
195,2703.0,401.0,427.0,16469.0,
196,2653.0,452.0,493.0,16402.0,
197,2646.0,576.0,538.0,16240.0,
198,2540.0,627.0,593.0,16240.0,
199,2500.0,752.0,598.0,16150.0,
200,2322.0,833.0,721.0,16124.0,
201,2209.0,921.0,784.0,16086.0,
202,2067.0,996.0,875.0,16062.0,
203,1898.0,1005.0,882.0,16215.0,
204,1662.0,1140.0,915.0,16283.0,
205,1509.0,1348.0,917.0,16226.0,
206,1340.0,1375.0,894.0,16391.0,
207,1197.0,1338.0,918.0,16547.0,
208,995.0,1198.0,1018.0,16789.0,
209,926.0,1402.0,775.0,16897.0,
210,850.0,1357.0,716.0,17077.0,
211,825.0,1382.0,599.0,17194.0,
212,810.0,1433.0,515.0,17242.0,
213,746.0,1317.0,570.0,17367.0,
214,737.0,1364.0,475.0,17424.0,
215,776.0,1346.0,423.0,17455.0,
216,747.0,1328.0,398.0,17527.0,
217,800.0,1205.0,412.0,17583.0,
218,838.0,1131.0,440.0,17591.0,
219,839.0,1080.0,443.0,17638.0,
220,819.0,1014.0,396.0,17771.0,
221,830.0,991.0,404.0,17775.0,
222,846.0,891.0,398.0,17865.0,
223,890.0,803.0,387.0,17920.0,
224,896.0,697.0,437.0,17970.0,
225,921.0,732.0,386.0,17961.0,
226,943.0,765.0,307.0,17985.0,
227,933.0,760.0,404.0,17903.0,
228,965.0,699.0,394.0,17942.0,
229,984.0,693.0,309.0,18014.0,
230,1118.0,676.0,305.0,17901.0,
231,1196.0,690.0,341.0,17773.0,
232,1212.0,683.0,330.0,17775.0,
233,1293.0,655.0,302.0,17750.0,
234,1508.0,693.0,288.0,17511.0,
235,1527.0,745.0,358.0,17370.0,
236,1564.0,720.0,442.0,17274.0,
237,1524.0,716.0,466.0,17294.0,
238,1494.0,741.0,418.0,17347.0,
239,1524.0,738.0,508.0,17230.0,
240,1481.0,816.0,514.0,17189.0,
241,1433.0,861.0,458.0,17248.0,
242,1366.0,919.0,489.0,17226.0,
243,1288.0,974.0,555.0,17183.0,
244,1202.0,1021.0,639.0,17138.0,
245,1100.0,1043.0,676.0,17181.0,
246,1062.0,1213.0,569.0,17156.0,
247,1045.0,1293.0,580.0,17082.0,
248,965.0,1311.0,655.0,17069.0,
249,883.0,1263.0,671.0,17183.0,
250,887.0,1308.0,597.0,17208.0,
251,901.0,1272.0,523.0,17304.0,
252,865.0,1283.0,532.0,17320.0,
253,874.0,1209.0,533.0,17384.0,
254,881.0,1049.0,544.0,17526.0,
255,932.0,1029.0,523.0,17516.0,
256,1023.0,1080.0,447.0,17450.0,
257,1096.0,1048.0,405.0,17451.0,
258,1163.0,961.0,434.0,17442.0,
259,1292.0,948.0,446.0,17314.0,
260,1237.0,921.0,592.0,17250.0,
261,1216.0,921.0,516.0,17347.0,
262,1232.0,925.0,496.0,17347.0,
263,1248.0,842.0,545.0,17365.0,
264,1161.0,857.0,550.0,17432.0,
265,1163.0,900.0,552.0,17385.0,
266,1115.0,1017.0,493.0,17375.0,
267,1028.0,950.0,573.0,17449.0,
268,1010.0,977.0,434.0,17579.0,
269,939.0,911.0,475.0,17675.0,
270,951.0,809.0,454.0,17786.0,
271,928.0,873.0,377.0,17822.0,
272,909.0,893.0,312.0,17886.0,
273,938.0,792.0,312.0,17958.0,
274,1003.0,661.0,305.0,18031.0,
275,1045.0,649.0,314.0,17992.0,
276,1154.0,637.0,283.0,17926.0,
277,1203.0,593.0,306.0,17898.0,
278,1328.0,586.0,331.0,17755.0,
279,1373.0,553.0,308.0,17766.0,
280,1437.0,579.0,307.0,17677.0,
281,1478.0,635.0,387.0,17500.0,
282,1492.0,678.0,360.0,17470.0,
283,1541.0,732.0,356.0,17371.0,
284,1566.0,723.0,401.0,17310.0,
285,1561.0,797.0,325.0,17317.0,
286,1525.0,804.0,365.0,17306.0,
287,1535.0,830.0,390.0,17245.0,
288,1504.0,793.0,460.0,17243.0,
289,1487.0,780.0,485.0,17248.0,
290,1482.0,825.0,526.0,17167.0,
291,1488.0,840.0,477.0,17195.0,
292,1413.0,807.0,485.0,17295.0,
293,1408.0,830.0,523.0,17239.0,
294,1398.0,817.0,542.0,17243.0,
295,1426.0,789.0,517.0,17268.0,
296,1497.0,835.0,478.0,17190.0,
297,1648.0,769.0,445.0,17138.0,
298,1658.0,735.0,471.0,17136.0,
299,1677.0,691.0,530.0,17102.0,
300,1619.0,718.0,587.0,17076.0,
301,1639.0,724.0,486.0,17151.0,
302,1618.0,757.0,456.0,17169.0,
303,1630.0,782.0,442.0,17146.0,
304,1666.0,814.0,454.0,17066.0,
305,1623.0,818.0,503.0,17056.0,
306,1673.0,870.0,442.0,17015.0,
307,1814.0,936.0,472.0,16778.0,
308,1747.0,890.0,791.0,16572.0,
309,1605.0,1046.0,757.0,16592.0,
310,1500.0,1087.0,828.0,16585.0,
311,1374.0,1196.0,841.0,16589.0,
312,1359.0,1154.0,728.0,16759.0,
313,1286.0,1310.0,699.0,16705.0,
314,1220.0,1434.0,577.0,16769.0,
315,1131.0,1309.0,691.0,16869.0,
316,1069.0,1437.0,617.0,16877.0,
317,1009.0,1457.0,696.0,16838.0,
318,990.0,1514.0,654.0,16842.0,
319,965.0,1527.0,599.0,16909.0,
320,858.0,1449.0,720.0,16973.0,
321,809.0,1545.0,590.0,17056.0,
322,806.0,1506.0,588.0,17100.0,
323,813.0,1360.0,533.0,17294.0,
324,815.0,1310.0,478.0,17397.0,
325,757.0,1157.0,501.0,17585.0,
326,793.0,1091.0,509.0,17607.0,
327,779.0,1091.0,457.0,17673.0,
328,771.0,1006.0,345.0,17878.0,
329,789.0,941.0,428.0,17842.0,
330,786.0,882.0,351.0,17981.0,
331,830.0,770.0,312.0,18088.0,
332,894.0,730.0,357.0,18019.0,
333,922.0,698.0,369.0,18011.0,
334,940.0,695.0,271.0,18094.0,
335,955.0,664.0,281.0,18100.0,
336,950.0,648.0,290.0,18112.0,
337,969.0,590.0,244.0,18197.0,
338,1010.0,567.0,225.0,18198.0,
339,1036.0,533.0,229.0,18202.0,
340,1076.0,525.0,210.0,18189.0,
341,1107.0,445.0,231.0,18217.0,
342,1129.0,437.0,202.0,18232.0,
343,1158.0,455.0,193.0,18194.0,
344,1223.0,430.0,219.0,18128.0,
345,1237.0,431.0,251.0,18081.0,
346,1293.0,446.0,267.0,17994.0,
347,1391.0,470.0,235.0,17904.0,
348,1402.0,446.0,257.0,17895.0,
349,1475.0,455.0,270.0,17800.0,
350,1568.0,462.0,272.0,17698.0,
351,1632.0,442.0,300.0,17626.0,
352,1910.0,522.0,320.0,17248.0,
353,1943.0,585.0,375.0,17097.0,
354,1889.0,618.0,509.0,16984.0,
355,1865.0,753.0,474.0,16908.0,
356,1796.0,787.0,533.0,16884.0,
357,1714.0,907.0,455.0,16924.0,
358,1656.0,955.0,532.0,16857.0,
359,1557.0,971.0,620.0,16852.0,
360,1492.0,1012.0,558.0,16938.0,
361,1366.0,1015.0,651.0,16968.0,
362,1281.0,1104.0,620.0,16995.0,
363,1193.0,1190.0,561.0,17056.0,
364,1125.0,1280.0,507.0,17088.0,
365,1119.0,1244.0,497.0,17140.0,
366,1047.0,1271.0,556.0,17126.0,
367,1051.0,1288.0,587.0,17074.0,
368,1007.0,1277.0,516.0,17200.0,
369,993.0,1254.0,482.0,17271.0,
370,993.0,1264.0,455.0,17288.0,
371,963.0,1155.0,526.0,17356.0,
372,952.0,1110.0,526.0,17412.0,
373,996.0,1095.0,393.0,17516.0,
374,1067.0,1065.0,404.0,17464.0,
375,1161.0,1039.0,470.0,17330.0,
376,1229.0,985.0,535.0,17251.0,
377,1279.0,963.0,604.0,17154.0,
378,1384.0,964.0,640.0,17012.0,
379,1404.0,1016.0,580.0,17000.0,
380,1457.0,965.0,694.0,16884.0,
381,1475.0,1011.0,673.0,16841.0,
382,1514.0,991.0,693.0,16802.0,
383,1515.0,1081.0,636.0,16768.0,
384,1517.0,1110.0,652.0,16721.0,
385,1491.0,1029.0,748.0,16732.0,
386,1548.0,1041.0,737.0,16674.0,
387,1617.0,989.0,702.0,16692.0,
388,1764.0,994.0,724.0,16518.0,
389,1828.0,982.0,753.0,16437.0,
390,1805.0,949.0,734.0,16512.0,
391,1958.0,990.0,748.0,16304.0,
392,1960.0,1115.0,621.0,16304.0,
393,1955.0,1062.0,669.0,16314.0,
394,1766.0,1108.0,803.0,16323.0,
395,1627.0,1226.0,834.0,16313.0,
396,1490.0,1306.0,899.0,16305.0,
397,1327.0,1370.0,906.0,16397.0,
398,1200.0,1447.0,896.0,16457.0,
399,1062.0,1506.0,971.0,16461.0,
400,995.0,1539.0,896.0,16570.0,
401,968.0,1577.0,838.0,16617.0,
402,923.0,1677.0,726.0,16674.0,
403,870.0,1598.0,690.0,16842.0,
404,835.0,1652.0,639.0,16874.0,
405,825.0,1672.0,678.0,16825.0,
406,801.0,1572.0,696.0,16931.0,
407,808.0,1566.0,635.0,16991.0,
408,755.0,1584.0,669.0,16992.0,
409,802.0,1562.0,611.0,17025.0,
410,817.0,1609.0,583.0,16991.0,
411,872.0,1529.0,594.0,17005.0,
412,835.0,1478.0,686.0,17001.0,
413,824.0,1488.0,601.0,17087.0,
414,802.0,1298.0,560.0,17340.0,
415,929.0,1233.0,580.0,17258.0,
416,870.0,1210.0,610.0,17310.0,
417,952.0,1261.0,491.0,17296.0,
418,966.0,1143.0,483.0,17408.0,
419,990.0,1160.0,506.0,17344.0,
420,997.0,1142.0,540.0,17321.0,
421,944.0,1098.0,529.0,17429.0,
422,943.0,1096.0,511.0,17450.0,
423,910.0,1060.0,559.0,17471.0,
424,893.0,1040.0,563.0,17504.0,
425,914.0,978.0,590.0,17518.0,
426,907.0,1013.0,596.0,17484.0,
427,941.0,881.0,596.0,17582.0,
428,959.0,853.0,588.0,17600.0,
429,1009.0,767.0,597.0,17627.0,
430,1036.0,744.0,556.0,17664.0,
431,1054.0,735.0,545.0,17666.0,
432,1062.0,804.0,430.0,17704.0,
433,1061.0,806.0,461.0,17672.0,
434,1083.0,761.0,475.0,17681.0,
435,1102.0,780.0,424.0,17694.0,
436,1124.0,787.0,414.0,17675.0,
437,1129.0,775.0,419.0,17677.0,
438,1095.0,814.0,389.0,17702.0,
439,1078.0,867.0,378.0,17677.0,
440,1058.0,862.0,409.0,17671.0,
441,1017.0,858.0,444.0,17681.0,
442,1014.0,895.0,464.0,17627.0,
443,1046.0,939.0,487.0,17528.0,
444,1022.0,1010.0,456.0,17512.0,
445,1046.0,1007.0,436.0,17511.0,
446,1115.0,1007.0,372.0,17506.0,
447,1263.0,1024.0,403.0,17310.0,
448,1278.0,1010.0,461.0,17251.0,
449,1260.0,1012.0,629.0,17099.0,
450,1169.0,1078.0,633.0,17120.0,
451,1070.0,1127.0,593.0,17210.0,
452,1040.0,1227.0,501.0,17232.0,
453,1005.0,1293.0,488.0,17214.0,
454,947.0,1320.0,503.0,17230.0,
455,901.0,1337.0,477.0,17285.0,
456,846.0,1374.0,529.0,17251.0,
457,895.0,1386.0,536.0,17183.0,
458,855.0,1370.0,529.0,17246.0,
459,839.0,1402.0,492.0,17267.0,
460,795.0,1410.0,528.0,17267.0,
461,793.0,1389.0,532.0,17286.0,
462,787.0,1387.0,562.0,17264.0,
463,818.0,1354.0,589.0,17239.0,
464,872.0,1361.0,606.0,17161.0,
465,854.0,1343.0,651.0,17152.0,
466,888.0,1339.0,663.0,17110.0,
467,903.0,1287.0,632.0,17178.0,
468,911.0,1311.0,545.0,17233.0,
469,926.0,1340.0,566.0,17168.0,
470,952.0,1263.0,602.0,17183.0,
471,973.0,1307.0,549.0,17171.0,
472,973.0,1374.0,560.0,17093.0,
473,955.0,1394.0,540.0,17111.0,
474,964.0,1330.0,640.0,17066.0,
475,965.0,1227.0,586.0,17222.0,
476,961.0,1198.0,547.0,17294.0,
477,969.0,1202.0,528.0,17301.0,
478,956.0,1194.0,515.0,17335.0,
479,967.0,1174.0,557.0,17302.0,
480,953.0,1162.0,591.0,17294.0,
481,1042.0,1171.0,545.0,17242.0,
482,1036.0,1190.0,563.0,17211.0,
483,1106.0,1215.0,547.0,17132.0,
484,1113.0,1176.0,626.0,17085.0,
485,1052.0,1208.0,693.0,17047.0,
486,1050.0,1250.0,609.0,17091.0,
487,1028.0,1278.0,622.0,17072.0,
488,982.0,1325.0,602.0,17091.0,
489,987.0,1253.0,556.0,17204.0,
490,967.0,1110.0,523.0,17400.0,
491,989.0,1155.0,416.0,17440.0,
492,1005.0,1117.0,449.0,17429.0,
493,997.0,1083.0,451.0,17469.0,
494,984.0,1076.0,441.0,17499.0,
495,981.0,1041.0,470.0,17508.0,
496,960.0,1053.0,456.0,17531.0,
497,965.0,1036.0,420.0,17579.0,
498,975.0,1066.0,376.0,17583.0,
499,972.0,1026.0,403.0,17599.0,
500,956.0,938.0,512.0,17594.0,
501,950.0,960.0,492.0,17598.0,
502,934.0,959.0,501.0,17606.0,
503,947.0,898.0,474.0,17681.0,
504,960.0,900.0,453.0,17687.0,
505,977.0,921.0,462.0,17640.0,
506,971.0,904.0,460.0,17665.0,
507,1009.0,885.0,416.0,17690.0,
508,1019.0,841.0,396.0,17744.0,
509,1091.0,852.0,369.0,17688.0,
510,1108.0,843.0,336.0,17713.0,
511,1147.0,738.0,392.0,17723.0,
512,1195.0,756.0,344.0,17705.0,
513,1227.0,697.0,401.0,17675.0,
514,1257.0,732.0,334.0,17677.0,
515,1299.0,712.0,437.0,17552.0,
516,1312.0,740.0,470.0,17478.0,
517,1321.0,723.0,471.0,17485.0,
518,1333.0,715.0,443.0,17509.0,
519,1363.0,715.0,423.0,17499.0,
520,1340.0,703.0,445.0,17512.0,
521,1361.0,686.0,422.0,17531.0,
522,1364.0,677.0,424.0,17535.0,
523,1381.0,629.0,431.0,17559.0,
524,1420.0,656.0,458.0,17466.0,
525,1375.0,673.0,525.0,17427.0,
526,1344.0,763.0,515.0,17378.0,
527,1310.0,808.0,432.0,17450.0,
528,1252.0,770.0,446.0,17532.0,
529,1247.0,765.0,439.0,17549.0,
530,1210.0,693.0,476.0,17621.0,
531,1232.0,690.0,397.0,17681.0,
532,1214.0,655.0,435.0,17696.0,
533,1237.0,702.0,382.0,17679.0,
534,1253.0,656.0,329.0,17762.0,
535,1245.0,633.0,317.0,17805.0,
536,1255.0,622.0,333.0,17790.0,
537,1269.0,603.0,316.0,17812.0,
538,1272.0,584.0,342.0,17802.0,
539,1332.0,588.0,328.0,17752.0,
540,1351.0,563.0,336.0,17750.0,
541,1460.0,532.0,400.0,17608.0,
542,1467.0,588.0,348.0,17597.0,
543,1446.0,643.0,335.0,17576.0,
544,1419.0,611.0,428.0,17542.0,
545,1510.0,668.0,419.0,17403.0,
546,1525.0,645.0,398.0,17432.0,
547,1437.0,604.0,495.0,17464.0,
548,1408.0,602.0,482.0,17508.0,
549,1358.0,650.0,509.0,17483.0,
550,1367.0,601.0,527.0,17505.0,
551,1404.0,646.0,540.0,17410.0,
552,1407.0,673.0,575.0,17345.0,
553,1368.0,722.0,538.0,17372.0,
554,1325.0,780.0,540.0,17355.0,
555,1367.0,852.0,520.0,17261.0,
556,1352.0,925.0,469.0,17254.0,
557,1403.0,909.0,477.0,17211.0,
558,1365.0,899.0,524.0,17212.0,
559,1522.0,891.0,579.0,17008.0,
560,1568.0,935.0,568.0,16929.0,
561,1520.0,990.0,542.0,16948.0,
562,1505.0,1056.0,513.0,16926.0,
563,1384.0,1071.0,579.0,16966.0,
564,1363.0,1091.0,580.0,16966.0,
565,1335.0,1101.0,524.0,17040.0,
566,1243.0,1118.0,601.0,17038.0,
567,1189.0,1108.0,614.0,17089.0,
568,1164.0,1115.0,627.0,17094.0,
569,1175.0,1098.0,646.0,17081.0,
570,1167.0,1136.0,637.0,17060.0,
571,1108.0,1140.0,656.0,17096.0,
572,1041.0,1203.0,605.0,17151.0,
573,1071.0,1204.0,537.0,17188.0,
574,1059.0,1157.0,527.0,17257.0,
575,1050.0,1100.0,521.0,17329.0,
576,1055.0,1036.0,523.0,17386.0,
577,1037.0,1093.0,515.0,17355.0,
578,1086.0,1125.0,486.0,17303.0,
579,1161.0,1056.0,560.0,17223.0,
580,1206.0,1069.0,565.0,17160.0,
581,1217.0,1155.0,559.0,17069.0,
582,1265.0,1226.0,518.0,16991.0,
583,1277.0,1223.0,520.0,16980.0,
584,1328.0,1223.0,558.0,16891.0,
585,1354.0,1233.0,522.0,16891.0,
586,1534.0,1203.0,536.0,16727.0,
587,1433.0,1238.0,669.0,16660.0,
588,1334.0,1310.0,819.0,16537.0,
589,1210.0,1379.0,797.0,16614.0,
590,1083.0,1498.0,737.0,16682.0,
591,1069.0,1465.0,772.0,16694.0,
592,1021.0,1466.0,833.0,16680.0,
593,969.0,1444.0,799.0,16788.0,
594,1090.0,1376.0,760.0,16774.0,
595,1088.0,1350.0,729.0,16833.0,
596,1078.0,1452.0,620.0,16850.0,
597,1066.0,1410.0,578.0,16946.0,
598,1059.0,1305.0,592.0,17044.0,
599,1026.0,1271.0,539.0,17164.0,
600,1090.0,1254.0,527.0,17129.0,
601,1074.0,1203.0,522.0,17201.0,
602,1059.0,1119.0,526.0,17296.0,
603,1063.0,1077.0,532.0,17328.0,
604,1093.0,1143.0,530.0,17234.0,
605,1122.0,1071.0,627.0,17180.0,
606,1199.0,970.0,579.0,17252.0,
607,1175.0,983.0,632.0,17210.0,
608,1188.0,1088.0,562.0,17162.0,
609,1241.0,1078.0,518.0,17163.0,
610,1235.0,1052.0,482.0,17231.0,
611,1211.0,975.0,520.0,17294.0,
612,1202.0,1053.0,405.0,17340.0,
613,1157.0,1077.0,387.0,17379.0,
614,1084.0,1070.0,463.0,17383.0,
615,1123.0,1075.0,508.0,17294.0,
616,1099.0,1043.0,547.0,17311.0,
617,1065.0,1029.0,553.0,17353.0,
618,1069.0,1008.0,614.0,17309.0,
619,1018.0,1027.0,564.0,17391.0,
620,1001.0,1052.0,476.0,17471.0,
621,1029.0,963.0,483.0,17525.0,
622,1055.0,931.0,515.0,17499.0,
623,1050.0,895.0,567.0,17488.0,
624,1061.0,893.0,561.0,17485.0,
625,1132.0,941.0,503.0,17424.0,
626,1135.0,943.0,561.0,17361.0,
627,1185.0,992.0,522.0,17301.0,
628,1169.0,944.0,553.0,17334.0,
629,1148.0,898.0,588.0,17366.0,
630,1133.0,917.0,530.0,17420.0,
631,1110.0,937.0,541.0,17412.0,
632,1070.0,937.0,595.0,17398.0,
633,1087.0,893.0,645.0,17375.0,
634,1063.0,929.0,637.0,17371.0,
635,1070.0,947.0,600.0,17383.0,
636,1065.0,946.0,526.0,17463.0,
637,1039.0,827.0,543.0,17591.0,
638,1058.0,860.0,467.0,17615.0,
639,1070.0,833.0,478.0,17619.0,
640,1057.0,812.0,485.0,17646.0,
641,1092.0,838.0,477.0,17593.0,
642,1111.0,839.0,457.0,17593.0,
643,1073.0,896.0,438.0,17593.0,
644,1084.0,939.0,416.0,17561.0,
645,1095.0,936.0,437.0,17532.0,
646,1143.0,916.0,467.0,17474.0,
647,1184.0,928.0,498.0,17390.0,
648,1237.0,902.0,526.0,17335.0,
649,1278.0,936.0,522.0,17264.0,
650,1306.0,950.0,551.0,17193.0,
651,1341.0,946.0,556.0,17157.0,
652,1337.0,909.0,628.0,17126.0,
653,1440.0,1001.0,593.0,16966.0,
654,1469.0,971.0,591.0,16969.0,
655,1440.0,1013.0,665.0,16882.0,
656,1445.0,1066.0,757.0,16732.0,
657,1491.0,1153.0,699.0,16657.0,
658,1454.0,1142.0,708.0,16696.0,
659,1539.0,1213.0,673.0,16575.0,
660,1479.0,1217.0,725.0,16579.0,
661,1405.0,1054.0,768.0,16773.0,
662,1399.0,1063.0,605.0,16933.0,
663,1368.0,1111.0,602.0,16919.0,
664,1291.0,1031.0,662.0,17016.0,
665,1250.0,1065.0,564.0,17121.0,
666,1199.0,1017.0,562.0,17222.0,
667,1216.0,1030.0,523.0,17231.0,
668,1212.0,1050.0,480.0,17258.0,
669,1212.0,1020.0,497.0,17271.0,
670,1230.0,999.0,504.0,17267.0,
671,1181.0,974.0,535.0,17310.0,
672,1172.0,1019.0,517.0,17292.0,
673,1100.0,1043.0,531.0,17326.0,
674,1129.0,1098.0,456.0,17317.0,
675,1120.0,1060.0,490.0,17330.0,
676,1109.0,1049.0,519.0,17323.0,
677,1102.0,1033.0,566.0,17299.0,
678,1123.0,1093.0,532.0,17252.0,
679,1098.0,1064.0,537.0,17301.0,
680,1104.0,1097.0,519.0,17280.0,
681,1105.0,1131.0,506.0,17258.0,
682,1123.0,1091.0,511.0,17275.0,
683,1111.0,1082.0,517.0,17290.0,
684,1114.0,1109.0,498.0,17279.0,
685,1110.0,1137.0,575.0,17178.0,
686,1107.0,1083.0,582.0,17228.0,
687,1109.0,1125.0,532.0,17234.0,
688,1080.0,1031.0,577.0,17312.0,
689,1040.0,1062.0,558.0,17340.0,
690,1053.0,1095.0,486.0,17366.0,
691,1065.0,1057.0,534.0,17344.0,
692,1101.0,1099.0,576.0,17224.0,
693,1160.0,1120.0,532.0,17188.0,
694,1224.0,1186.0,506.0,17084.0,
695,1256.0,1230.0,488.0,17026.0,
696,1212.0,1200.0,584.0,17004.0,
697,1228.0,1250.0,540.0,16982.0,
698,1213.0,1261.0,480.0,17046.0,
699,1234.0,1240.0,555.0,16971.0,
700,1200.0,1270.0,451.0,17079.0,
701,1212.0,1196.0,474.0,17118.0,
702,1150.0,1137.0,507.0,17206.0,
703,1135.0,1150.0,491.0,17224.0,
704,1165.0,1194.0,442.0,17199.0,
705,1100.0,1174.0,500.0,17226.0,
706,1092.0,1239.0,447.0,17222.0,
707,1049.0,1210.0,469.0,17272.0,
708,997.0,1183.0,483.0,17337.0,
709,993.0,1147.0,498.0,17362.0,
710,975.0,1161.0,486.0,17378.0,
711,947.0,1080.0,480.0,17493.0,
712,947.0,1024.0,467.0,17562.0,
713,953.0,1046.0,366.0,17635.0,
714,943.0,1042.0,326.0,17689.0,
715,958.0,1024.0,347.0,17671.0,
716,955.0,1008.0,375.0,17662.0,
717,955.0,951.0,347.0,17747.0,
718,922.0,942.0,340.0,17796.0,
719,945.0,914.0,294.0,17847.0,
720,990.0,907.0,286.0,17817.0,
721,993.0,854.0,340.0,17813.0,
722,986.0,813.0,360.0,17841.0,
723,1013.0,796.0,319.0,17872.0,
724,1001.0,813.0,364.0,17822.0,
725,1005.0,752.0,376.0,17867.0,
726,1018.0,768.0,341.0,17873.0,
727,1030.0,712.0,362.0,17896.0,
728,1005.0,744.0,328.0,17923.0,
729,975.0,752.0,318.0,17955.0,
730,983.0,735.0,305.0,17977.0,
