jour,S,I,E,R,
0,19980.0,20.0,0.0,0.0,
1,19963.0,20.0,17.0,0.0,
2,19889.0,24.0,87.0,0.0,
3,19754.0,53.0,193.0,0.0,
4,19609.0,111.0,279.0,1.0,
5,19229.0,180.0,559.0,32.0,
6,18377.0,283.0,1290.0,50.0,
7,16931.0,714.0,2269.0,86.0,
8,14634.0,1374.0,3824.0,168.0,
9,10569.0,2633.0,6478.0,320.0,
10,6092.0,4485.0,8898.0,525.0,
11,2751.0,6838.0,9428.0,983.0,
12,516.0,9646.0,8465.0,1373.0,
13,107.0,11301.0,6166.0,2426.0,
14,5.0,11381.0,4844.0,3770.0,
15,4.0,12051.0,3039.0,4906.0,
16,5.0,11735.0,2273.0,5987.0,
17,10.0,11049.0,1482.0,7459.0,
18,17.0,10521.0,928.0,8534.0,
19,15.0,9404.0,701.0,9880.0,
20,11.0,8768.0,502.0,10719.0,
21,71.0,7902.0,485.0,11542.0,
22,87.0,7052.0,516.0,12345.0,
23,75.0,6629.0,426.0,12870.0,
24,46.0,5926.0,237.0,13791.0,
25,20.0,5329.0,231.0,14420.0,
26,23.0,4558.0,231.0,15188.0,
27,186.0,3906.0,236.0,15672.0,
28,180.0,3689.0,183.0,15948.0,
29,148.0,3265.0,170.0,16417.0,
30,61.0,3167.0,139.0,16633.0,
31,116.0,2820.0,51.0,17013.0,
32,124.0,2499.0,42.0,17335.0,
33,127.0,1937.0,13.0,17923.0,
34,124.0,1338.0,22.0,18516.0,
35,281.0,716.0,26.0,18977.0,
36,336.0,425.0,72.0,19167.0,
37,360.0,427.0,47.0,19166.0,
38,413.0,405.0,48.0,19134.0,
39,436.0,372.0,73.0,19119.0,
40,453.0,370.0,37.0,19140.0,
41,601.0,366.0,40.0,18993.0,
42,612.0,297.0,61.0,19030.0,
43,618.0,235.0,18.0,19129.0,
44,716.0,247.0,19.0,19018.0,
45,799.0,209.0,26.0,18966.0,
46,885.0,188.0,56.0,18871.0,
47,988.0,204.0,44.0,18764.0,
48,981.0,192.0,66.0,18761.0,
49,978.0,218.0,48.0,18756.0,
50,984.0,204.0,89.0,18723.0,
51,958.0,241.0,67.0,18734.0,
52,1032.0,264.0,42.0,18662.0,
53,1076.0,232.0,100.0,18592.0,
54,1133.0,267.0,55.0,18545.0,
55,1131.0,188.0,83.0,18598.0,
56,1101.0,224.0,96.0,18579.0,
57,1163.0,260.0,63.0,18514.0,
58,1249.0,227.0,52.0,18472.0,
59,1300.0,221.0,87.0,18392.0,
60,1309.0,243.0,65.0,18383.0,
61,1294.0,207.0,51.0,18448.0,
62,1393.0,212.0,70.0,18325.0,
63,1402.0,225.0,84.0,18289.0,
64,1490.0,198.0,115.0,18197.0,
65,1541.0,256.0,100.0,18103.0,
66,1713.0,300.0,106.0,17881.0,
67,1960.0,318.0,145.0,17577.0,
68,2107.0,366.0,183.0,17344.0,
69,2168.0,382.0,141.0,17309.0,
70,2581.0,382.0,188.0,16849.0,
71,2526.0,454.0,237.0,16783.0,
72,2364.0,488.0,274.0,16874.0,
73,2261.0,502.0,351.0,16886.0,
74,2028.0,588.0,401.0,16983.0,
75,1858.0,789.0,339.0,17014.0,
76,1688.0,870.0,424.0,17018.0,
77,1553.0,852.0,437.0,17158.0,
78,1444.0,960.0,354.0,17242.0,
79,1400.0,1015.0,417.0,17168.0,
80,1316.0,1153.0,461.0,17070.0,
81,1176.0,1149.0,466.0,17209.0,
82,1007.0,1244.0,423.0,17326.0,
83,852.0,1380.0,287.0,17481.0,
84,730.0,1311.0,314.0,17645.0,
85,761.0,1150.0,333.0,17756.0,
86,746.0,1093.0,312.0,17849.0,
87,663.0,1147.0,218.0,17972.0,
88,645.0,1168.0,208.0,17979.0,
89,613.0,1109.0,247.0,18031.0,
90,610.0,939.0,180.0,18271.0,
91,604.0,860.0,107.0,18429.0,
92,606.0,803.0,118.0,18473.0,
93,580.0,687.0,145.0,18588.0,
94,545.0,625.0,192.0,18638.0,
95,522.0,604.0,151.0,18723.0,
96,524.0,547.0,159.0,18770.0,
97,541.0,554.0,110.0,18795.0,
98,550.0,488.0,74.0,18888.0,
99,595.0,457.0,83.0,18865.0,
100,601.0,430.0,65.0,18904.0,
101,613.0,325.0,77.0,18985.0,
102,642.0,312.0,109.0,18937.0,
103,646.0,312.0,79.0,18963.0,
104,650.0,286.0,67.0,18997.0,
105,664.0,274.0,91.0,18971.0,
106,690.0,281.0,62.0,18967.0,
107,708.0,241.0,80.0,18971.0,
108,711.0,242.0,49.0,18998.0,
109,770.0,231.0,52.0,18947.0,
110,799.0,225.0,37.0,18939.0,
111,875.0,204.0,60.0,18861.0,
112,927.0,203.0,47.0,18823.0,
113,958.0,202.0,49.0,18791.0,
114,951.0,216.0,34.0,18799.0,
115,1010.0,203.0,51.0,18736.0,
116,1075.0,183.0,58.0,18684.0,
117,1153.0,173.0,68.0,18606.0,
118,1221.0,184.0,61.0,18534.0,
119,1336.0,161.0,81.0,18422.0,
120,1532.0,170.0,82.0,18216.0,
121,1678.0,192.0,83.0,18047.0,
122,1680.0,208.0,81.0,18031.0,
123,1678.0,223.0,109.0,17990.0,
124,1733.0,260.0,110.0,17897.0,
125,1813.0,318.0,83.0,17786.0,
126,1989.0,332.0,115.0,17564.0,
127,2160.0,297.0,126.0,17417.0,
128,2282.0,285.0,218.0,17215.0,
129,2346.0,360.0,165.0,17129.0,
130,2467.0,377.0,200.0,16956.0,
131,2499.0,466.0,289.0,16746.0,
132,2513.0,498.0,349.0,16640.0,
133,2587.0,621.0,344.0,16448.0,
134,2509.0,683.0,451.0,16357.0,
135,2403.0,863.0,404.0,16330.0,
136,2303.0,901.0,500.0,16296.0,
137,2155.0,945.0,571.0,16329.0,
138,2092.0,1206.0,561.0,16141.0,
139,2087.0,1292.0,619.0,16002.0,
140,1917.0,1436.0,643.0,16004.0,
141,1523.0,1384.0,904.0,16189.0,
142,1271.0,1542.0,878.0,16309.0,
143,1084.0,1644.0,856.0,16416.0,
144,879.0,1747.0,864.0,16510.0,
145,780.0,1668.0,787.0,16765.0,
146,703.0,1520.0,678.0,17099.0,
147,593.0,1406.0,750.0,17251.0,
148,478.0,1480.0,621.0,17421.0,
149,484.0,1415.0,531.0,17570.0,
150,504.0,1276.0,518.0,17702.0,
151,541.0,1252.0,416.0,17791.0,
152,512.0,1240.0,377.0,17871.0,
153,638.0,1166.0,356.0,17840.0,
154,762.0,1107.0,381.0,17750.0,
155,849.0,1081.0,336.0,17734.0,
156,860.0,1048.0,286.0,17806.0,
157,877.0,1053.0,257.0,17813.0,
158,1009.0,1057.0,312.0,17622.0,
159,1132.0,1018.0,374.0,17476.0,
160,1112.0,936.0,442.0,17510.0,
161,1082.0,988.0,374.0,17556.0,
162,1154.0,966.0,313.0,17567.0,
163,1214.0,862.0,391.0,17533.0,
164,1074.0,804.0,533.0,17589.0,
165,1016.0,836.0,569.0,17579.0,
166,1024.0,921.0,459.0,17596.0,
167,974.0,947.0,367.0,17712.0,
168,970.0,1050.0,340.0,17640.0,
169,908.0,1175.0,243.0,17674.0,
170,783.0,1154.0,369.0,17694.0,
171,727.0,1216.0,326.0,17731.0,
172,635.0,1302.0,325.0,17738.0,
173,573.0,1289.0,339.0,17799.0,
174,539.0,1353.0,296.0,17812.0,
175,498.0,1354.0,295.0,17853.0,
176,469.0,1411.0,218.0,17902.0,
177,455.0,1414.0,206.0,17925.0,
178,479.0,1331.0,223.0,17967.0,
179,485.0,1229.0,217.0,18069.0,
180,552.0,1191.0,181.0,18076.0,
181,607.0,1094.0,209.0,18090.0,
182,644.0,1085.0,247.0,18024.0,
183,648.0,1110.0,217.0,18025.0,
184,660.0,1156.0,177.0,18007.0,
185,612.0,1098.0,281.0,18009.0,
186,603.0,1025.0,282.0,18090.0,
187,605.0,1049.0,268.0,18078.0,
188,596.0,991.0,291.0,18122.0,
189,623.0,1040.0,198.0,18139.0,
190,607.0,940.0,237.0,18216.0,
191,696.0,920.0,232.0,18152.0,
192,788.0,810.0,244.0,18158.0,
193,814.0,769.0,266.0,18151.0,
194,911.0,798.0,305.0,17986.0,
195,1014.0,727.0,297.0,17962.0,
196,1059.0,754.0,370.0,17817.0,
197,1108.0,778.0,359.0,17755.0,
198,1135.0,794.0,328.0,17743.0,
199,1150.0,717.0,366.0,17767.0,
200,1190.0,703.0,311.0,17796.0,
201,1230.0,698.0,398.0,17674.0,
202,1243.0,741.0,414.0,17602.0,
203,1283.0,830.0,333.0,17554.0,
204,1247.0,871.0,315.0,17567.0,
205,1255.0,922.0,251.0,17572.0,
206,1178.0,897.0,314.0,17611.0,
207,1268.0,889.0,451.0,17392.0,
208,1177.0,1054.0,446.0,17323.0,
209,1011.0,1105.0,520.0,17364.0,
210,891.0,1199.0,487.0,17423.0,
211,850.0,1216.0,361.0,17573.0,
212,786.0,1215.0,363.0,17636.0,
213,735.0,1220.0,324.0,17721.0,
214,636.0,1229.0,359.0,17776.0,
215,591.0,1266.0,310.0,17833.0,
216,550.0,1320.0,242.0,17888.0,
217,588.0,1235.0,189.0,17988.0,
218,578.0,1196.0,166.0,18060.0,
219,691.0,1198.0,150.0,17961.0,
220,697.0,1200.0,211.0,17892.0,
221,669.0,1216.0,209.0,17906.0,
222,640.0,1182.0,301.0,17877.0,
223,540.0,1201.0,401.0,17858.0,
224,523.0,1182.0,376.0,17919.0,
225,529.0,1109.0,400.0,17962.0,
226,526.0,1088.0,363.0,18023.0,
227,517.0,1103.0,374.0,18006.0,
228,525.0,998.0,351.0,18126.0,
229,679.0,1040.0,307.0,17974.0,
230,709.0,1000.0,285.0,18006.0,
231,680.0,1013.0,312.0,17995.0,
232,658.0,942.0,367.0,18033.0,
233,697.0,939.0,348.0,18016.0,
234,672.0,950.0,323.0,18055.0,
235,668.0,891.0,305.0,18136.0,
236,670.0,881.0,317.0,18132.0,
237,671.0,921.0,284.0,18124.0,
238,681.0,932.0,227.0,18160.0,
239,690.0,928.0,181.0,18201.0,
240,721.0,862.0,207.0,18210.0,
241,744.0,823.0,162.0,18271.0,
242,781.0,772.0,189.0,18258.0,
243,801.0,765.0,192.0,18242.0,
244,839.0,752.0,266.0,18143.0,
245,929.0,750.0,207.0,18114.0,
246,983.0,670.0,185.0,18162.0,
247,1062.0,648.0,160.0,18130.0,
248,1208.0,614.0,192.0,17986.0,
249,1280.0,532.0,243.0,17945.0,
250,1375.0,589.0,243.0,17793.0,
251,1437.0,565.0,243.0,17755.0,
252,1430.0,570.0,309.0,17691.0,
253,1473.0,593.0,334.0,17600.0,
254,1402.0,678.0,293.0,17627.0,
255,1403.0,695.0,344.0,17558.0,
256,1464.0,656.0,338.0,17542.0,
257,1474.0,661.0,268.0,17597.0,
258,1506.0,532.0,291.0,17671.0,
259,1482.0,578.0,309.0,17631.0,
260,1471.0,589.0,277.0,17663.0,
261,1546.0,632.0,294.0,17528.0,
262,1565.0,695.0,255.0,17485.0,
263,1597.0,741.0,222.0,17440.0,
264,1609.0,715.0,274.0,17402.0,
265,1544.0,727.0,315.0,17414.0,
266,1685.0,699.0,314.0,17302.0,
267,1666.0,726.0,391.0,17217.0,
268,1685.0,808.0,309.0,17198.0,
269,1808.0,922.0,240.0,17030.0,
270,1807.0,902.0,419.0,16872.0,
271,1704.0,909.0,419.0,16968.0,
272,1658.0,890.0,493.0,16959.0,
273,1638.0,925.0,458.0,16979.0,
274,1585.0,898.0,537.0,16980.0,
275,1564.0,909.0,502.0,17025.0,
276,1493.0,869.0,563.0,17075.0,
277,1448.0,899.0,609.0,17044.0,
278,1401.0,953.0,537.0,17109.0,
279,1531.0,967.0,550.0,16952.0,
280,1759.0,949.0,722.0,16570.0,
281,1752.0,992.0,784.0,16472.0,
282,1645.0,1122.0,880.0,16353.0,
283,1455.0,1255.0,1020.0,16270.0,
284,1231.0,1273.0,1124.0,16372.0,
285,1021.0,1567.0,981.0,16431.0,
286,1000.0,1608.0,869.0,16523.0,
287,955.0,1658.0,831.0,16556.0,
288,900.0,1600.0,717.0,16783.0,
289,835.0,1650.0,607.0,16908.0,
290,777.0,1712.0,494.0,17017.0,
291,614.0,1704.0,540.0,17142.0,
292,536.0,1603.0,557.0,17304.0,
293,532.0,1640.0,457.0,17371.0,
294,457.0,1757.0,304.0,17482.0,
295,420.0,1438.0,255.0,17887.0,
296,407.0,1238.0,269.0,18086.0,
297,467.0,1116.0,197.0,18220.0,
298,487.0,1020.0,198.0,18295.0,
299,495.0,955.0,175.0,18375.0,
300,538.0,829.0,160.0,18473.0,
301,635.0,784.0,192.0,18389.0,
302,828.0,719.0,184.0,18269.0,
303,861.0,654.0,211.0,18274.0,
304,1009.0,589.0,228.0,18174.0,
305,1210.0,554.0,334.0,17902.0,
306,1197.0,542.0,426.0,17835.0,
307,1222.0,650.0,341.0,17787.0,
308,1205.0,681.0,292.0,17822.0,
309,1232.0,659.0,229.0,17880.0,
310,1330.0,635.0,276.0,17759.0,
311,1294.0,684.0,305.0,17717.0,
312,1303.0,724.0,358.0,17615.0,
313,1342.0,799.0,311.0,17548.0,
314,1472.0,741.0,413.0,17374.0,
315,1449.0,809.0,417.0,17325.0,
316,1379.0,893.0,389.0,17339.0,
317,1359.0,996.0,427.0,17218.0,
318,1259.0,1067.0,451.0,17223.0,
319,1270.0,1167.0,384.0,17179.0,
320,1274.0,1143.0,432.0,17151.0,
321,1183.0,1247.0,522.0,17048.0,
322,1086.0,1279.0,498.0,17137.0,
323,1069.0,1302.0,411.0,17218.0,
324,1020.0,1258.0,465.0,17257.0,
325,981.0,1383.0,396.0,17240.0,
326,945.0,1377.0,461.0,17217.0,
327,1019.0,1438.0,423.0,17120.0,
328,1074.0,1551.0,419.0,16956.0,
329,1117.0,1686.0,355.0,16842.0,
330,965.0,1740.0,548.0,16747.0,
331,953.0,1789.0,410.0,16848.0,
332,918.0,1748.0,501.0,16833.0,
333,853.0,1787.0,432.0,16928.0,
334,835.0,1853.0,374.0,16938.0,
335,724.0,1792.0,497.0,16987.0,
336,682.0,1813.0,491.0,17014.0,
337,644.0,1856.0,448.0,17052.0,
338,610.0,1898.0,362.0,17130.0,
339,553.0,1821.0,364.0,17262.0,
340,547.0,1773.0,354.0,17326.0,
341,523.0,1726.0,365.0,17386.0,
342,518.0,1661.0,284.0,17537.0,
343,532.0,1498.0,287.0,17683.0,
344,553.0,1354.0,250.0,17843.0,
345,544.0,1292.0,239.0,17925.0,
346,552.0,1250.0,179.0,18019.0,
347,574.0,1219.0,114.0,18093.0,
348,578.0,1032.0,162.0,18228.0,
349,576.0,981.0,203.0,18240.0,
350,606.0,916.0,171.0,18307.0,
351,619.0,850.0,173.0,18358.0,
352,671.0,799.0,171.0,18359.0,
353,699.0,770.0,209.0,18322.0,
354,763.0,779.0,183.0,18275.0,
355,745.0,754.0,211.0,18290.0,
356,860.0,699.0,156.0,18285.0,
357,960.0,651.0,232.0,18157.0,
358,1008.0,665.0,230.0,18097.0,
359,1016.0,593.0,246.0,18145.0,
360,1030.0,584.0,223.0,18163.0,
361,1068.0,550.0,208.0,18174.0,
362,1102.0,518.0,236.0,18144.0,
363,1120.0,541.0,246.0,18093.0,
364,1122.0,600.0,253.0,18025.0,
365,1136.0,603.0,263.0,17998.0,
366,1102.0,595.0,253.0,18050.0,
367,1095.0,538.0,309.0,18058.0,
368,1092.0,530.0,281.0,18097.0,
369,1097.0,603.0,238.0,18062.0,
370,1048.0,645.0,278.0,18029.0,
371,1025.0,660.0,299.0,18016.0,
372,1060.0,671.0,281.0,17988.0,
373,1059.0,759.0,240.0,17942.0,
374,1054.0,750.0,299.0,17897.0,
375,1062.0,748.0,260.0,17930.0,
376,1081.0,781.0,261.0,17877.0,
377,1115.0,814.0,320.0,17751.0,
378,1107.0,833.0,301.0,17759.0,
379,1122.0,827.0,321.0,17730.0,
380,1130.0,898.0,304.0,17668.0,
381,1131.0,956.0,259.0,17654.0,
382,1222.0,926.0,306.0,17546.0,
383,1346.0,882.0,350.0,17422.0,
384,1447.0,908.0,391.0,17254.0,
385,1584.0,959.0,399.0,17058.0,
386,1611.0,960.0,380.0,17049.0,
387,1651.0,924.0,531.0,16894.0,
388,1669.0,914.0,587.0,16830.0,
389,1665.0,978.0,621.0,16736.0,
390,1630.0,1131.0,614.0,16625.0,
391,1534.0,1201.0,606.0,16659.0,
392,1373.0,1285.0,651.0,16691.0,
393,1260.0,1263.0,762.0,16715.0,
394,1152.0,1190.0,829.0,16829.0,
395,1093.0,1340.0,724.0,16843.0,
396,1046.0,1365.0,646.0,16943.0,
397,1000.0,1434.0,600.0,16966.0,
398,923.0,1611.0,543.0,16923.0,
399,853.0,1559.0,625.0,16963.0,
400,802.0,1613.0,576.0,17009.0,
401,784.0,1575.0,454.0,17187.0,
402,761.0,1470.0,458.0,17311.0,
403,746.0,1414.0,480.0,17360.0,
404,769.0,1294.0,418.0,17519.0,
405,838.0,1219.0,485.0,17458.0,
406,914.0,1200.0,496.0,17390.0,
407,913.0,1144.0,543.0,17400.0,
408,956.0,1086.0,548.0,17410.0,
409,970.0,1184.0,490.0,17356.0,
410,986.0,1101.0,537.0,17376.0,
411,1030.0,1127.0,544.0,17299.0,
412,1010.0,1113.0,610.0,17267.0,
413,940.0,1147.0,663.0,17250.0,
414,874.0,1219.0,675.0,17232.0,
415,807.0,1310.0,655.0,17228.0,
416,802.0,1325.0,637.0,17236.0,
417,792.0,1414.0,578.0,17216.0,
418,736.0,1450.0,607.0,17207.0,
419,597.0,1507.0,647.0,17249.0,
420,557.0,1528.0,591.0,17324.0,
421,519.0,1517.0,592.0,17372.0,
422,494.0,1501.0,546.0,17459.0,
423,463.0,1449.0,543.0,17545.0,
424,427.0,1505.0,463.0,17605.0,
425,424.0,1565.0,351.0,17660.0,
426,410.0,1562.0,255.0,17773.0,
427,410.0,1432.0,242.0,17916.0,
428,415.0,1346.0,279.0,17960.0,
429,407.0,1314.0,232.0,18047.0,
430,424.0,1312.0,203.0,18061.0,
431,435.0,1271.0,187.0,18107.0,
432,525.0,1211.0,215.0,18049.0,
433,569.0,1103.0,278.0,18050.0,
434,539.0,1098.0,310.0,18053.0,
435,559.0,1031.0,252.0,18158.0,
436,598.0,1029.0,236.0,18137.0,
437,597.0,982.0,278.0,18143.0,
438,619.0,888.0,297.0,18196.0,
439,628.0,887.0,273.0,18212.0,
440,641.0,843.0,258.0,18258.0,
441,652.0,899.0,190.0,18259.0,
442,672.0,836.0,203.0,18289.0,
443,687.0,745.0,204.0,18364.0,
444,722.0,693.0,194.0,18391.0,
445,754.0,628.0,217.0,18401.0,
446,842.0,567.0,216.0,18375.0,
447,884.0,569.0,229.0,18318.0,
448,892.0,561.0,187.0,18360.0,
449,934.0,495.0,221.0,18350.0,
450,1036.0,480.0,247.0,18237.0,
451,1167.0,457.0,285.0,18091.0,
452,1224.0,455.0,275.0,18046.0,
453,1290.0,437.0,295.0,17978.0,
454,1407.0,477.0,322.0,17794.0,
455,1453.0,527.0,308.0,17712.0,
456,1507.0,596.0,305.0,17592.0,
457,1626.0,605.0,377.0,17392.0,
458,1599.0,743.0,355.0,17303.0,
459,1770.0,772.0,460.0,16998.0,
460,1720.0,839.0,481.0,16960.0,
461,1652.0,925.0,513.0,16910.0,
462,1519.0,990.0,581.0,16910.0,
463,1418.0,1031.0,623.0,16928.0,
464,1357.0,1164.0,592.0,16887.0,
465,1347.0,1276.0,535.0,16842.0,
466,1251.0,1296.0,510.0,16943.0,
467,1169.0,1282.0,517.0,17032.0,
468,1086.0,1353.0,590.0,16971.0,
469,987.0,1389.0,637.0,16987.0,
470,902.0,1549.0,544.0,17005.0,
471,883.0,1525.0,474.0,17118.0,
472,886.0,1507.0,504.0,17103.0,
473,851.0,1551.0,480.0,17118.0,
474,793.0,1648.0,416.0,17143.0,
475,772.0,1714.0,380.0,17134.0,
476,744.0,1650.0,398.0,17208.0,
477,677.0,1501.0,416.0,17406.0,
478,661.0,1500.0,370.0,17469.0,
479,697.0,1483.0,321.0,17499.0,
480,680.0,1425.0,322.0,17573.0,
481,678.0,1439.0,362.0,17521.0,
482,740.0,1448.0,251.0,17561.0,
483,817.0,1448.0,239.0,17496.0,
484,923.0,1331.0,259.0,17487.0,
485,961.0,1297.0,288.0,17454.0,
486,875.0,1300.0,386.0,17439.0,
487,1118.0,1320.0,367.0,17195.0,
488,1056.0,1395.0,356.0,17193.0,
489,1074.0,1366.0,459.0,17101.0,
490,1099.0,1397.0,494.0,17010.0,
491,986.0,1473.0,521.0,17020.0,
492,976.0,1396.0,571.0,17057.0,
493,913.0,1411.0,597.0,17079.0,
494,829.0,1379.0,651.0,17141.0,
495,776.0,1380.0,619.0,17225.0,
496,734.0,1461.0,511.0,17294.0,
497,700.0,1460.0,483.0,17357.0,
498,708.0,1290.0,521.0,17481.0,
499,704.0,1237.0,385.0,17674.0,
500,686.0,1167.0,427.0,17720.0,
501,697.0,1131.0,348.0,17824.0,
502,696.0,1021.0,302.0,17981.0,
503,697.0,1018.0,295.0,17990.0,
504,708.0,981.0,221.0,18090.0,
505,693.0,960.0,205.0,18142.0,
506,694.0,875.0,234.0,18197.0,
507,705.0,785.0,230.0,18280.0,
508,742.0,719.0,194.0,18345.0,
509,811.0,637.0,223.0,18329.0,
510,870.0,616.0,192.0,18322.0,
511,894.0,573.0,205.0,18328.0,
512,971.0,544.0,212.0,18273.0,
513,1172.0,540.0,236.0,18052.0,
514,1279.0,592.0,192.0,17937.0,
515,1303.0,569.0,223.0,17905.0,
516,1376.0,582.0,213.0,17829.0,
517,1427.0,595.0,203.0,17775.0,
518,1422.0,611.0,245.0,17722.0,
519,1419.0,596.0,246.0,17739.0,
520,1412.0,568.0,309.0,17711.0,
521,1437.0,544.0,375.0,17644.0,
522,1469.0,565.0,344.0,17622.0,
523,1550.0,614.0,276.0,17560.0,
524,1520.0,673.0,337.0,17470.0,
525,1499.0,739.0,372.0,17390.0,
526,1453.0,803.0,307.0,17437.0,
527,1423.0,859.0,330.0,17388.0,
528,1348.0,859.0,456.0,17337.0,
529,1353.0,873.0,438.0,17336.0,
530,1283.0,908.0,525.0,17284.0,
531,1275.0,988.0,476.0,17261.0,
532,1200.0,973.0,591.0,17236.0,
533,1125.0,1152.0,613.0,17110.0,
534,1045.0,1267.0,618.0,17070.0,
535,959.0,1354.0,619.0,17068.0,
536,905.0,1386.0,534.0,17175.0,
537,859.0,1407.0,552.0,17182.0,
538,816.0,1408.0,545.0,17231.0,
539,764.0,1410.0,512.0,17314.0,
540,725.0,1273.0,528.0,17474.0,
541,735.0,1206.0,511.0,17548.0,
542,698.0,1236.0,519.0,17547.0,
543,703.0,1237.0,475.0,17585.0,
544,680.0,1171.0,471.0,17678.0,
545,665.0,1114.0,431.0,17790.0,
546,640.0,1097.0,429.0,17834.0,
547,635.0,1048.0,427.0,17890.0,
548,692.0,965.0,463.0,17880.0,
549,769.0,884.0,468.0,17879.0,
550,835.0,929.0,393.0,17843.0,
551,928.0,910.0,353.0,17809.0,
552,1112.0,905.0,323.0,17660.0,
553,1213.0,885.0,345.0,17557.0,
554,1256.0,896.0,403.0,17445.0,
555,1271.0,879.0,456.0,17394.0,
556,1257.0,819.0,606.0,17318.0,
557,1242.0,925.0,499.0,17334.0,
558,1176.0,965.0,504.0,17355.0,
559,1122.0,1044.0,490.0,17344.0,
560,1047.0,1113.0,453.0,17387.0,
561,1003.0,1218.0,424.0,17355.0,
562,926.0,1208.0,477.0,17389.0,
563,912.0,1097.0,528.0,17463.0,
564,846.0,1081.0,518.0,17555.0,
565,878.0,1073.0,463.0,17586.0,
566,870.0,1062.0,429.0,17639.0,
567,896.0,1078.0,339.0,17687.0,
568,873.0,1023.0,434.0,17670.0,
569,880.0,1083.0,397.0,17640.0,
570,900.0,1069.0,395.0,17636.0,
571,879.0,1101.0,378.0,17642.0,
572,886.0,1041.0,404.0,17669.0,
573,901.0,986.0,431.0,17682.0,
574,909.0,916.0,370.0,17805.0,
575,921.0,948.0,349.0,17782.0,
576,892.0,820.0,418.0,17870.0,
577,893.0,837.0,402.0,17868.0,
578,922.0,798.0,433.0,17847.0,
579,898.0,863.0,393.0,17846.0,
580,880.0,839.0,357.0,17924.0,
581,866.0,838.0,360.0,17936.0,
582,881.0,924.0,260.0,17935.0,
583,883.0,904.0,266.0,17947.0,
584,923.0,871.0,304.0,17902.0,
585,942.0,840.0,268.0,17950.0,
586,949.0,838.0,298.0,17915.0,
587,937.0,836.0,317.0,17910.0,
588,961.0,860.0,301.0,17878.0,
589,1007.0,847.0,286.0,17860.0,
590,996.0,914.0,254.0,17836.0,
591,1015.0,874.0,257.0,17854.0,
592,1006.0,857.0,285.0,17852.0,
593,1070.0,889.0,285.0,17756.0,
594,1232.0,907.0,277.0,17584.0,
595,1278.0,913.0,409.0,17400.0,
596,1227.0,971.0,412.0,17390.0,
597,1174.0,1081.0,410.0,17335.0,
598,1195.0,1074.0,430.0,17301.0,
599,1120.0,1210.0,452.0,17218.0,
600,1069.0,1196.0,579.0,17156.0,
601,1002.0,1425.0,489.0,17084.0,
602,984.0,1528.0,440.0,17048.0,
603,1058.0,1489.0,454.0,16999.0,
604,1097.0,1537.0,413.0,16953.0,
605,1060.0,1575.0,483.0,16882.0,
606,1124.0,1604.0,477.0,16795.0,
607,1180.0,1623.0,437.0,16760.0,
608,1193.0,1645.0,617.0,16545.0,
609,987.0,1707.0,701.0,16605.0,
610,938.0,1730.0,731.0,16601.0,
611,943.0,1724.0,663.0,16670.0,
612,793.0,1741.0,820.0,16646.0,
613,747.0,1965.0,687.0,16601.0,
614,678.0,2127.0,552.0,16643.0,
615,639.0,2107.0,604.0,16650.0,
616,590.0,2020.0,602.0,16788.0,
617,560.0,1999.0,470.0,16971.0,
618,597.0,1816.0,404.0,17183.0,
619,597.0,1847.0,332.0,17224.0,
620,587.0,1777.0,279.0,17357.0,
621,592.0,1713.0,290.0,17405.0,
622,612.0,1651.0,321.0,17416.0,
623,624.0,1571.0,281.0,17524.0,
624,643.0,1464.0,301.0,17592.0,
625,652.0,1418.0,301.0,17629.0,
626,689.0,1395.0,331.0,17585.0,
627,688.0,1360.0,308.0,17644.0,
628,731.0,1324.0,317.0,17628.0,
629,722.0,1308.0,335.0,17635.0,
630,702.0,1292.0,361.0,17645.0,
631,683.0,1314.0,406.0,17597.0,
632,683.0,1298.0,429.0,17590.0,
633,690.0,1386.0,300.0,17624.0,
634,673.0,1372.0,267.0,17688.0,
635,669.0,1324.0,274.0,17733.0,
636,685.0,1299.0,263.0,17753.0,
637,675.0,1290.0,276.0,17759.0,
638,687.0,1340.0,227.0,17746.0,
639,682.0,1297.0,265.0,17756.0,
640,694.0,1263.0,269.0,17774.0,
641,715.0,1192.0,325.0,17768.0,
642,726.0,1215.0,239.0,17820.0,
643,778.0,1202.0,242.0,17778.0,
644,832.0,1202.0,281.0,17685.0,
645,839.0,1183.0,276.0,17702.0,
646,878.0,1201.0,282.0,17639.0,
647,996.0,1223.0,340.0,17441.0,
648,964.0,1247.0,293.0,17496.0,
649,978.0,1171.0,326.0,17525.0,
650,977.0,1176.0,340.0,17507.0,
651,971.0,1228.0,295.0,17506.0,
652,921.0,1228.0,351.0,17500.0,
653,966.0,1185.0,345.0,17504.0,
654,963.0,1175.0,355.0,17507.0,
655,951.0,1206.0,361.0,17482.0,
656,1004.0,1173.0,405.0,17418.0,
657,1036.0,1166.0,421.0,17377.0,
658,1034.0,1169.0,426.0,17371.0,
659,1009.0,1127.0,467.0,17397.0,
660,1002.0,1156.0,486.0,17356.0,
661,972.0,1119.0,604.0,17305.0,
662,971.0,1105.0,526.0,17398.0,
663,963.0,1027.0,479.0,17531.0,
664,959.0,1007.0,521.0,17513.0,
665,954.0,1088.0,508.0,17450.0,
666,929.0,1145.0,448.0,17478.0,
667,924.0,1111.0,431.0,17534.0,
668,899.0,1109.0,413.0,17579.0,
669,877.0,1026.0,458.0,17639.0,
670,868.0,1001.0,421.0,17710.0,
671,869.0,981.0,341.0,17809.0,
672,864.0,921.0,388.0,17827.0,
673,872.0,920.0,373.0,17835.0,
674,894.0,868.0,391.0,17847.0,
675,903.0,890.0,346.0,17861.0,
676,913.0,883.0,333.0,17871.0,
677,914.0,909.0,314.0,17863.0,
678,939.0,879.0,341.0,17841.0,
679,961.0,871.0,317.0,17851.0,
680,966.0,783.0,363.0,17888.0,
681,997.0,841.0,343.0,17819.0,
682,1025.0,870.0,369.0,17736.0,
683,1021.0,864.0,378.0,17737.0,
684,1026.0,880.0,380.0,17714.0,
685,1021.0,844.0,386.0,17749.0,
686,970.0,825.0,475.0,17730.0,
687,958.0,848.0,428.0,17766.0,
688,941.0,852.0,466.0,17741.0,
689,936.0,864.0,410.0,17790.0,
690,929.0,927.0,370.0,17774.0,
691,912.0,975.0,380.0,17733.0,
692,854.0,971.0,385.0,17790.0,
693,822.0,972.0,372.0,17834.0,
694,812.0,934.0,352.0,17902.0,
695,799.0,931.0,309.0,17961.0,
696,777.0,882.0,321.0,18020.0,
697,765.0,863.0,303.0,18069.0,
698,775.0,830.0,318.0,18077.0,
699,780.0,813.0,332.0,18075.0,
700,765.0,867.0,294.0,18074.0,
701,765.0,809.0,325.0,18101.0,
702,718.0,809.0,306.0,18167.0,
703,734.0,799.0,288.0,18179.0,
704,753.0,847.0,271.0,18129.0,
705,957.0,838.0,265.0,17940.0,
706,1005.0,819.0,291.0,17885.0,
707,1005.0,877.0,280.0,17838.0,
708,980.0,921.0,309.0,17790.0,
709,954.0,958.0,303.0,17785.0,
710,910.0,999.0,352.0,17739.0,
711,872.0,1063.0,346.0,17719.0,
712,843.0,1110.0,377.0,17670.0,
713,855.0,1123.0,404.0,17618.0,
714,837.0,1168.0,381.0,17614.0,
715,825.0,1155.0,381.0,17639.0,
716,811.0,1134.0,399.0,17656.0,
717,781.0,1179.0,413.0,17627.0,
718,764.0,1212.0,439.0,17585.0,
719,745.0,1248.0,397.0,17610.0,
720,728.0,1251.0,427.0,17594.0,
721,735.0,1183.0,468.0,17614.0,
722,709.0,1246.0,405.0,17640.0,
723,739.0,1323.0,389.0,17549.0,
724,735.0,1331.0,308.0,17626.0,
725,769.0,1265.0,324.0,17642.0,
726,747.0,1227.0,326.0,17700.0,
727,936.0,1176.0,318.0,17570.0,
728,955.0,1100.0,356.0,17589.0,
729,939.0,1086.0,378.0,17597.0,
730,959.0,1079.0,322.0,17640.0,
