jour,S,I,E,R,
0,19980.0,20.0,0.0,0.0,
1,19971.0,20.0,9.0,0.0,
2,19881.0,19.0,96.0,4.0,
3,19804.0,40.0,152.0,4.0,
4,19540.0,104.0,352.0,4.0,
5,19042.0,205.0,736.0,17.0,
6,18197.0,398.0,1357.0,48.0,
7,16481.0,736.0,2682.0,101.0,
8,13595.0,1526.0,4688.0,191.0,
9,9630.0,3020.0,7036.0,314.0,
10,5196.0,5313.0,8928.0,563.0,
11,1555.0,7592.0,9828.0,1025.0,
12,308.0,10141.0,7580.0,1971.0,
13,23.0,11799.0,5080.0,3098.0,
14,2.0,11790.0,3758.0,4450.0,
15,8.0,12031.0,2488.0,5473.0,
16,17.0,11290.0,1784.0,6909.0,
17,19.0,10587.0,1362.0,8032.0,
18,19.0,10421.0,810.0,8750.0,
19,66.0,10004.0,378.0,9552.0,
20,64.0,9455.0,158.0,10323.0,
21,29.0,8421.0,165.0,11385.0,
22,26.0,7597.0,155.0,12222.0,
23,26.0,6269.0,154.0,13551.0,
24,29.0,5134.0,135.0,14702.0,
25,25.0,4723.0,86.0,15166.0,
26,8.0,4429.0,60.0,15503.0,
27,12.0,3992.0,41.0,15955.0,
28,30.0,3517.0,47.0,16406.0,
29,30.0,2397.0,53.0,17520.0,
30,38.0,1800.0,48.0,18114.0,
31,279.0,1582.0,43.0,18096.0,
32,406.0,1277.0,64.0,18253.0,
33,430.0,990.0,64.0,18516.0,
34,472.0,684.0,73.0,18771.0,
35,561.0,639.0,85.0,18715.0,
36,596.0,587.0,79.0,18738.0,
37,582.0,587.0,80.0,18751.0,
38,589.0,568.0,146.0,18697.0,
39,688.0,491.0,169.0,18652.0,
40,721.0,512.0,145.0,18622.0,
41,791.0,419.0,111.0,18679.0,
42,895.0,419.0,175.0,18511.0,
43,845.0,367.0,209.0,18579.0,
44,803.0,408.0,209.0,18580.0,
45,746.0,348.0,258.0,18648.0,
46,777.0,319.0,273.0,18631.0,
47,771.0,368.0,209.0,18652.0,
48,891.0,320.0,262.0,18527.0,
49,877.0,326.0,305.0,18492.0,
50,864.0,322.0,287.0,18527.0,
51,839.0,366.0,316.0,18479.0,
52,870.0,436.0,257.0,18437.0,
53,864.0,468.0,245.0,18423.0,
54,956.0,470.0,255.0,18319.0,
55,952.0,537.0,254.0,18257.0,
56,903.0,528.0,261.0,18308.0,
57,825.0,551.0,316.0,18308.0,
58,938.0,531.0,364.0,18167.0,
59,880.0,547.0,414.0,18159.0,
60,850.0,516.0,429.0,18205.0,
61,835.0,497.0,402.0,18266.0,
62,830.0,549.0,335.0,18286.0,
63,814.0,550.0,344.0,18292.0,
64,886.0,542.0,326.0,18246.0,
65,990.0,520.0,359.0,18131.0,
66,957.0,506.0,412.0,18125.0,
67,947.0,551.0,391.0,18111.0,
68,927.0,603.0,309.0,18161.0,
69,875.0,618.0,294.0,18213.0,
70,886.0,607.0,277.0,18230.0,
71,811.0,611.0,302.0,18276.0,
72,762.0,512.0,342.0,18384.0,
73,767.0,537.0,336.0,18360.0,
74,774.0,493.0,313.0,18420.0,
75,794.0,481.0,301.0,18424.0,
76,827.0,373.0,343.0,18457.0,
77,812.0,378.0,327.0,18483.0,
78,800.0,348.0,322.0,18530.0,
79,795.0,236.0,290.0,18679.0,
80,803.0,276.0,222.0,18699.0,
81,815.0,205.0,191.0,18789.0,
82,805.0,213.0,165.0,18817.0,
83,805.0,213.0,126.0,18856.0,
84,817.0,190.0,100.0,18893.0,
85,872.0,145.0,77.0,18906.0,
86,1021.0,109.0,80.0,18790.0,
87,1089.0,96.0,68.0,18747.0,
88,1196.0,89.0,73.0,18642.0,
89,1428.0,93.0,76.0,18403.0,
90,1522.0,100.0,88.0,18290.0,
91,1636.0,99.0,84.0,18181.0,
92,1690.0,93.0,96.0,18121.0,
93,1712.0,86.0,106.0,18096.0,
94,1774.0,84.0,115.0,18027.0,
95,1993.0,83.0,124.0,17800.0,
96,2140.0,74.0,114.0,17672.0,
97,2352.0,70.0,108.0,17470.0,
98,2432.0,67.0,99.0,17402.0,
99,2484.0,81.0,114.0,17321.0,
100,2464.0,101.0,107.0,17328.0,
101,2472.0,122.0,98.0,17308.0,
102,2561.0,113.0,111.0,17215.0,
103,2662.0,116.0,124.0,17098.0,
104,2702.0,150.0,102.0,17046.0,
105,2774.0,130.0,100.0,16996.0,
106,2809.0,120.0,139.0,16932.0,
107,2976.0,144.0,175.0,16705.0,
108,3097.0,162.0,189.0,16552.0,
109,3246.0,190.0,211.0,16353.0,
110,3471.0,193.0,297.0,16039.0,
111,3512.0,211.0,429.0,15848.0,
112,3489.0,312.0,436.0,15763.0,
113,3326.0,393.0,496.0,15785.0,
114,3212.0,494.0,504.0,15790.0,
115,2977.0,601.0,617.0,15805.0,
116,2760.0,671.0,698.0,15871.0,
117,2590.0,762.0,774.0,15874.0,
118,2272.0,938.0,868.0,15922.0,
119,1964.0,1049.0,1019.0,15968.0,
120,1820.0,1233.0,1065.0,15882.0,
121,1486.0,1400.0,1219.0,15895.0,
122,1349.0,1529.0,1056.0,16066.0,
123,1170.0,1672.0,975.0,16183.0,
124,1159.0,1776.0,1006.0,16059.0,
125,961.0,1838.0,1188.0,16013.0,
126,956.0,2061.0,929.0,16054.0,
127,875.0,1962.0,980.0,16183.0,
128,728.0,2072.0,760.0,16440.0,
129,654.0,1994.0,694.0,16658.0,
130,557.0,1882.0,804.0,16757.0,
131,545.0,1976.0,664.0,16815.0,
132,502.0,1993.0,482.0,17023.0,
133,413.0,1800.0,481.0,17306.0,
134,378.0,1670.0,414.0,17538.0,
135,343.0,1545.0,344.0,17768.0,
136,335.0,1414.0,225.0,18026.0,
137,402.0,1185.0,177.0,18236.0,
138,532.0,993.0,213.0,18262.0,
139,475.0,887.0,276.0,18362.0,
140,643.0,836.0,298.0,18223.0,
141,601.0,853.0,259.0,18287.0,
142,636.0,910.0,170.0,18284.0,
143,630.0,708.0,241.0,18421.0,
144,607.0,630.0,237.0,18526.0,
145,662.0,561.0,192.0,18585.0,
146,785.0,523.0,199.0,18493.0,
147,871.0,476.0,235.0,18418.0,
148,898.0,420.0,175.0,18507.0,
149,979.0,389.0,168.0,18464.0,
150,1122.0,389.0,177.0,18312.0,
151,1155.0,379.0,212.0,18254.0,
152,1252.0,372.0,233.0,18143.0,
153,1401.0,384.0,259.0,17956.0,
154,1453.0,442.0,206.0,17899.0,
155,1457.0,465.0,293.0,17785.0,
156,1478.0,543.0,262.0,17717.0,
157,1416.0,527.0,345.0,17712.0,
158,1423.0,560.0,319.0,17698.0,
159,1508.0,492.0,352.0,17648.0,
160,1418.0,619.0,358.0,17605.0,
161,1455.0,542.0,345.0,17658.0,
162,1668.0,509.0,420.0,17403.0,
163,1675.0,568.0,447.0,17310.0,
164,1653.0,585.0,472.0,17290.0,
165,1783.0,628.0,556.0,17033.0,
166,1722.0,687.0,631.0,16960.0,
167,1739.0,773.0,634.0,16854.0,
168,1741.0,889.0,570.0,16800.0,
169,1647.0,891.0,655.0,16807.0,
170,1509.0,1046.0,640.0,16805.0,
171,1397.0,1084.0,715.0,16804.0,
172,1243.0,1122.0,804.0,16831.0,
173,1127.0,1114.0,869.0,16890.0,
174,1009.0,1373.0,704.0,16914.0,
175,828.0,1394.0,821.0,16957.0,
176,789.0,1424.0,750.0,17037.0,
177,711.0,1429.0,750.0,17110.0,
178,658.0,1589.0,630.0,17123.0,
179,574.0,1622.0,607.0,17197.0,
180,524.0,1741.0,530.0,17205.0,
181,427.0,1750.0,551.0,17272.0,
182,395.0,1759.0,478.0,17368.0,
183,322.0,1709.0,497.0,17472.0,
184,359.0,1636.0,471.0,17534.0,
185,428.0,1628.0,426.0,17518.0,
186,494.0,1595.0,397.0,17514.0,
187,485.0,1535.0,504.0,17476.0,
188,530.0,1448.0,511.0,17511.0,
189,533.0,1491.0,418.0,17558.0,
190,653.0,1476.0,356.0,17515.0,
191,618.0,1480.0,334.0,17568.0,
192,635.0,1391.0,321.0,17653.0,
193,609.0,1189.0,399.0,17803.0,
194,683.0,1143.0,297.0,17877.0,
195,697.0,1083.0,319.0,17901.0,
196,689.0,1076.0,383.0,17852.0,
197,743.0,1016.0,370.0,17871.0,
198,725.0,1023.0,379.0,17873.0,
199,763.0,1020.0,371.0,17846.0,
200,796.0,922.0,361.0,17921.0,
201,811.0,907.0,336.0,17946.0,
202,829.0,876.0,389.0,17906.0,
203,850.0,837.0,341.0,17972.0,
204,858.0,892.0,337.0,17913.0,
205,922.0,843.0,355.0,17880.0,
206,952.0,856.0,330.0,17862.0,
207,1002.0,730.0,391.0,17877.0,
208,1003.0,716.0,402.0,17879.0,
209,1051.0,694.0,430.0,17825.0,
210,1065.0,650.0,463.0,17822.0,
211,1094.0,696.0,467.0,17743.0,
212,1124.0,706.0,438.0,17732.0,
213,1112.0,750.0,417.0,17721.0,
214,1122.0,811.0,338.0,17729.0,
215,1135.0,761.0,381.0,17723.0,
216,1134.0,764.0,407.0,17695.0,
217,1179.0,701.0,432.0,17688.0,
218,1233.0,707.0,478.0,17582.0,
219,1355.0,723.0,464.0,17458.0,
220,1418.0,781.0,476.0,17325.0,
221,1414.0,828.0,447.0,17311.0,
222,1421.0,847.0,484.0,17248.0,
223,1376.0,873.0,584.0,17167.0,
224,1289.0,903.0,650.0,17158.0,
225,1249.0,1029.0,614.0,17108.0,
226,1090.0,1129.0,673.0,17108.0,
227,970.0,1300.0,647.0,17083.0,
228,865.0,1435.0,572.0,17128.0,
229,780.0,1427.0,651.0,17142.0,
230,660.0,1393.0,758.0,17189.0,
231,598.0,1374.0,694.0,17334.0,
232,556.0,1329.0,694.0,17421.0,
233,520.0,1322.0,589.0,17569.0,
234,572.0,1375.0,485.0,17568.0,
235,578.0,1349.0,516.0,17557.0,
236,585.0,1309.0,451.0,17655.0,
237,619.0,1138.0,417.0,17826.0,
238,751.0,991.0,391.0,17867.0,
239,788.0,998.0,355.0,17859.0,
240,857.0,924.0,371.0,17848.0,
241,898.0,886.0,340.0,17876.0,
242,920.0,824.0,308.0,17948.0,
243,939.0,799.0,290.0,17972.0,
244,897.0,738.0,394.0,17971.0,
245,937.0,846.0,302.0,17915.0,
246,928.0,785.0,350.0,17937.0,
247,1001.0,686.0,359.0,17954.0,
248,1018.0,669.0,351.0,17962.0,
249,986.0,710.0,330.0,17974.0,
250,962.0,746.0,299.0,17993.0,
251,985.0,689.0,349.0,17977.0,
252,1020.0,599.0,358.0,18023.0,
253,1024.0,560.0,347.0,18069.0,
254,1057.0,532.0,369.0,18042.0,
255,1063.0,593.0,318.0,18026.0,
256,1016.0,615.0,320.0,18049.0,
257,1020.0,611.0,327.0,18042.0,
258,1071.0,585.0,343.0,18001.0,
259,1039.0,481.0,341.0,18139.0,
260,1129.0,508.0,326.0,18037.0,
261,1102.0,494.0,322.0,18082.0,
262,1181.0,476.0,305.0,18038.0,
263,1167.0,469.0,280.0,18084.0,
264,1223.0,412.0,251.0,18114.0,
265,1230.0,386.0,264.0,18120.0,
266,1304.0,318.0,301.0,18077.0,
267,1367.0,302.0,305.0,18026.0,
268,1408.0,295.0,288.0,18009.0,
269,1472.0,360.0,220.0,17948.0,
270,1561.0,367.0,206.0,17866.0,
271,1649.0,337.0,291.0,17723.0,
272,1677.0,335.0,320.0,17668.0,
273,1735.0,410.0,292.0,17563.0,
274,1713.0,456.0,316.0,17515.0,
275,1704.0,444.0,333.0,17519.0,
276,1649.0,429.0,401.0,17521.0,
277,1651.0,490.0,384.0,17475.0,
278,1636.0,521.0,372.0,17471.0,
279,1607.0,509.0,394.0,17490.0,
280,1573.0,482.0,385.0,17560.0,
281,1567.0,458.0,401.0,17574.0,
282,1564.0,527.0,392.0,17517.0,
283,1539.0,450.0,456.0,17555.0,
284,1498.0,531.0,447.0,17524.0,
285,1490.0,493.0,503.0,17514.0,
286,1465.0,512.0,511.0,17512.0,
287,1491.0,520.0,494.0,17495.0,
288,1470.0,530.0,496.0,17504.0,
289,1454.0,614.0,421.0,17511.0,
290,1412.0,581.0,475.0,17532.0,
291,1520.0,555.0,523.0,17402.0,
292,1543.0,592.0,564.0,17301.0,
293,1577.0,648.0,518.0,17257.0,
294,1553.0,739.0,466.0,17242.0,
295,1532.0,710.0,484.0,17274.0,
296,1442.0,754.0,501.0,17303.0,
297,1389.0,711.0,591.0,17309.0,
298,1369.0,803.0,564.0,17264.0,
299,1351.0,944.0,511.0,17194.0,
300,1280.0,982.0,578.0,17160.0,
301,1293.0,996.0,645.0,17066.0,
302,1184.0,1134.0,617.0,17065.0,
303,1121.0,1118.0,586.0,17175.0,
304,1088.0,1219.0,542.0,17151.0,
305,1053.0,1175.0,566.0,17206.0,
306,996.0,1215.0,545.0,17244.0,
307,892.0,1189.0,555.0,17364.0,
308,862.0,1118.0,563.0,17457.0,
309,825.0,1227.0,452.0,17496.0,
310,815.0,1203.0,432.0,17550.0,
311,777.0,1123.0,459.0,17641.0,
312,818.0,1124.0,481.0,17577.0,
313,816.0,1176.0,430.0,17578.0,
314,914.0,1148.0,414.0,17524.0,
315,930.0,1128.0,416.0,17526.0,
316,991.0,1080.0,420.0,17509.0,
317,1053.0,974.0,574.0,17399.0,
318,1115.0,1088.0,496.0,17301.0,
319,1091.0,1115.0,590.0,17204.0,
320,1090.0,1149.0,612.0,17149.0,
321,1148.0,1099.0,656.0,17097.0,
322,1203.0,1113.0,709.0,16975.0,
323,1365.0,1167.0,708.0,16760.0,
324,1375.0,1214.0,700.0,16711.0,
325,1618.0,1408.0,608.0,16366.0,
326,1607.0,1480.0,746.0,16167.0,
327,1653.0,1627.0,718.0,16002.0,
328,1552.0,1760.0,896.0,15792.0,
329,1432.0,1821.0,1113.0,15634.0,
330,1241.0,1990.0,1107.0,15662.0,
331,1047.0,2116.0,1107.0,15730.0,
332,934.0,2115.0,1116.0,15835.0,
333,810.0,2409.0,982.0,15799.0,
334,704.0,2476.0,895.0,15925.0,
335,590.0,2518.0,911.0,15981.0,
336,548.0,2539.0,909.0,16004.0,
337,484.0,2479.0,791.0,16246.0,
338,429.0,2471.0,720.0,16380.0,
339,371.0,2403.0,706.0,16520.0,
340,331.0,2300.0,683.0,16686.0,
341,298.0,2213.0,662.0,16827.0,
342,350.0,2130.0,561.0,16959.0,
343,368.0,1881.0,505.0,17246.0,
344,407.0,1883.0,371.0,17339.0,
345,437.0,1740.0,345.0,17478.0,
346,396.0,1649.0,395.0,17560.0,
347,368.0,1575.0,374.0,17683.0,
348,399.0,1585.0,310.0,17706.0,
349,442.0,1519.0,320.0,17719.0,
350,406.0,1419.0,396.0,17779.0,
351,447.0,1327.0,355.0,17871.0,
352,475.0,1312.0,323.0,17890.0,
353,610.0,1168.0,323.0,17899.0,
354,713.0,1068.0,331.0,17888.0,
355,680.0,1017.0,410.0,17893.0,
356,709.0,984.0,393.0,17914.0,
357,730.0,917.0,452.0,17901.0,
358,790.0,949.0,399.0,17862.0,
359,777.0,907.0,429.0,17887.0,
360,792.0,960.0,391.0,17857.0,
361,808.0,920.0,422.0,17850.0,
362,798.0,963.0,405.0,17834.0,
363,896.0,950.0,434.0,17720.0,
364,1054.0,1008.0,438.0,17500.0,
365,1161.0,981.0,420.0,17438.0,
366,1289.0,942.0,479.0,17290.0,
367,1250.0,916.0,462.0,17372.0,
368,1160.0,975.0,522.0,17343.0,
369,1139.0,981.0,538.0,17342.0,
370,1110.0,864.0,646.0,17380.0,
371,1106.0,989.0,574.0,17331.0,
372,1055.0,1002.0,633.0,17310.0,
373,1015.0,980.0,580.0,17425.0,
374,1084.0,987.0,572.0,17357.0,
375,1038.0,901.0,553.0,17508.0,
376,1043.0,929.0,455.0,17573.0,
377,1022.0,879.0,525.0,17574.0,
378,998.0,879.0,532.0,17591.0,
379,986.0,877.0,559.0,17578.0,
380,992.0,888.0,506.0,17614.0,
381,1028.0,869.0,432.0,17671.0,
382,1053.0,807.0,472.0,17668.0,
383,1113.0,771.0,517.0,17599.0,
384,1100.0,807.0,480.0,17613.0,
385,1168.0,834.0,449.0,17549.0,
386,1208.0,735.0,522.0,17535.0,
387,1242.0,750.0,500.0,17508.0,
388,1180.0,753.0,535.0,17532.0,
389,1196.0,755.0,502.0,17547.0,
390,1194.0,813.0,414.0,17579.0,
391,1106.0,770.0,489.0,17635.0,
392,1105.0,775.0,431.0,17689.0,
393,1089.0,819.0,380.0,17712.0,
394,1024.0,786.0,457.0,17733.0,
395,986.0,773.0,471.0,17770.0,
396,1000.0,762.0,439.0,17799.0,
397,999.0,769.0,501.0,17731.0,
398,992.0,799.0,487.0,17722.0,
399,977.0,812.0,451.0,17760.0,
400,938.0,871.0,430.0,17761.0,
401,909.0,843.0,423.0,17825.0,
402,916.0,776.0,466.0,17842.0,
403,922.0,773.0,474.0,17831.0,
404,906.0,781.0,466.0,17847.0,
405,921.0,752.0,435.0,17892.0,
406,917.0,790.0,422.0,17871.0,
407,923.0,813.0,429.0,17835.0,
408,973.0,752.0,447.0,17828.0,
409,968.0,787.0,401.0,17844.0,
410,963.0,737.0,424.0,17876.0,
411,984.0,723.0,398.0,17895.0,
412,1023.0,751.0,395.0,17831.0,
413,1074.0,736.0,426.0,17764.0,
414,1040.0,737.0,474.0,17749.0,
415,1034.0,755.0,447.0,17764.0,
416,1021.0,786.0,426.0,17767.0,
417,1009.0,777.0,458.0,17756.0,
418,1027.0,766.0,496.0,17711.0,
419,1046.0,790.0,506.0,17658.0,
420,985.0,786.0,518.0,17711.0,
421,979.0,867.0,479.0,17675.0,
422,964.0,835.0,522.0,17679.0,
423,933.0,843.0,483.0,17741.0,
424,946.0,879.0,466.0,17709.0,
425,955.0,898.0,492.0,17655.0,
426,951.0,841.0,487.0,17721.0,
427,957.0,868.0,458.0,17717.0,
428,952.0,873.0,527.0,17648.0,
429,1000.0,946.0,507.0,17547.0,
430,1042.0,972.0,493.0,17493.0,
431,1053.0,972.0,519.0,17456.0,
432,1043.0,968.0,549.0,17440.0,
433,1042.0,1010.0,632.0,17316.0,
434,1015.0,1035.0,566.0,17384.0,
435,985.0,1156.0,490.0,17369.0,
436,910.0,1203.0,564.0,17323.0,
437,858.0,1181.0,551.0,17410.0,
438,812.0,1178.0,577.0,17433.0,
439,795.0,1156.0,582.0,17467.0,
440,766.0,1180.0,532.0,17522.0,
441,711.0,1189.0,541.0,17559.0,
442,687.0,1243.0,489.0,17581.0,
443,644.0,1236.0,492.0,17628.0,
444,619.0,1226.0,456.0,17699.0,
445,604.0,1193.0,412.0,17791.0,
446,602.0,1044.0,427.0,17927.0,
447,610.0,988.0,445.0,17957.0,
448,617.0,875.0,448.0,18060.0,
449,596.0,878.0,389.0,18137.0,
450,624.0,827.0,328.0,18221.0,
451,643.0,730.0,317.0,18310.0,
452,665.0,671.0,291.0,18373.0,
453,719.0,637.0,267.0,18377.0,
454,734.0,552.0,294.0,18420.0,
455,769.0,482.0,277.0,18472.0,
456,827.0,455.0,270.0,18448.0,
457,864.0,424.0,256.0,18456.0,
458,900.0,392.0,236.0,18472.0,
459,943.0,377.0,220.0,18460.0,
460,975.0,343.0,208.0,18474.0,
461,1082.0,333.0,206.0,18379.0,
462,1101.0,302.0,181.0,18416.0,
463,1160.0,283.0,197.0,18360.0,
464,1303.0,287.0,206.0,18204.0,
465,1488.0,262.0,210.0,18040.0,
466,1607.0,283.0,210.0,17900.0,
467,1668.0,254.0,200.0,17878.0,
468,1759.0,258.0,229.0,17754.0,
469,1807.0,266.0,229.0,17698.0,
470,1867.0,257.0,283.0,17593.0,
471,1931.0,288.0,232.0,17549.0,
472,2018.0,281.0,236.0,17465.0,
473,2030.0,282.0,276.0,17412.0,
474,2147.0,269.0,276.0,17308.0,
475,2211.0,332.0,283.0,17174.0,
476,2228.0,348.0,308.0,17116.0,
477,2287.0,350.0,332.0,17031.0,
478,2341.0,387.0,333.0,16939.0,
479,2353.0,400.0,344.0,16903.0,
480,2316.0,390.0,392.0,16902.0,
481,2347.0,438.0,465.0,16750.0,
482,2373.0,497.0,507.0,16623.0,
483,2324.0,533.0,638.0,16505.0,
484,2337.0,623.0,601.0,16439.0,
485,2238.0,727.0,712.0,16323.0,
486,2172.0,861.0,754.0,16213.0,
487,2040.0,1028.0,748.0,16184.0,
488,1901.0,1029.0,922.0,16148.0,
489,1761.0,1136.0,1023.0,16080.0,
490,1644.0,1304.0,947.0,16105.0,
491,1419.0,1514.0,954.0,16113.0,
492,1231.0,1624.0,951.0,16194.0,
493,1062.0,1757.0,994.0,16187.0,
494,934.0,1832.0,952.0,16282.0,
495,827.0,1936.0,904.0,16333.0,
496,746.0,1969.0,744.0,16541.0,
497,641.0,2017.0,802.0,16540.0,
498,587.0,2115.0,747.0,16551.0,
499,498.0,2230.0,738.0,16534.0,
500,497.0,2170.0,724.0,16609.0,
501,470.0,2226.0,613.0,16691.0,
502,448.0,2111.0,593.0,16848.0,
503,400.0,2071.0,573.0,16956.0,
504,395.0,2011.0,502.0,17092.0,
505,536.0,1954.0,499.0,17011.0,
506,542.0,1936.0,495.0,17027.0,
507,492.0,1834.0,576.0,17098.0,
508,458.0,1811.0,608.0,17123.0,
509,447.0,1747.0,615.0,17191.0,
510,465.0,1722.0,589.0,17224.0,
511,484.0,1783.0,493.0,17240.0,
512,632.0,1744.0,422.0,17202.0,
513,572.0,1630.0,509.0,17289.0,
514,516.0,1477.0,582.0,17425.0,
515,500.0,1398.0,623.0,17479.0,
516,528.0,1251.0,623.0,17598.0,
517,556.0,1244.0,588.0,17612.0,
518,555.0,1244.0,483.0,17718.0,
519,557.0,1151.0,418.0,17874.0,
520,571.0,1086.0,408.0,17935.0,
521,601.0,1028.0,405.0,17966.0,
522,603.0,955.0,387.0,18055.0,
523,647.0,888.0,387.0,18078.0,
524,678.0,849.0,381.0,18092.0,
525,773.0,816.0,377.0,18034.0,
526,865.0,821.0,360.0,17954.0,
527,979.0,811.0,345.0,17865.0,
528,1088.0,755.0,346.0,17811.0,
529,1237.0,727.0,356.0,17680.0,
530,1326.0,674.0,380.0,17620.0,
531,1306.0,635.0,457.0,17602.0,
532,1441.0,694.0,378.0,17487.0,
533,1612.0,689.0,432.0,17267.0,
534,1606.0,666.0,510.0,17218.0,
535,1718.0,758.0,468.0,17056.0,
536,1755.0,805.0,522.0,16918.0,
537,1712.0,882.0,558.0,16848.0,
538,1682.0,894.0,599.0,16825.0,
539,1601.0,995.0,549.0,16855.0,
540,1554.0,1039.0,519.0,16888.0,
541,1536.0,1100.0,567.0,16797.0,
542,1435.0,1134.0,649.0,16782.0,
543,1335.0,1095.0,734.0,16836.0,
544,1284.0,1218.0,577.0,16921.0,
545,1248.0,1135.0,611.0,17006.0,
546,1153.0,1107.0,619.0,17121.0,
547,1073.0,1084.0,694.0,17149.0,
548,1054.0,1222.0,595.0,17129.0,
549,1072.0,1098.0,586.0,17244.0,
550,1075.0,1119.0,617.0,17189.0,
551,1051.0,1140.0,546.0,17263.0,
552,1046.0,1187.0,529.0,17238.0,
553,1039.0,1274.0,478.0,17209.0,
554,960.0,1177.0,527.0,17336.0,
555,900.0,1154.0,532.0,17414.0,
556,873.0,1067.0,443.0,17617.0,
557,865.0,1046.0,494.0,17595.0,
558,984.0,1062.0,409.0,17545.0,
559,1026.0,1037.0,407.0,17530.0,
560,1044.0,1020.0,342.0,17594.0,
561,942.0,978.0,430.0,17650.0,
562,875.0,1048.0,436.0,17641.0,
563,862.0,1056.0,429.0,17653.0,
564,810.0,1007.0,467.0,17716.0,
565,794.0,1098.0,394.0,17714.0,
566,812.0,1038.0,373.0,17777.0,
567,796.0,1017.0,440.0,17747.0,
568,818.0,990.0,393.0,17799.0,
569,829.0,1005.0,388.0,17778.0,
570,793.0,992.0,419.0,17796.0,
571,787.0,1098.0,325.0,17790.0,
572,755.0,1071.0,377.0,17797.0,
573,785.0,971.0,450.0,17794.0,
574,833.0,960.0,425.0,17782.0,
575,825.0,902.0,460.0,17813.0,
576,862.0,802.0,442.0,17894.0,
577,906.0,831.0,457.0,17806.0,
578,930.0,833.0,480.0,17757.0,
579,957.0,821.0,523.0,17699.0,
580,975.0,890.0,423.0,17712.0,
581,982.0,903.0,412.0,17703.0,
582,936.0,925.0,468.0,17671.0,
583,914.0,902.0,512.0,17672.0,
584,933.0,911.0,538.0,17618.0,
585,895.0,1019.0,436.0,17650.0,
586,845.0,1020.0,479.0,17656.0,
587,864.0,1084.0,412.0,17640.0,
588,1006.0,1056.0,444.0,17494.0,
589,989.0,1061.0,440.0,17510.0,
590,988.0,1011.0,398.0,17603.0,
591,1006.0,1023.0,430.0,17541.0,
592,1051.0,964.0,393.0,17592.0,
593,1096.0,978.0,425.0,17501.0,
594,1077.0,943.0,441.0,17539.0,
595,1106.0,883.0,426.0,17585.0,
596,1058.0,863.0,494.0,17585.0,
597,1042.0,932.0,414.0,17612.0,
598,1038.0,882.0,480.0,17600.0,
599,1102.0,922.0,450.0,17526.0,
600,1100.0,929.0,502.0,17469.0,
601,1078.0,995.0,488.0,17439.0,
602,1078.0,937.0,560.0,17425.0,
603,1075.0,958.0,574.0,17393.0,
604,1069.0,947.0,530.0,17454.0,
605,1061.0,978.0,503.0,17458.0,
606,1069.0,938.0,584.0,17409.0,
607,1055.0,963.0,561.0,17421.0,
608,1038.0,986.0,529.0,17447.0,
609,1116.0,905.0,559.0,17420.0,
610,1130.0,964.0,575.0,17331.0,
611,1103.0,915.0,674.0,17308.0,
612,1108.0,1009.0,599.0,17284.0,
613,1070.0,1063.0,538.0,17329.0,
614,1026.0,1137.0,462.0,17375.0,
615,960.0,1092.0,491.0,17457.0,
616,890.0,998.0,575.0,17537.0,
617,895.0,897.0,523.0,17685.0,
618,883.0,887.0,524.0,17706.0,
619,928.0,935.0,398.0,17739.0,
620,913.0,920.0,398.0,17769.0,
621,940.0,827.0,434.0,17799.0,
622,1006.0,756.0,382.0,17856.0,
623,1042.0,708.0,380.0,17870.0,
624,1081.0,686.0,377.0,17856.0,
625,1240.0,634.0,426.0,17700.0,
626,1321.0,686.0,359.0,17634.0,
627,1372.0,658.0,367.0,17603.0,
628,1404.0,625.0,419.0,17552.0,
629,1342.0,672.0,442.0,17544.0,
630,1359.0,677.0,469.0,17495.0,
631,1394.0,729.0,430.0,17447.0,
632,1376.0,688.0,440.0,17496.0,
633,1351.0,722.0,433.0,17494.0,
634,1363.0,776.0,429.0,17432.0,
635,1326.0,776.0,455.0,17443.0,
636,1326.0,766.0,426.0,17482.0,
637,1369.0,745.0,462.0,17424.0,
638,1379.0,773.0,411.0,17437.0,
639,1434.0,752.0,491.0,17323.0,
640,1474.0,738.0,516.0,17272.0,
641,1556.0,853.0,552.0,17039.0,
642,1639.0,844.0,672.0,16845.0,
643,1821.0,929.0,674.0,16576.0,
644,1931.0,1015.0,771.0,16283.0,
645,1899.0,1231.0,756.0,16114.0,
646,1857.0,1295.0,1059.0,15789.0,
647,1780.0,1507.0,1100.0,15613.0,
648,1510.0,1631.0,1251.0,15608.0,
649,1307.0,1832.0,1242.0,15619.0,
650,1124.0,1885.0,1271.0,15720.0,
651,1044.0,2133.0,1122.0,15701.0,
652,890.0,2274.0,1091.0,15745.0,
653,814.0,2241.0,1088.0,15857.0,
654,715.0,2080.0,1260.0,15945.0,
655,767.0,2111.0,1284.0,15838.0,
656,682.0,2206.0,1223.0,15889.0,
657,657.0,2286.0,1115.0,15942.0,
658,647.0,2344.0,916.0,16093.0,
659,539.0,2355.0,920.0,16186.0,
660,503.0,2242.0,887.0,16368.0,
661,508.0,2339.0,749.0,16404.0,
662,503.0,2258.0,611.0,16628.0,
663,446.0,2071.0,654.0,16829.0,
664,448.0,2018.0,551.0,16983.0,
665,428.0,1967.0,487.0,17118.0,
666,429.0,1901.0,477.0,17193.0,
667,428.0,1597.0,472.0,17503.0,
668,467.0,1466.0,423.0,17644.0,
669,485.0,1347.0,426.0,17742.0,
670,543.0,1244.0,415.0,17798.0,
671,584.0,1211.0,398.0,17807.0,
672,630.0,1130.0,403.0,17837.0,
673,643.0,1130.0,380.0,17847.0,
674,652.0,1103.0,365.0,17880.0,
675,681.0,1067.0,405.0,17847.0,
676,683.0,1047.0,392.0,17878.0,
677,690.0,1055.0,413.0,17842.0,
678,701.0,1069.0,377.0,17853.0,
679,719.0,1052.0,394.0,17835.0,
680,758.0,1065.0,415.0,17762.0,
681,791.0,988.0,439.0,17782.0,
682,803.0,1065.0,338.0,17794.0,
683,806.0,1023.0,346.0,17825.0,
684,771.0,1001.0,419.0,17809.0,
685,737.0,1006.0,446.0,17811.0,
686,742.0,1078.0,399.0,17781.0,
687,705.0,1086.0,398.0,17811.0,
688,711.0,998.0,436.0,17855.0,
689,717.0,922.0,444.0,17917.0,
690,708.0,895.0,505.0,17892.0,
691,717.0,897.0,466.0,17920.0,
692,744.0,862.0,415.0,17979.0,
693,741.0,802.0,364.0,18093.0,
694,747.0,807.0,369.0,18077.0,
695,761.0,796.0,329.0,18114.0,
696,780.0,746.0,341.0,18133.0,
697,859.0,742.0,348.0,18051.0,
698,873.0,720.0,329.0,18078.0,
699,903.0,679.0,387.0,18031.0,
700,898.0,677.0,418.0,18007.0,
701,910.0,656.0,420.0,18014.0,
702,884.0,692.0,436.0,17988.0,
703,883.0,705.0,412.0,18000.0,
704,885.0,697.0,419.0,17999.0,
705,849.0,697.0,422.0,18032.0,
706,878.0,717.0,427.0,17978.0,
707,897.0,762.0,395.0,17946.0,
708,928.0,763.0,384.0,17925.0,
709,1002.0,719.0,409.0,17870.0,
710,981.0,754.0,453.0,17812.0,
711,1056.0,717.0,514.0,17713.0,
712,1066.0,775.0,517.0,17642.0,
713,1092.0,835.0,430.0,17643.0,
714,1090.0,822.0,404.0,17684.0,
715,1043.0,868.0,477.0,17612.0,
716,1063.0,932.0,517.0,17488.0,
717,1019.0,926.0,620.0,17435.0,
718,978.0,1042.0,494.0,17486.0,
719,961.0,1079.0,490.0,17470.0,
720,919.0,1072.0,548.0,17461.0,
721,870.0,1123.0,498.0,17509.0,
722,867.0,1072.0,561.0,17500.0,
723,886.0,1063.0,542.0,17509.0,
724,940.0,1034.0,580.0,17446.0,
725,966.0,1111.0,517.0,17406.0,
726,981.0,1072.0,540.0,17407.0,
727,981.0,1133.0,541.0,17345.0,
728,961.0,1154.0,562.0,17323.0,
729,940.0,1113.0,561.0,17386.0,
730,910.0,1125.0,534.0,17431.0,
