jour,S,I,E,R,
0,19980.0,20.0,0.0,0.0,
1,19962.0,20.0,18.0,0.0,
2,19907.0,23.0,70.0,0.0,
3,19787.0,46.0,167.0,0.0,
4,19563.0,91.0,346.0,0.0,
5,19167.0,183.0,642.0,8.0,
6,18336.0,397.0,1254.0,13.0,
7,16971.0,590.0,2374.0,65.0,
8,15051.0,1291.0,3539.0,119.0,
9,11386.0,2189.0,6023.0,402.0,
10,7340.0,3587.0,8396.0,677.0,
11,3123.0,5864.0,10093.0,920.0,
12,683.0,8065.0,9617.0,1635.0,
13,151.0,10572.0,7048.0,2229.0,
14,43.0,11361.0,4984.0,3612.0,
15,2.0,10775.0,3504.0,5719.0,
16,2.0,9774.0,2737.0,7487.0,
17,74.0,9102.0,2207.0,8617.0,
18,69.0,8128.0,1837.0,9966.0,
19,45.0,6631.0,1778.0,11546.0,
20,101.0,5811.0,1565.0,12523.0,
21,62.0,5224.0,1568.0,13146.0,
22,27.0,4329.0,1529.0,14115.0,
23,32.0,3941.0,1347.0,14680.0,
24,26.0,3912.0,1057.0,15005.0,
25,16.0,3471.0,880.0,15633.0,
26,7.0,3383.0,673.0,15937.0,
27,12.0,3509.0,335.0,16144.0,
28,53.0,2863.0,309.0,16775.0,
29,80.0,2579.0,227.0,17114.0,
30,135.0,2271.0,130.0,17464.0,
31,187.0,2150.0,150.0,17513.0,
32,180.0,2001.0,115.0,17704.0,
33,291.0,1929.0,147.0,17633.0,
34,335.0,1787.0,210.0,17668.0,
35,341.0,1616.0,146.0,17897.0,
36,343.0,1688.0,146.0,17823.0,
37,285.0,1519.0,130.0,18066.0,
38,285.0,1383.0,134.0,18198.0,
39,257.0,1424.0,92.0,18227.0,
40,238.0,1313.0,115.0,18334.0,
41,199.0,1154.0,90.0,18557.0,
42,222.0,1132.0,62.0,18584.0,
43,190.0,1082.0,102.0,18626.0,
44,194.0,1054.0,86.0,18666.0,
45,155.0,934.0,116.0,18795.0,
46,132.0,911.0,94.0,18863.0,
47,137.0,838.0,80.0,18945.0,
48,134.0,720.0,46.0,19100.0,
49,134.0,634.0,18.0,19214.0,
50,134.0,544.0,7.0,19315.0,
51,161.0,369.0,5.0,19465.0,
52,207.0,300.0,9.0,19484.0,
53,208.0,200.0,7.0,19585.0,
54,243.0,45.0,19.0,19693.0,
55,271.0,35.0,16.0,19678.0,
56,284.0,21.0,14.0,19681.0,
57,310.0,33.0,2.0,19655.0,
58,338.0,33.0,1.0,19628.0,
59,384.0,19.0,1.0,19596.0,
60,394.0,18.0,3.0,19585.0,
61,568.0,7.0,3.0,19422.0,
62,578.0,3.0,3.0,19416.0,
63,692.0,5.0,1.0,19302.0,
64,777.0,6.0,1.0,19216.0,
65,803.0,3.0,1.0,19193.0,
66,874.0,3.0,3.0,19120.0,
67,1127.0,4.0,2.0,18867.0,
68,1147.0,4.0,1.0,18848.0,
69,1247.0,4.0,2.0,18747.0,
70,1319.0,4.0,2.0,18675.0,
71,1360.0,4.0,1.0,18635.0,
72,1448.0,2.0,1.0,18549.0,
73,1532.0,1.0,1.0,18466.0,
74,1538.0,1.0,1.0,18460.0,
75,1560.0,1.0,1.0,18438.0,
76,1600.0,1.0,1.0,18398.0,
77,1601.0,2.0,1.0,18396.0,
78,1603.0,1.0,1.0,18395.0,
79,1603.0,1.0,1.0,18395.0,
80,1603.0,0.0,1.0,18396.0,
81,1603.0,0.0,1.0,18396.0,
82,1633.0,1.0,1.0,18365.0,
83,1636.0,1.0,1.0,18362.0,
84,1636.0,1.0,1.0,18362.0,
85,1646.0,1.0,2.0,18351.0,
86,1662.0,2.0,1.0,18335.0,
87,1711.0,1.0,1.0,18287.0,
88,1849.0,1.0,1.0,18149.0,
89,1859.0,1.0,1.0,18139.0,
90,1858.0,2.0,1.0,18139.0,
91,1860.0,2.0,1.0,18137.0,
92,1870.0,2.0,3.0,18125.0,
93,1870.0,2.0,4.0,18124.0,
94,1869.0,6.0,1.0,18124.0,
95,1880.0,4.0,6.0,18110.0,
96,1880.0,5.0,5.0,18110.0,
97,1957.0,6.0,5.0,18032.0,
98,1984.0,7.0,7.0,18002.0,
99,2120.0,6.0,9.0,17865.0,
100,2117.0,10.0,8.0,17865.0,
101,2149.0,10.0,8.0,17833.0,
102,2159.0,13.0,9.0,17819.0,
103,2280.0,11.0,12.0,17697.0,
104,2311.0,13.0,13.0,17663.0,
105,2457.0,16.0,13.0,17514.0,
106,2701.0,20.0,15.0,17264.0,
107,2918.0,26.0,31.0,17025.0,
108,3091.0,39.0,28.0,16842.0,
109,3243.0,38.0,32.0,16687.0,
110,3341.0,46.0,44.0,16569.0,
111,3407.0,53.0,58.0,16482.0,
112,3449.0,69.0,57.0,16425.0,
113,3425.0,84.0,87.0,16404.0,
114,3367.0,94.0,120.0,16419.0,
115,3341.0,120.0,174.0,16365.0,
116,3287.0,152.0,201.0,16360.0,
117,3218.0,172.0,249.0,16361.0,
118,3159.0,222.0,273.0,16346.0,
119,3053.0,279.0,292.0,16376.0,
120,2964.0,329.0,313.0,16394.0,
121,2797.0,338.0,430.0,16435.0,
122,2670.0,413.0,456.0,16461.0,
123,2444.0,515.0,548.0,16493.0,
124,2327.0,557.0,623.0,16493.0,
125,2212.0,680.0,678.0,16430.0,
126,2061.0,718.0,783.0,16438.0,
127,1972.0,744.0,908.0,16376.0,
128,1823.0,917.0,810.0,16450.0,
129,1815.0,1067.0,873.0,16245.0,
130,1676.0,1245.0,878.0,16201.0,
131,1415.0,1330.0,882.0,16373.0,
132,1049.0,1423.0,995.0,16533.0,
133,868.0,1449.0,944.0,16739.0,
134,831.0,1381.0,967.0,16821.0,
135,723.0,1458.0,816.0,17003.0,
136,619.0,1484.0,700.0,17197.0,
137,557.0,1373.0,679.0,17391.0,
138,491.0,1331.0,710.0,17468.0,
139,538.0,1104.0,719.0,17639.0,
140,494.0,1037.0,636.0,17833.0,
141,548.0,1062.0,498.0,17892.0,
142,501.0,1077.0,491.0,17931.0,
143,397.0,1165.0,425.0,18013.0,
144,331.0,1167.0,328.0,18174.0,
145,291.0,1157.0,281.0,18271.0,
146,324.0,1152.0,184.0,18340.0,
147,301.0,1083.0,185.0,18431.0,
148,307.0,996.0,116.0,18581.0,
149,356.0,891.0,115.0,18638.0,
150,382.0,822.0,92.0,18704.0,
151,474.0,755.0,109.0,18662.0,
152,523.0,720.0,150.0,18607.0,
153,540.0,725.0,127.0,18608.0,
154,543.0,678.0,187.0,18592.0,
155,563.0,663.0,195.0,18579.0,
156,575.0,670.0,210.0,18545.0,
157,702.0,669.0,171.0,18458.0,
158,727.0,614.0,213.0,18446.0,
159,714.0,626.0,159.0,18501.0,
160,696.0,538.0,193.0,18573.0,
161,689.0,509.0,200.0,18602.0,
162,635.0,475.0,176.0,18714.0,
163,592.0,448.0,239.0,18721.0,
164,623.0,476.0,254.0,18647.0,
165,668.0,469.0,251.0,18612.0,
166,661.0,457.0,279.0,18603.0,
167,642.0,414.0,260.0,18684.0,
168,827.0,378.0,259.0,18536.0,
169,924.0,330.0,306.0,18440.0,
170,944.0,325.0,278.0,18453.0,
171,944.0,252.0,290.0,18514.0,
172,1003.0,252.0,255.0,18490.0,
173,983.0,274.0,256.0,18487.0,
174,1017.0,229.0,243.0,18511.0,
175,1044.0,194.0,229.0,18533.0,
176,1057.0,176.0,225.0,18542.0,
177,1053.0,191.0,205.0,18551.0,
178,1131.0,219.0,184.0,18466.0,
179,1195.0,226.0,195.0,18384.0,
180,1446.0,242.0,196.0,18116.0,
181,1447.0,275.0,195.0,18083.0,
182,1581.0,318.0,240.0,17861.0,
183,1681.0,354.0,281.0,17684.0,
184,1701.0,342.0,265.0,17692.0,
185,1764.0,345.0,281.0,17610.0,
186,1845.0,345.0,319.0,17491.0,
187,1887.0,411.0,320.0,17382.0,
188,1877.0,316.0,439.0,17368.0,
189,1919.0,368.0,465.0,17248.0,
190,1993.0,433.0,484.0,17090.0,
191,1995.0,452.0,530.0,17023.0,
192,1995.0,495.0,530.0,16980.0,
193,1877.0,503.0,601.0,17019.0,
194,1756.0,535.0,663.0,17046.0,
195,1694.0,544.0,700.0,17062.0,
196,1586.0,538.0,797.0,17079.0,
197,1551.0,514.0,771.0,17164.0,
198,1531.0,619.0,693.0,17157.0,
199,1466.0,656.0,714.0,17164.0,
200,1490.0,709.0,718.0,17083.0,
201,1402.0,734.0,693.0,17171.0,
202,1397.0,714.0,675.0,17214.0,
203,1400.0,662.0,719.0,17219.0,
204,1367.0,709.0,820.0,17104.0,
205,1414.0,703.0,745.0,17138.0,
206,1435.0,715.0,749.0,17101.0,
207,1325.0,824.0,728.0,17123.0,
208,1340.0,954.0,814.0,16892.0,
209,1212.0,1006.0,894.0,16888.0,
210,1143.0,1042.0,899.0,16916.0,
211,1056.0,1165.0,821.0,16958.0,
212,996.0,1271.0,713.0,17020.0,
213,902.0,1302.0,760.0,17036.0,
214,793.0,1361.0,779.0,17067.0,
215,706.0,1432.0,695.0,17167.0,
216,698.0,1468.0,606.0,17228.0,
217,671.0,1548.0,527.0,17254.0,
218,664.0,1639.0,425.0,17272.0,
219,670.0,1636.0,422.0,17272.0,
220,644.0,1590.0,464.0,17302.0,
221,672.0,1546.0,446.0,17336.0,
222,710.0,1520.0,510.0,17260.0,
223,746.0,1554.0,605.0,17095.0,
224,708.0,1542.0,671.0,17079.0,
225,680.0,1593.0,641.0,17086.0,
226,622.0,1573.0,636.0,17169.0,
227,631.0,1636.0,547.0,17186.0,
228,603.0,1623.0,544.0,17230.0,
229,799.0,1709.0,445.0,17047.0,
230,747.0,1713.0,462.0,17078.0,
231,596.0,1644.0,608.0,17152.0,
232,608.0,1629.0,669.0,17094.0,
233,585.0,1590.0,679.0,17146.0,
234,599.0,1726.0,546.0,17129.0,
235,574.0,1777.0,502.0,17147.0,
236,573.0,1693.0,553.0,17181.0,
237,495.0,1638.0,598.0,17269.0,
238,459.0,1725.0,517.0,17299.0,
239,441.0,1771.0,456.0,17332.0,
240,397.0,1816.0,380.0,17407.0,
241,380.0,1785.0,363.0,17472.0,
242,390.0,1754.0,382.0,17474.0,
243,413.0,1731.0,262.0,17594.0,
244,400.0,1639.0,320.0,17641.0,
245,432.0,1511.0,272.0,17785.0,
246,617.0,1544.0,266.0,17573.0,
247,690.0,1399.0,315.0,17596.0,
248,720.0,1282.0,293.0,17705.0,
249,711.0,1271.0,250.0,17768.0,
250,849.0,1048.0,222.0,17881.0,
251,1034.0,871.0,265.0,17830.0,
252,1121.0,816.0,361.0,17702.0,
253,1113.0,840.0,309.0,17738.0,
254,1104.0,860.0,284.0,17752.0,
255,1050.0,825.0,366.0,17759.0,
256,1047.0,740.0,347.0,17866.0,
257,1036.0,756.0,323.0,17885.0,
258,962.0,707.0,335.0,17996.0,
259,966.0,661.0,415.0,17958.0,
260,997.0,742.0,371.0,17890.0,
261,1029.0,672.0,356.0,17943.0,
262,1163.0,528.0,331.0,17978.0,
263,1441.0,582.0,344.0,17633.0,
264,1477.0,526.0,346.0,17651.0,
265,1474.0,552.0,309.0,17665.0,
266,1452.0,535.0,293.0,17720.0,
267,1544.0,518.0,321.0,17617.0,
268,1524.0,537.0,399.0,17540.0,
269,1599.0,505.0,392.0,17504.0,
270,1538.0,589.0,420.0,17453.0,
271,1489.0,670.0,431.0,17410.0,
272,1516.0,644.0,504.0,17336.0,
273,1478.0,617.0,524.0,17381.0,
274,1434.0,751.0,436.0,17379.0,
275,1331.0,863.0,374.0,17432.0,
276,1183.0,933.0,377.0,17507.0,
277,1006.0,932.0,451.0,17611.0,
278,885.0,986.0,473.0,17656.0,
279,822.0,1034.0,440.0,17704.0,
280,783.0,1036.0,345.0,17836.0,
281,704.0,1061.0,323.0,17912.0,
282,693.0,1083.0,281.0,17943.0,
283,739.0,1004.0,333.0,17924.0,
284,753.0,965.0,254.0,18028.0,
285,765.0,890.0,278.0,18067.0,
286,768.0,951.0,246.0,18035.0,
287,721.0,895.0,313.0,18071.0,
288,703.0,900.0,278.0,18119.0,
289,637.0,930.0,278.0,18155.0,
290,627.0,971.0,215.0,18187.0,
291,603.0,934.0,208.0,18255.0,
292,602.0,882.0,210.0,18306.0,
293,579.0,870.0,155.0,18396.0,
294,614.0,763.0,148.0,18475.0,
295,632.0,781.0,137.0,18450.0,
296,610.0,758.0,148.0,18484.0,
297,577.0,695.0,200.0,18528.0,
298,565.0,680.0,151.0,18604.0,
299,542.0,654.0,166.0,18638.0,
300,553.0,655.0,158.0,18634.0,
301,590.0,634.0,173.0,18603.0,
302,605.0,618.0,154.0,18623.0,
303,619.0,648.0,126.0,18607.0,
304,677.0,657.0,147.0,18519.0,
305,696.0,653.0,120.0,18531.0,
306,715.0,607.0,173.0,18505.0,
307,745.0,561.0,204.0,18490.0,
308,814.0,570.0,199.0,18417.0,
309,835.0,600.0,198.0,18367.0,
310,823.0,634.0,218.0,18325.0,
311,818.0,590.0,243.0,18349.0,
312,825.0,604.0,239.0,18332.0,
313,851.0,626.0,259.0,18264.0,
314,844.0,628.0,267.0,18261.0,
315,863.0,609.0,281.0,18247.0,
316,879.0,623.0,316.0,18182.0,
317,903.0,600.0,393.0,18104.0,
318,933.0,640.0,382.0,18045.0,
319,971.0,654.0,434.0,17941.0,
320,1023.0,614.0,523.0,17840.0,
321,1036.0,594.0,508.0,17862.0,
322,1103.0,597.0,543.0,17757.0,
323,1155.0,608.0,574.0,17663.0,
324,1258.0,667.0,567.0,17508.0,
325,1303.0,708.0,561.0,17428.0,
326,1292.0,703.0,586.0,17419.0,
327,1291.0,642.0,563.0,17504.0,
328,1266.0,603.0,656.0,17475.0,
329,1268.0,612.0,677.0,17443.0,
330,1252.0,660.0,662.0,17426.0,
331,1261.0,617.0,676.0,17446.0,
332,1261.0,719.0,548.0,17472.0,
333,1218.0,670.0,520.0,17592.0,
334,1206.0,646.0,475.0,17673.0,
335,1220.0,725.0,429.0,17626.0,
336,1188.0,640.0,496.0,17676.0,
337,1149.0,635.0,468.0,17748.0,
338,1222.0,573.0,546.0,17659.0,
339,1182.0,598.0,534.0,17686.0,
340,1170.0,587.0,548.0,17695.0,
341,1146.0,579.0,545.0,17730.0,
342,1153.0,615.0,521.0,17711.0,
343,1140.0,682.0,416.0,17762.0,
344,1095.0,604.0,444.0,17857.0,
345,1074.0,527.0,519.0,17880.0,
346,1096.0,569.0,483.0,17852.0,
347,1072.0,597.0,451.0,17880.0,
348,1043.0,643.0,431.0,17883.0,
349,1006.0,611.0,435.0,17948.0,
350,933.0,647.0,436.0,17984.0,
351,919.0,602.0,380.0,18099.0,
352,906.0,578.0,354.0,18162.0,
353,911.0,604.0,317.0,18168.0,
354,927.0,555.0,351.0,18167.0,
355,930.0,503.0,339.0,18228.0,
356,974.0,503.0,341.0,18182.0,
357,989.0,486.0,296.0,18229.0,
358,1031.0,428.0,295.0,18246.0,
359,1078.0,407.0,271.0,18244.0,
360,1072.0,371.0,311.0,18246.0,
361,1106.0,372.0,266.0,18256.0,
362,1165.0,383.0,258.0,18194.0,
363,1212.0,382.0,284.0,18122.0,
364,1209.0,361.0,304.0,18126.0,
365,1287.0,341.0,327.0,18045.0,
366,1319.0,378.0,334.0,17969.0,
367,1331.0,389.0,326.0,17954.0,
368,1326.0,398.0,360.0,17916.0,
369,1373.0,426.0,365.0,17836.0,
370,1439.0,458.0,357.0,17746.0,
371,1478.0,481.0,367.0,17674.0,
372,1664.0,482.0,297.0,17557.0,
373,1758.0,455.0,337.0,17450.0,
374,1828.0,455.0,382.0,17335.0,
375,1851.0,464.0,437.0,17248.0,
376,1876.0,416.0,574.0,17134.0,
377,1853.0,482.0,545.0,17120.0,
378,1841.0,437.0,562.0,17160.0,
379,1942.0,495.0,564.0,16999.0,
380,1974.0,607.0,486.0,16933.0,
381,1946.0,647.0,503.0,16904.0,
382,1873.0,691.0,517.0,16919.0,
383,1805.0,684.0,617.0,16894.0,
384,1708.0,695.0,648.0,16949.0,
385,1631.0,692.0,764.0,16913.0,
386,1644.0,792.0,672.0,16892.0,
387,1661.0,796.0,742.0,16801.0,
388,1607.0,868.0,777.0,16748.0,
389,1586.0,910.0,684.0,16820.0,
390,1526.0,863.0,704.0,16907.0,
391,1435.0,988.0,643.0,16934.0,
392,1431.0,929.0,759.0,16881.0,
393,1442.0,1008.0,673.0,16877.0,
394,1528.0,976.0,798.0,16698.0,
395,1423.0,1008.0,870.0,16699.0,
396,1326.0,1098.0,863.0,16713.0,
397,1188.0,1056.0,956.0,16800.0,
398,1136.0,1200.0,860.0,16804.0,
399,1018.0,1241.0,870.0,16871.0,
400,960.0,1323.0,769.0,16948.0,
401,963.0,1361.0,703.0,16973.0,
402,941.0,1327.0,573.0,17159.0,
403,867.0,1233.0,611.0,17289.0,
404,879.0,1206.0,619.0,17296.0,
405,924.0,1307.0,567.0,17202.0,
406,850.0,1374.0,569.0,17207.0,
407,828.0,1421.0,437.0,17314.0,
408,810.0,1350.0,441.0,17399.0,
409,803.0,1316.0,464.0,17417.0,
410,855.0,1216.0,414.0,17515.0,
411,827.0,1229.0,401.0,17543.0,
412,828.0,1240.0,316.0,17616.0,
413,837.0,1176.0,386.0,17601.0,
414,784.0,1276.0,331.0,17609.0,
415,780.0,1264.0,350.0,17606.0,
416,765.0,1237.0,331.0,17667.0,
417,747.0,1143.0,329.0,17781.0,
418,696.0,1116.0,375.0,17813.0,
419,730.0,1147.0,315.0,17808.0,
420,756.0,1135.0,338.0,17771.0,
421,756.0,1090.0,410.0,17744.0,
422,736.0,1089.0,329.0,17846.0,
423,720.0,1118.0,285.0,17877.0,
424,734.0,1023.0,302.0,17941.0,
425,721.0,1021.0,360.0,17898.0,
426,801.0,1048.0,328.0,17823.0,
427,858.0,1027.0,347.0,17768.0,
428,939.0,1028.0,417.0,17616.0,
429,930.0,1087.0,400.0,17583.0,
430,907.0,1186.0,355.0,17552.0,
431,1107.0,1174.0,460.0,17259.0,
432,990.0,1245.0,557.0,17208.0,
433,986.0,1346.0,439.0,17229.0,
434,989.0,1389.0,312.0,17310.0,
435,909.0,1340.0,441.0,17310.0,
436,981.0,1267.0,493.0,17259.0,
437,1074.0,1253.0,415.0,17258.0,
438,1003.0,1189.0,474.0,17334.0,
439,1057.0,1184.0,464.0,17295.0,
440,1088.0,1140.0,428.0,17344.0,
441,998.0,1112.0,560.0,17330.0,
442,970.0,1152.0,567.0,17311.0,
443,918.0,1109.0,547.0,17426.0,
444,931.0,1117.0,552.0,17400.0,
445,949.0,1119.0,550.0,17382.0,
446,926.0,1095.0,484.0,17495.0,
447,935.0,1101.0,411.0,17553.0,
448,897.0,1064.0,424.0,17615.0,
449,962.0,1065.0,482.0,17491.0,
450,945.0,1036.0,555.0,17464.0,
451,920.0,1041.0,572.0,17467.0,
452,919.0,999.0,568.0,17514.0,
453,922.0,1086.0,557.0,17435.0,
454,896.0,1053.0,612.0,17439.0,
455,940.0,1084.0,588.0,17388.0,
456,975.0,1046.0,532.0,17447.0,
457,1060.0,1072.0,483.0,17385.0,
458,1002.0,1134.0,504.0,17360.0,
459,913.0,1075.0,583.0,17429.0,
460,918.0,1139.0,557.0,17386.0,
461,813.0,1116.0,553.0,17518.0,
462,807.0,1134.0,511.0,17548.0,
463,816.0,1087.0,500.0,17597.0,
464,769.0,1161.0,465.0,17605.0,
465,740.0,1208.0,428.0,17624.0,
466,731.0,1253.0,424.0,17592.0,
467,703.0,1145.0,451.0,17701.0,
468,713.0,1115.0,353.0,17819.0,
469,767.0,1029.0,454.0,17750.0,
470,718.0,939.0,517.0,17826.0,
471,805.0,933.0,527.0,17735.0,
472,806.0,960.0,381.0,17853.0,
473,891.0,933.0,363.0,17813.0,
474,906.0,976.0,316.0,17802.0,
475,856.0,940.0,403.0,17801.0,
476,851.0,992.0,271.0,17886.0,
477,786.0,924.0,335.0,17955.0,
478,759.0,921.0,358.0,17962.0,
479,824.0,962.0,359.0,17855.0,
480,814.0,957.0,351.0,17878.0,
481,814.0,1033.0,316.0,17837.0,
482,823.0,1055.0,343.0,17779.0,
483,856.0,1034.0,429.0,17681.0,
484,845.0,1068.0,424.0,17663.0,
485,778.0,1069.0,451.0,17702.0,
486,773.0,1094.0,401.0,17732.0,
487,762.0,1063.0,397.0,17778.0,
488,720.0,1112.0,430.0,17738.0,
489,705.0,1037.0,451.0,17807.0,
490,717.0,1133.0,323.0,17827.0,
491,717.0,1057.0,273.0,17953.0,
492,733.0,995.0,284.0,17988.0,
493,809.0,995.0,288.0,17908.0,
494,823.0,938.0,280.0,17959.0,
495,828.0,935.0,305.0,17932.0,
496,855.0,907.0,361.0,17877.0,
497,863.0,1004.0,297.0,17836.0,
498,819.0,979.0,372.0,17830.0,
499,818.0,1072.0,342.0,17768.0,
500,786.0,940.0,364.0,17910.0,
501,785.0,978.0,314.0,17923.0,
502,740.0,1051.0,291.0,17918.0,
503,761.0,943.0,258.0,18038.0,
504,761.0,981.0,245.0,18013.0,
505,821.0,946.0,272.0,17961.0,
506,842.0,874.0,303.0,17981.0,
507,923.0,838.0,323.0,17916.0,
508,943.0,802.0,304.0,17951.0,
509,969.0,675.0,258.0,18098.0,
510,1121.0,613.0,326.0,17940.0,
511,1186.0,615.0,287.0,17912.0,
512,1210.0,576.0,295.0,17919.0,
513,1166.0,530.0,368.0,17936.0,
514,1267.0,482.0,348.0,17903.0,
515,1425.0,401.0,410.0,17764.0,
516,1500.0,363.0,430.0,17707.0,
517,1599.0,413.0,367.0,17621.0,
518,1645.0,450.0,351.0,17554.0,
519,1715.0,506.0,373.0,17406.0,
520,1807.0,448.0,378.0,17367.0,
521,2020.0,449.0,388.0,17143.0,
522,2018.0,413.0,460.0,17109.0,
523,2037.0,500.0,413.0,17050.0,
524,2059.0,501.0,542.0,16898.0,
525,2060.0,618.0,534.0,16788.0,
526,2083.0,600.0,491.0,16826.0,
527,2015.0,599.0,645.0,16741.0,
528,2205.0,708.0,700.0,16387.0,
529,2152.0,739.0,810.0,16299.0,
530,2130.0,832.0,734.0,16304.0,
531,1973.0,844.0,801.0,16382.0,
532,2095.0,1017.0,743.0,16145.0,
533,2045.0,1062.0,910.0,15983.0,
534,1892.0,1310.0,947.0,15851.0,
535,1612.0,1407.0,1221.0,15760.0,
536,1531.0,1592.0,1177.0,15700.0,
537,1209.0,1721.0,1345.0,15725.0,
538,1026.0,1967.0,1157.0,15850.0,
539,808.0,2053.0,1151.0,15988.0,
540,738.0,2098.0,877.0,16287.0,
541,664.0,2076.0,715.0,16545.0,
542,602.0,1937.0,651.0,16810.0,
543,605.0,1923.0,583.0,16889.0,
544,567.0,1812.0,522.0,17099.0,
545,558.0,1647.0,599.0,17196.0,
546,559.0,1658.0,536.0,17247.0,
547,550.0,1572.0,455.0,17423.0,
548,536.0,1513.0,460.0,17491.0,
549,559.0,1497.0,398.0,17546.0,
550,571.0,1431.0,429.0,17569.0,
551,569.0,1323.0,409.0,17699.0,
552,589.0,1284.0,374.0,17753.0,
553,605.0,1247.0,349.0,17799.0,
554,641.0,1134.0,374.0,17851.0,
555,625.0,1105.0,377.0,17893.0,
556,662.0,1096.0,369.0,17873.0,
557,685.0,1034.0,385.0,17896.0,
558,711.0,1030.0,385.0,17874.0,
559,717.0,966.0,354.0,17963.0,
560,742.0,927.0,362.0,17969.0,
561,871.0,935.0,394.0,17800.0,
562,985.0,972.0,394.0,17649.0,
563,1079.0,913.0,446.0,17562.0,
564,1087.0,929.0,482.0,17502.0,
565,1074.0,899.0,494.0,17533.0,
566,1041.0,972.0,484.0,17503.0,
567,1009.0,980.0,465.0,17546.0,
568,988.0,966.0,483.0,17563.0,
569,940.0,993.0,475.0,17592.0,
570,871.0,1016.0,544.0,17569.0,
571,818.0,1050.0,514.0,17618.0,
572,770.0,1079.0,445.0,17706.0,
573,742.0,1074.0,455.0,17729.0,
574,721.0,1093.0,445.0,17741.0,
575,704.0,1010.0,429.0,17857.0,
576,700.0,909.0,411.0,17980.0,
577,692.0,870.0,408.0,18030.0,
578,689.0,803.0,398.0,18110.0,
579,688.0,838.0,405.0,18069.0,
580,718.0,782.0,391.0,18109.0,
581,729.0,751.0,378.0,18142.0,
582,809.0,748.0,353.0,18090.0,
583,907.0,648.0,361.0,18084.0,
584,964.0,648.0,342.0,18046.0,
585,941.0,686.0,346.0,18027.0,
586,895.0,711.0,338.0,18056.0,
587,866.0,710.0,350.0,18074.0,
588,873.0,676.0,325.0,18126.0,
589,881.0,685.0,392.0,18042.0,
590,853.0,744.0,337.0,18066.0,
591,857.0,764.0,286.0,18093.0,
592,850.0,741.0,311.0,18098.0,
593,866.0,748.0,282.0,18104.0,
594,865.0,724.0,322.0,18089.0,
595,894.0,727.0,367.0,18012.0,
596,903.0,737.0,335.0,18025.0,
597,882.0,704.0,320.0,18094.0,
598,889.0,700.0,315.0,18096.0,
599,865.0,678.0,328.0,18129.0,
600,881.0,646.0,350.0,18123.0,
601,881.0,633.0,366.0,18120.0,
602,893.0,654.0,293.0,18160.0,
603,881.0,664.0,341.0,18114.0,
604,855.0,712.0,329.0,18104.0,
605,870.0,705.0,331.0,18094.0,
606,860.0,736.0,289.0,18115.0,
607,844.0,734.0,272.0,18150.0,
608,848.0,693.0,268.0,18191.0,
609,842.0,693.0,280.0,18185.0,
610,873.0,689.0,273.0,18165.0,
611,885.0,675.0,259.0,18181.0,
612,955.0,649.0,304.0,18092.0,
613,998.0,655.0,258.0,18089.0,
614,1032.0,607.0,293.0,18068.0,
615,1050.0,598.0,307.0,18045.0,
616,1065.0,622.0,276.0,18037.0,
617,1098.0,620.0,255.0,18027.0,
618,1096.0,594.0,309.0,18001.0,
619,1115.0,642.0,308.0,17935.0,
620,1139.0,652.0,319.0,17890.0,
621,1124.0,655.0,373.0,17848.0,
622,1156.0,709.0,376.0,17759.0,
623,1161.0,726.0,384.0,17729.0,
624,1170.0,692.0,471.0,17667.0,
625,1166.0,769.0,456.0,17609.0,
626,1136.0,798.0,540.0,17526.0,
627,1094.0,830.0,560.0,17516.0,
628,1091.0,905.0,549.0,17455.0,
629,1064.0,1003.0,586.0,17347.0,
630,1044.0,1079.0,558.0,17319.0,
631,977.0,1122.0,608.0,17293.0,
632,942.0,1169.0,642.0,17247.0,
633,887.0,1178.0,684.0,17251.0,
634,851.0,1192.0,699.0,17258.0,
635,817.0,1189.0,718.0,17276.0,
636,812.0,1248.0,679.0,17261.0,
637,755.0,1298.0,617.0,17330.0,
638,702.0,1235.0,667.0,17396.0,
639,697.0,1243.0,596.0,17464.0,
640,690.0,1238.0,563.0,17509.0,
641,653.0,1168.0,616.0,17563.0,
642,642.0,1170.0,625.0,17563.0,
643,633.0,1238.0,572.0,17557.0,
644,631.0,1221.0,517.0,17631.0,
645,637.0,1184.0,502.0,17677.0,
646,632.0,1220.0,383.0,17765.0,
647,633.0,1150.0,386.0,17831.0,
648,635.0,1067.0,403.0,17895.0,
649,623.0,1050.0,410.0,17917.0,
650,697.0,1015.0,391.0,17897.0,
651,714.0,1015.0,406.0,17865.0,
652,761.0,1024.0,413.0,17802.0,
653,758.0,990.0,430.0,17822.0,
654,777.0,1019.0,415.0,17789.0,
655,760.0,1006.0,431.0,17803.0,
656,778.0,1032.0,391.0,17799.0,
657,780.0,997.0,337.0,17886.0,
658,770.0,959.0,384.0,17887.0,
659,777.0,949.0,431.0,17843.0,
660,774.0,902.0,467.0,17857.0,
661,766.0,905.0,495.0,17834.0,
662,772.0,991.0,466.0,17771.0,
663,765.0,926.0,430.0,17879.0,
664,742.0,859.0,478.0,17921.0,
665,748.0,921.0,337.0,17994.0,
666,747.0,913.0,308.0,18032.0,
667,754.0,898.0,299.0,18049.0,
668,802.0,831.0,282.0,18085.0,
669,816.0,805.0,269.0,18110.0,
670,792.0,811.0,308.0,18089.0,
671,840.0,783.0,334.0,18043.0,
672,840.0,768.0,353.0,18039.0,
673,879.0,774.0,332.0,18015.0,
674,856.0,764.0,335.0,18045.0,
675,841.0,743.0,372.0,18044.0,
676,829.0,784.0,397.0,17990.0,
677,801.0,781.0,379.0,18039.0,
678,890.0,797.0,389.0,17924.0,
679,851.0,852.0,330.0,17967.0,
680,820.0,842.0,330.0,18008.0,
681,840.0,830.0,384.0,17946.0,
682,952.0,917.0,283.0,17848.0,
683,952.0,892.0,380.0,17776.0,
684,926.0,954.0,326.0,17794.0,
685,843.0,925.0,434.0,17798.0,
686,856.0,1030.0,377.0,17737.0,
687,836.0,1091.0,366.0,17707.0,
688,826.0,1111.0,356.0,17707.0,
689,799.0,1079.0,401.0,17721.0,
690,803.0,996.0,415.0,17786.0,
691,762.0,985.0,438.0,17815.0,
692,701.0,913.0,454.0,17932.0,
693,683.0,926.0,376.0,18015.0,
694,717.0,949.0,342.0,17992.0,
695,713.0,869.0,398.0,18020.0,
696,728.0,821.0,436.0,18015.0,
697,721.0,799.0,431.0,18049.0,
698,743.0,795.0,353.0,18109.0,
699,745.0,797.0,353.0,18105.0,
700,743.0,706.0,321.0,18230.0,
701,775.0,647.0,294.0,18284.0,
702,805.0,614.0,305.0,18276.0,
703,816.0,608.0,261.0,18315.0,
704,848.0,526.0,267.0,18359.0,
705,860.0,543.0,214.0,18383.0,
706,873.0,534.0,175.0,18418.0,
707,926.0,496.0,206.0,18372.0,
708,945.0,467.0,233.0,18355.0,
709,970.0,465.0,288.0,18277.0,
710,987.0,486.0,263.0,18264.0,
711,994.0,461.0,282.0,18263.0,
712,1017.0,466.0,257.0,18260.0,
713,1011.0,433.0,303.0,18253.0,
714,993.0,430.0,331.0,18246.0,
715,1005.0,432.0,321.0,18242.0,
716,995.0,446.0,322.0,18237.0,
717,987.0,510.0,318.0,18185.0,
718,997.0,533.0,315.0,18155.0,
719,1014.0,491.0,353.0,18142.0,
720,1029.0,509.0,384.0,18078.0,
721,1041.0,565.0,323.0,18071.0,
722,1056.0,544.0,325.0,18075.0,
723,1060.0,595.0,331.0,18014.0,
724,1099.0,622.0,383.0,17896.0,
725,1142.0,612.0,386.0,17860.0,
726,1155.0,607.0,375.0,17863.0,
727,1155.0,651.0,404.0,17790.0,
728,1207.0,683.0,405.0,17705.0,
729,1206.0,670.0,459.0,17665.0,
730,1268.0,694.0,510.0,17528.0,
