jour,S,I,E,R,
0,19980.0,20.0,0.0,0.0,
1,19969.0,20.0,11.0,0.0,
2,19890.0,24.0,86.0,0.0,
3,19796.0,40.0,164.0,0.0,
4,19606.0,62.0,311.0,21.0,
5,19192.0,173.0,608.0,27.0,
6,18713.0,330.0,911.0,46.0,
7,17460.0,546.0,1914.0,80.0,
8,15904.0,970.0,2994.0,132.0,
9,13846.0,1658.0,4282.0,214.0,
10,9735.0,2740.0,7214.0,311.0,
11,5644.0,4504.0,9249.0,603.0,
12,2751.0,5932.0,10161.0,1156.0,
13,868.0,8252.0,8764.0,2116.0,
14,167.0,9200.0,7709.0,2924.0,
15,50.0,10241.0,5773.0,3936.0,
16,8.0,10983.0,3801.0,5208.0,
17,0.0,11108.0,2346.0,6546.0,
18,0.0,10118.0,1830.0,8052.0,
19,0.0,9109.0,1305.0,9586.0,
20,0.0,8359.0,995.0,10646.0,
21,0.0,7468.0,875.0,11657.0,
22,3.0,6897.0,629.0,12471.0,
23,3.0,6213.0,509.0,13275.0,
24,4.0,5674.0,472.0,13850.0,
25,1.0,4693.0,375.0,14931.0,
26,1.0,4466.0,241.0,15292.0,
27,51.0,4185.0,226.0,15538.0,
28,72.0,3612.0,256.0,16060.0,
29,63.0,3091.0,212.0,16634.0,
30,97.0,2998.0,113.0,16792.0,
31,90.0,2470.0,101.0,17339.0,
32,66.0,2213.0,121.0,17600.0,
33,66.0,1886.0,4.0,18044.0,
34,40.0,1634.0,29.0,18297.0,
35,40.0,1489.0,0.0,18471.0,
36,40.0,1242.0,0.0,18718.0,
37,18.0,1044.0,22.0,18916.0,
38,21.0,995.0,0.0,18984.0,
39,21.0,948.0,0.0,19031.0,
40,15.0,830.0,6.0,19149.0,
41,12.0,643.0,4.0,19341.0,
42,16.0,604.0,0.0,19380.0,
43,15.0,570.0,1.0,19414.0,
44,18.0,553.0,0.0,19429.0,
45,181.0,535.0,3.0,19281.0,
46,190.0,536.0,1.0,19273.0,
47,278.0,535.0,8.0,19179.0,
48,332.0,536.0,9.0,19123.0,
49,336.0,533.0,48.0,19083.0,
50,334.0,536.0,105.0,19025.0,
51,405.0,550.0,91.0,18954.0,
52,551.0,542.0,118.0,18789.0,
53,555.0,566.0,179.0,18700.0,
54,580.0,558.0,182.0,18680.0,
55,572.0,631.0,165.0,18632.0,
56,582.0,588.0,209.0,18621.0,
57,539.0,636.0,223.0,18602.0,
58,534.0,597.0,210.0,18659.0,
59,513.0,602.0,190.0,18695.0,
60,477.0,548.0,219.0,18756.0,
61,451.0,533.0,203.0,18813.0,
62,432.0,555.0,126.0,18887.0,
63,421.0,541.0,164.0,18874.0,
64,464.0,493.0,134.0,18909.0,
65,468.0,421.0,180.0,18931.0,
66,536.0,347.0,179.0,18938.0,
67,736.0,370.0,117.0,18777.0,
68,717.0,331.0,117.0,18835.0,
69,668.0,263.0,143.0,18926.0,
70,671.0,293.0,136.0,18900.0,
71,667.0,255.0,86.0,18992.0,
72,647.0,243.0,109.0,19001.0,
73,607.0,248.0,109.0,19036.0,
74,617.0,207.0,127.0,19049.0,
75,564.0,212.0,137.0,19087.0,
76,559.0,247.0,106.0,19088.0,
77,564.0,277.0,105.0,19054.0,
78,555.0,306.0,86.0,19053.0,
79,532.0,269.0,76.0,19123.0,
80,691.0,191.0,87.0,19031.0,
81,758.0,196.0,74.0,18972.0,
82,751.0,168.0,73.0,19008.0,
83,722.0,183.0,88.0,19007.0,
84,762.0,162.0,63.0,19013.0,
85,828.0,162.0,41.0,18969.0,
86,830.0,165.0,36.0,18969.0,
87,840.0,169.0,26.0,18965.0,
88,861.0,157.0,63.0,18919.0,
89,977.0,141.0,82.0,18800.0,
90,1158.0,155.0,67.0,18620.0,
91,1241.0,129.0,83.0,18547.0,
92,1455.0,156.0,74.0,18315.0,
93,1704.0,150.0,67.0,18079.0,
94,2099.0,152.0,107.0,17642.0,
95,2435.0,148.0,154.0,17263.0,
96,2629.0,177.0,142.0,17052.0,
97,2735.0,211.0,223.0,16831.0,
98,2866.0,228.0,275.0,16631.0,
99,2976.0,212.0,316.0,16496.0,
100,3094.0,239.0,386.0,16281.0,
101,3056.0,278.0,413.0,16253.0,
102,2949.0,363.0,469.0,16219.0,
103,3066.0,457.0,535.0,15942.0,
104,3103.0,463.0,692.0,15742.0,
105,2914.0,596.0,832.0,15658.0,
106,2770.0,737.0,838.0,15655.0,
107,2366.0,900.0,1007.0,15727.0,
108,2089.0,1089.0,1090.0,15732.0,
109,1742.0,1239.0,1198.0,15821.0,
110,1429.0,1421.0,1218.0,15932.0,
111,1164.0,1555.0,1276.0,16005.0,
112,937.0,1600.0,1319.0,16144.0,
113,769.0,1740.0,1204.0,16287.0,
114,680.0,1647.0,1065.0,16608.0,
115,639.0,1657.0,897.0,16807.0,
116,624.0,1770.0,854.0,16752.0,
117,513.0,1701.0,784.0,17002.0,
118,446.0,1584.0,716.0,17254.0,
119,309.0,1554.0,704.0,17433.0,
120,257.0,1456.0,589.0,17698.0,
121,222.0,1378.0,497.0,17903.0,
122,240.0,1241.0,452.0,18067.0,
123,222.0,1094.0,448.0,18236.0,
124,214.0,946.0,436.0,18404.0,
125,211.0,817.0,401.0,18571.0,
126,221.0,778.0,357.0,18644.0,
127,249.0,720.0,266.0,18765.0,
128,261.0,553.0,264.0,18922.0,
129,279.0,527.0,190.0,19004.0,
130,289.0,415.0,135.0,19161.0,
131,336.0,337.0,106.0,19221.0,
132,361.0,296.0,95.0,19248.0,
133,396.0,258.0,83.0,19263.0,
134,405.0,254.0,78.0,19263.0,
135,421.0,197.0,71.0,19311.0,
136,437.0,163.0,56.0,19344.0,
137,457.0,168.0,35.0,19340.0,
138,497.0,128.0,41.0,19334.0,
139,502.0,97.0,37.0,19364.0,
140,539.0,64.0,35.0,19362.0,
141,543.0,56.0,27.0,19374.0,
142,552.0,62.0,22.0,19364.0,
143,585.0,54.0,19.0,19342.0,
144,629.0,41.0,15.0,19315.0,
145,671.0,28.0,10.0,19291.0,
146,689.0,32.0,4.0,19275.0,
147,744.0,26.0,4.0,19226.0,
148,755.0,25.0,1.0,19219.0,
149,856.0,19.0,3.0,19122.0,
150,931.0,15.0,4.0,19050.0,
151,1059.0,10.0,6.0,18925.0,
152,1130.0,9.0,7.0,18854.0,
153,1219.0,11.0,7.0,18763.0,
154,1315.0,11.0,10.0,18664.0,
155,1385.0,12.0,8.0,18595.0,
156,1404.0,12.0,6.0,18578.0,
157,1579.0,13.0,9.0,18399.0,
158,1693.0,16.0,7.0,18284.0,
159,1807.0,11.0,8.0,18174.0,
160,1939.0,11.0,12.0,18038.0,
161,2026.0,15.0,10.0,17949.0,
162,2096.0,16.0,13.0,17875.0,
163,2144.0,22.0,9.0,17825.0,
164,2211.0,16.0,10.0,17763.0,
165,2268.0,17.0,12.0,17703.0,
166,2486.0,23.0,10.0,17481.0,
167,2631.0,27.0,9.0,17333.0,
168,2802.0,20.0,18.0,17160.0,
169,2976.0,16.0,25.0,16983.0,
170,3043.0,18.0,30.0,16909.0,
171,3166.0,20.0,27.0,16787.0,
172,3291.0,23.0,27.0,16659.0,
173,3310.0,28.0,27.0,16635.0,
174,3369.0,25.0,41.0,16565.0,
175,3391.0,29.0,46.0,16534.0,
176,3419.0,30.0,64.0,16487.0,
177,3451.0,38.0,86.0,16425.0,
178,3514.0,57.0,70.0,16359.0,
179,3549.0,64.0,99.0,16288.0,
180,3731.0,69.0,140.0,16060.0,
181,3876.0,78.0,165.0,15881.0,
182,3999.0,89.0,189.0,15723.0,
183,4326.0,126.0,192.0,15356.0,
184,4371.0,163.0,218.0,15248.0,
185,4411.0,184.0,277.0,15128.0,
186,4524.0,205.0,340.0,14931.0,
187,4565.0,250.0,364.0,14821.0,
188,4614.0,305.0,395.0,14686.0,
189,4534.0,340.0,558.0,14568.0,
190,4525.0,416.0,558.0,14501.0,
191,4373.0,532.0,794.0,14301.0,
192,4113.0,616.0,996.0,14275.0,
193,3927.0,775.0,1198.0,14100.0,
194,3498.0,985.0,1479.0,14038.0,
195,3121.0,1085.0,1690.0,14104.0,
196,2729.0,1325.0,1932.0,14014.0,
197,2313.0,1719.0,2124.0,13844.0,
198,1676.0,2241.0,2202.0,13881.0,
199,1217.0,2584.0,2241.0,13958.0,
200,867.0,2814.0,2244.0,14075.0,
201,722.0,2860.0,2149.0,14269.0,
202,566.0,3364.0,1681.0,14389.0,
203,489.0,3412.0,1406.0,14693.0,
204,499.0,3294.0,1160.0,15047.0,
205,410.0,3114.0,1137.0,15339.0,
206,343.0,2930.0,941.0,15786.0,
207,293.0,2927.0,736.0,16044.0,
208,253.0,2566.0,588.0,16593.0,
209,236.0,2355.0,537.0,16872.0,
210,228.0,2146.0,520.0,17106.0,
211,288.0,2052.0,436.0,17224.0,
212,283.0,1844.0,387.0,17486.0,
213,221.0,1619.0,467.0,17693.0,
214,173.0,1401.0,499.0,17927.0,
215,172.0,1232.0,444.0,18152.0,
216,172.0,1111.0,467.0,18250.0,
217,201.0,964.0,364.0,18471.0,
218,222.0,752.0,321.0,18705.0,
219,234.0,535.0,247.0,18984.0,
220,405.0,454.0,181.0,18960.0,
221,488.0,356.0,162.0,18994.0,
222,648.0,309.0,141.0,18902.0,
223,678.0,247.0,91.0,18984.0,
224,796.0,203.0,112.0,18889.0,
225,818.0,212.0,109.0,18861.0,
226,847.0,233.0,107.0,18813.0,
227,882.0,260.0,80.0,18778.0,
228,885.0,251.0,71.0,18793.0,
229,945.0,211.0,83.0,18761.0,
230,954.0,200.0,106.0,18740.0,
231,965.0,221.0,81.0,18733.0,
232,963.0,221.0,115.0,18701.0,
233,972.0,223.0,94.0,18711.0,
234,1011.0,166.0,124.0,18699.0,
235,1015.0,182.0,82.0,18721.0,
236,1046.0,177.0,67.0,18710.0,
237,1055.0,131.0,73.0,18741.0,
238,1066.0,131.0,93.0,18710.0,
239,1072.0,161.0,73.0,18694.0,
240,1107.0,172.0,105.0,18616.0,
241,1123.0,174.0,68.0,18635.0,
242,1149.0,182.0,64.0,18605.0,
243,1252.0,198.0,60.0,18490.0,
244,1377.0,213.0,71.0,18339.0,
245,1414.0,218.0,100.0,18268.0,
246,1383.0,206.0,133.0,18278.0,
247,1458.0,225.0,108.0,18209.0,
248,1540.0,234.0,109.0,18117.0,
249,1506.0,210.0,149.0,18135.0,
250,1568.0,197.0,142.0,18093.0,
251,1636.0,217.0,136.0,18011.0,
252,1725.0,211.0,138.0,17926.0,
253,1750.0,221.0,147.0,17882.0,
254,1744.0,204.0,198.0,17854.0,
255,1722.0,213.0,195.0,17870.0,
256,1671.0,222.0,233.0,17874.0,
257,1648.0,278.0,189.0,17885.0,
258,1594.0,277.0,222.0,17907.0,
259,1503.0,325.0,246.0,17926.0,
260,1413.0,358.0,278.0,17951.0,
261,1345.0,397.0,288.0,17970.0,
262,1260.0,417.0,331.0,17992.0,
263,1208.0,440.0,338.0,18014.0,
264,1181.0,479.0,348.0,17992.0,
265,1147.0,554.0,328.0,17971.0,
266,1067.0,590.0,337.0,18006.0,
267,1076.0,622.0,329.0,17973.0,
268,981.0,677.0,293.0,18049.0,
269,977.0,717.0,302.0,18004.0,
270,1070.0,673.0,365.0,17892.0,
271,1095.0,670.0,331.0,17904.0,
272,1210.0,692.0,326.0,17772.0,
273,1354.0,722.0,340.0,17584.0,
274,1321.0,725.0,419.0,17535.0,
275,1408.0,852.0,319.0,17421.0,
276,1424.0,859.0,391.0,17326.0,
277,1667.0,873.0,406.0,17054.0,
278,1696.0,967.0,360.0,16977.0,
279,1685.0,991.0,456.0,16868.0,
280,1632.0,979.0,617.0,16772.0,
281,1642.0,1054.0,680.0,16624.0,
282,1636.0,1195.0,630.0,16539.0,
283,1522.0,1289.0,833.0,16356.0,
284,1318.0,1368.0,1000.0,16314.0,
285,1101.0,1579.0,1113.0,16207.0,
286,876.0,1736.0,1118.0,16270.0,
287,787.0,1905.0,956.0,16352.0,
288,708.0,1941.0,783.0,16568.0,
289,687.0,1795.0,740.0,16778.0,
290,583.0,1816.0,703.0,16898.0,
291,612.0,1660.0,749.0,16979.0,
292,625.0,1517.0,865.0,16993.0,
293,549.0,1413.0,739.0,17299.0,
294,570.0,1527.0,580.0,17323.0,
295,509.0,1520.0,458.0,17513.0,
296,538.0,1482.0,450.0,17530.0,
297,573.0,1308.0,424.0,17695.0,
298,634.0,1222.0,445.0,17699.0,
299,746.0,1087.0,575.0,17592.0,
300,787.0,964.0,569.0,17680.0,
301,732.0,1021.0,505.0,17742.0,
302,720.0,974.0,528.0,17778.0,
303,716.0,960.0,494.0,17830.0,
304,696.0,916.0,536.0,17852.0,
305,699.0,924.0,547.0,17830.0,
306,669.0,1028.0,510.0,17793.0,
307,754.0,933.0,569.0,17744.0,
308,748.0,857.0,521.0,17874.0,
309,772.0,755.0,492.0,17981.0,
310,745.0,637.0,477.0,18141.0,
311,733.0,601.0,394.0,18272.0,
312,763.0,650.0,303.0,18284.0,
313,734.0,501.0,331.0,18434.0,
314,746.0,488.0,317.0,18449.0,
315,791.0,384.0,310.0,18515.0,
316,832.0,331.0,334.0,18503.0,
317,839.0,409.0,274.0,18478.0,
318,905.0,392.0,242.0,18461.0,
319,938.0,356.0,196.0,18510.0,
320,1032.0,348.0,189.0,18431.0,
321,1042.0,278.0,200.0,18480.0,
322,1061.0,287.0,163.0,18489.0,
323,1047.0,283.0,163.0,18507.0,
324,1052.0,283.0,182.0,18483.0,
325,1111.0,259.0,178.0,18452.0,
326,1134.0,280.0,191.0,18395.0,
327,1152.0,255.0,205.0,18388.0,
328,1153.0,270.0,196.0,18381.0,
329,1255.0,277.0,195.0,18273.0,
330,1282.0,287.0,192.0,18239.0,
331,1368.0,303.0,170.0,18159.0,
332,1394.0,316.0,167.0,18123.0,
333,1478.0,327.0,177.0,18018.0,
334,1496.0,359.0,206.0,17939.0,
335,1505.0,364.0,205.0,17926.0,
336,1499.0,365.0,229.0,17907.0,
337,1497.0,385.0,243.0,17875.0,
338,1539.0,406.0,306.0,17749.0,
339,1580.0,411.0,359.0,17650.0,
340,1568.0,469.0,423.0,17540.0,
341,1529.0,514.0,419.0,17538.0,
342,1532.0,591.0,354.0,17523.0,
343,1500.0,666.0,387.0,17447.0,
344,1475.0,665.0,448.0,17412.0,
345,1515.0,723.0,410.0,17352.0,
346,1430.0,720.0,542.0,17308.0,
347,1367.0,798.0,563.0,17272.0,
348,1266.0,802.0,716.0,17216.0,
349,1195.0,875.0,719.0,17211.0,
350,1115.0,997.0,624.0,17264.0,
351,1048.0,1079.0,562.0,17311.0,
352,943.0,1136.0,549.0,17372.0,
353,918.0,1150.0,516.0,17416.0,
354,998.0,1096.0,519.0,17387.0,
355,962.0,1073.0,463.0,17502.0,
356,1058.0,1090.0,542.0,17310.0,
357,1039.0,1075.0,576.0,17310.0,
358,1021.0,1131.0,621.0,17227.0,
359,948.0,1155.0,722.0,17175.0,
360,919.0,1161.0,688.0,17232.0,
361,871.0,1192.0,721.0,17216.0,
362,888.0,1175.0,763.0,17174.0,
363,902.0,1273.0,660.0,17165.0,
364,1131.0,1281.0,720.0,16868.0,
365,1102.0,1333.0,875.0,16690.0,
366,1089.0,1416.0,925.0,16570.0,
367,1101.0,1469.0,954.0,16476.0,
368,1087.0,1553.0,1083.0,16277.0,
369,1125.0,1753.0,1145.0,15977.0,
370,1040.0,1863.0,1127.0,15970.0,
371,926.0,1999.0,1205.0,15870.0,
372,869.0,1961.0,1154.0,16016.0,
373,796.0,2181.0,966.0,16057.0,
374,714.0,2243.0,967.0,16076.0,
375,631.0,2236.0,986.0,16147.0,
376,621.0,2306.0,904.0,16169.0,
377,519.0,2193.0,931.0,16357.0,
378,494.0,2165.0,827.0,16514.0,
379,474.0,2173.0,686.0,16667.0,
380,528.0,2196.0,547.0,16729.0,
381,487.0,2087.0,427.0,16999.0,
382,516.0,1983.0,383.0,17118.0,
383,501.0,1768.0,420.0,17311.0,
384,462.0,1668.0,464.0,17406.0,
385,472.0,1599.0,392.0,17537.0,
386,435.0,1554.0,460.0,17551.0,
387,444.0,1517.0,387.0,17652.0,
388,411.0,1462.0,399.0,17728.0,
389,422.0,1389.0,343.0,17846.0,
390,412.0,1292.0,319.0,17977.0,
391,453.0,1204.0,341.0,18002.0,
392,485.0,1148.0,396.0,17971.0,
393,500.0,1040.0,361.0,18099.0,
394,527.0,957.0,377.0,18139.0,
395,530.0,875.0,360.0,18235.0,
396,555.0,785.0,346.0,18314.0,
397,592.0,741.0,362.0,18305.0,
398,672.0,773.0,343.0,18212.0,
399,788.0,786.0,424.0,18002.0,
400,811.0,781.0,466.0,17942.0,
401,812.0,745.0,460.0,17983.0,
402,809.0,687.0,387.0,18117.0,
403,810.0,681.0,351.0,18158.0,
404,808.0,575.0,388.0,18229.0,
405,883.0,571.0,377.0,18169.0,
406,891.0,617.0,344.0,18148.0,
407,923.0,604.0,297.0,18176.0,
408,938.0,602.0,323.0,18137.0,
409,942.0,576.0,308.0,18174.0,
410,972.0,633.0,238.0,18157.0,
411,990.0,577.0,299.0,18134.0,
412,994.0,577.0,275.0,18154.0,
413,1086.0,544.0,257.0,18113.0,
414,1087.0,556.0,291.0,18066.0,
415,1065.0,499.0,281.0,18155.0,
416,1058.0,547.0,278.0,18117.0,
417,1040.0,519.0,290.0,18151.0,
418,1022.0,548.0,340.0,18090.0,
419,988.0,518.0,372.0,18122.0,
420,996.0,511.0,337.0,18156.0,
421,997.0,443.0,314.0,18246.0,
422,974.0,487.0,254.0,18285.0,
423,981.0,462.0,232.0,18325.0,
424,932.0,486.0,223.0,18359.0,
425,903.0,485.0,254.0,18358.0,
426,890.0,529.0,242.0,18339.0,
427,895.0,536.0,232.0,18337.0,
428,893.0,524.0,195.0,18388.0,
429,895.0,513.0,219.0,18373.0,
430,870.0,509.0,196.0,18425.0,
431,868.0,514.0,200.0,18418.0,
432,943.0,488.0,216.0,18353.0,
433,908.0,484.0,272.0,18336.0,
434,913.0,482.0,220.0,18385.0,
435,884.0,482.0,213.0,18421.0,
436,981.0,460.0,242.0,18317.0,
437,989.0,427.0,221.0,18363.0,
438,1024.0,440.0,169.0,18367.0,
439,1019.0,462.0,173.0,18346.0,
440,957.0,427.0,253.0,18363.0,
441,984.0,435.0,224.0,18357.0,
442,1004.0,452.0,154.0,18390.0,
443,1025.0,431.0,181.0,18363.0,
444,1091.0,413.0,178.0,18318.0,
445,1136.0,456.0,163.0,18245.0,
446,1132.0,446.0,202.0,18220.0,
447,1189.0,401.0,199.0,18211.0,
448,1406.0,374.0,258.0,17962.0,
449,1465.0,333.0,322.0,17880.0,
450,1556.0,315.0,335.0,17794.0,
451,1677.0,371.0,330.0,17622.0,
452,1736.0,364.0,369.0,17531.0,
453,1828.0,410.0,384.0,17378.0,
454,1926.0,471.0,343.0,17260.0,
455,1966.0,490.0,411.0,17133.0,
456,2004.0,502.0,466.0,17028.0,
457,2010.0,527.0,512.0,16951.0,
458,1973.0,602.0,548.0,16877.0,
459,1872.0,626.0,629.0,16873.0,
460,1852.0,685.0,668.0,16795.0,
461,1823.0,740.0,686.0,16751.0,
462,1751.0,827.0,731.0,16691.0,
463,1614.0,976.0,671.0,16739.0,
464,1499.0,989.0,807.0,16705.0,
465,1370.0,1045.0,861.0,16724.0,
466,1398.0,1115.0,924.0,16563.0,
467,1331.0,1152.0,855.0,16662.0,
468,1213.0,1185.0,803.0,16799.0,
469,1264.0,1272.0,733.0,16731.0,
470,1128.0,1395.0,667.0,16810.0,
471,955.0,1471.0,651.0,16923.0,
472,903.0,1390.0,647.0,17060.0,
473,717.0,1341.0,732.0,17210.0,
474,630.0,1411.0,646.0,17313.0,
475,583.0,1390.0,629.0,17398.0,
476,542.0,1400.0,456.0,17602.0,
477,482.0,1384.0,473.0,17661.0,
478,471.0,1380.0,410.0,17739.0,
479,436.0,1335.0,436.0,17793.0,
480,450.0,1346.0,440.0,17764.0,
481,471.0,1307.0,417.0,17805.0,
482,479.0,1125.0,434.0,17962.0,
483,594.0,1066.0,460.0,17880.0,
484,604.0,990.0,452.0,17954.0,
485,626.0,893.0,405.0,18076.0,
486,648.0,907.0,378.0,18067.0,
487,693.0,865.0,384.0,18058.0,
488,736.0,785.0,386.0,18093.0,
489,761.0,727.0,421.0,18091.0,
490,838.0,650.0,429.0,18083.0,
491,899.0,619.0,410.0,18072.0,
492,1008.0,580.0,430.0,17982.0,
493,1080.0,561.0,445.0,17914.0,
494,1151.0,580.0,415.0,17854.0,
495,1175.0,561.0,485.0,17779.0,
496,1244.0,573.0,504.0,17679.0,
497,1286.0,586.0,510.0,17618.0,
498,1346.0,593.0,515.0,17546.0,
499,1318.0,631.0,509.0,17542.0,
500,1297.0,708.0,488.0,17507.0,
501,1254.0,731.0,498.0,17517.0,
502,1209.0,714.0,582.0,17495.0,
503,1273.0,764.0,539.0,17424.0,
504,1289.0,843.0,516.0,17352.0,
505,1327.0,804.0,581.0,17288.0,
506,1347.0,843.0,648.0,17162.0,
507,1325.0,875.0,650.0,17150.0,
508,1277.0,921.0,648.0,17154.0,
509,1209.0,976.0,651.0,17164.0,
510,1128.0,954.0,714.0,17204.0,
511,1086.0,1001.0,733.0,17180.0,
512,1024.0,1124.0,653.0,17199.0,
513,989.0,1055.0,692.0,17264.0,
514,924.0,1102.0,718.0,17256.0,
515,912.0,1124.0,644.0,17320.0,
516,898.0,987.0,604.0,17511.0,
517,866.0,964.0,514.0,17656.0,
518,869.0,1000.0,520.0,17611.0,
519,819.0,990.0,474.0,17717.0,
520,831.0,895.0,459.0,17815.0,
521,832.0,913.0,467.0,17788.0,
522,832.0,801.0,500.0,17867.0,
523,828.0,760.0,457.0,17955.0,
524,797.0,783.0,446.0,17974.0,
525,794.0,730.0,466.0,18010.0,
526,785.0,721.0,417.0,18077.0,
527,797.0,725.0,348.0,18130.0,
528,772.0,656.0,341.0,18231.0,
529,759.0,589.0,345.0,18307.0,
530,776.0,595.0,280.0,18349.0,
531,762.0,533.0,274.0,18431.0,
532,784.0,529.0,254.0,18433.0,
533,809.0,437.0,260.0,18494.0,
534,915.0,423.0,233.0,18429.0,
535,960.0,355.0,240.0,18445.0,
536,1043.0,348.0,215.0,18394.0,
537,1161.0,295.0,208.0,18336.0,
538,1251.0,264.0,213.0,18272.0,
539,1390.0,254.0,188.0,18168.0,
540,1541.0,238.0,191.0,18030.0,
541,1784.0,236.0,214.0,17766.0,
542,2124.0,246.0,235.0,17395.0,
543,2277.0,232.0,244.0,17247.0,
544,2385.0,257.0,265.0,17093.0,
545,2614.0,283.0,324.0,16779.0,
546,2874.0,314.0,401.0,16411.0,
547,2928.0,374.0,455.0,16243.0,
548,3000.0,354.0,605.0,16041.0,
549,3126.0,417.0,705.0,15752.0,
550,3199.0,625.0,586.0,15590.0,
551,3114.0,737.0,764.0,15385.0,
552,2893.0,913.0,966.0,15228.0,
553,2687.0,1101.0,1053.0,15159.0,
554,2406.0,1224.0,1194.0,15176.0,
555,2047.0,1436.0,1381.0,15136.0,
556,1751.0,1668.0,1398.0,15183.0,
557,1494.0,1850.0,1443.0,15213.0,
558,1145.0,1976.0,1550.0,15329.0,
559,855.0,2226.0,1458.0,15461.0,
560,679.0,2440.0,1340.0,15541.0,
561,530.0,2541.0,1279.0,15650.0,
562,449.0,2598.0,1160.0,15793.0,
563,372.0,2695.0,910.0,16023.0,
564,324.0,2632.0,633.0,16411.0,
565,317.0,2443.0,547.0,16693.0,
566,307.0,2231.0,517.0,16945.0,
567,381.0,2118.0,386.0,17115.0,
568,389.0,1986.0,303.0,17322.0,
569,393.0,1846.0,388.0,17373.0,
570,409.0,1707.0,368.0,17516.0,
571,384.0,1539.0,355.0,17722.0,
572,441.0,1545.0,302.0,17712.0,
573,504.0,1357.0,304.0,17835.0,
574,555.0,1320.0,321.0,17804.0,
575,645.0,1267.0,325.0,17763.0,
576,663.0,1189.0,346.0,17802.0,
577,667.0,1171.0,326.0,17836.0,
578,649.0,1112.0,367.0,17872.0,
579,636.0,1058.0,390.0,17916.0,
580,726.0,1048.0,342.0,17884.0,
581,670.0,973.0,370.0,17987.0,
582,667.0,973.0,333.0,18027.0,
583,637.0,900.0,310.0,18153.0,
584,642.0,787.0,331.0,18240.0,
585,634.0,787.0,324.0,18255.0,
586,722.0,743.0,311.0,18224.0,
587,880.0,644.0,279.0,18197.0,
588,950.0,589.0,314.0,18147.0,
589,984.0,524.0,352.0,18140.0,
590,1014.0,509.0,328.0,18149.0,
591,1013.0,472.0,353.0,18162.0,
592,1034.0,490.0,338.0,18138.0,
593,1051.0,495.0,334.0,18120.0,
594,1085.0,539.0,308.0,18068.0,
595,1076.0,549.0,271.0,18104.0,
596,1091.0,555.0,231.0,18123.0,
597,1110.0,495.0,243.0,18152.0,
598,1135.0,441.0,287.0,18137.0,
599,1149.0,464.0,252.0,18135.0,
600,1176.0,458.0,315.0,18051.0,
601,1174.0,433.0,346.0,18047.0,
602,1184.0,470.0,323.0,18023.0,
603,1177.0,481.0,329.0,18013.0,
604,1154.0,531.0,315.0,18000.0,
605,1165.0,481.0,301.0,18053.0,
606,1171.0,506.0,287.0,18036.0,
607,1177.0,506.0,277.0,18040.0,
608,1213.0,522.0,270.0,17995.0,
609,1365.0,519.0,306.0,17810.0,
610,1332.0,509.0,346.0,17813.0,
611,1299.0,551.0,362.0,17788.0,
612,1238.0,537.0,433.0,17792.0,
613,1206.0,581.0,379.0,17834.0,
614,1236.0,603.0,330.0,17831.0,
615,1194.0,590.0,313.0,17903.0,
616,1134.0,599.0,400.0,17867.0,
617,1062.0,584.0,440.0,17914.0,
618,1022.0,665.0,420.0,17893.0,
619,1007.0,653.0,411.0,17929.0,
620,983.0,697.0,347.0,17973.0,
621,959.0,711.0,308.0,18022.0,
622,940.0,662.0,282.0,18116.0,
623,951.0,669.0,289.0,18091.0,
624,954.0,607.0,287.0,18152.0,
625,962.0,583.0,263.0,18192.0,
626,986.0,504.0,249.0,18261.0,
627,992.0,472.0,247.0,18289.0,
628,1040.0,471.0,249.0,18240.0,
629,1048.0,511.0,256.0,18185.0,
630,1212.0,471.0,206.0,18111.0,
631,1298.0,390.0,221.0,18091.0,
632,1358.0,305.0,284.0,18053.0,
633,1514.0,323.0,241.0,17922.0,
634,1656.0,297.0,239.0,17808.0,
635,1783.0,334.0,287.0,17596.0,
636,1855.0,343.0,339.0,17463.0,
637,1954.0,319.0,357.0,17370.0,
638,2036.0,359.0,369.0,17236.0,
639,2155.0,390.0,419.0,17036.0,
640,2266.0,407.0,540.0,16787.0,
641,2334.0,457.0,610.0,16599.0,
642,2340.0,536.0,614.0,16510.0,
643,2327.0,581.0,741.0,16351.0,
644,2278.0,701.0,814.0,16207.0,
645,2206.0,844.0,789.0,16161.0,
646,2114.0,950.0,817.0,16119.0,
647,2016.0,953.0,907.0,16124.0,
648,1912.0,955.0,987.0,16146.0,
649,1740.0,1070.0,1083.0,16107.0,
650,1556.0,1235.0,1057.0,16152.0,
651,1439.0,1436.0,891.0,16234.0,
652,1235.0,1421.0,1055.0,16289.0,
653,1030.0,1393.0,1127.0,16450.0,
654,896.0,1683.0,902.0,16519.0,
655,788.0,1722.0,855.0,16635.0,
656,667.0,1755.0,784.0,16794.0,
657,580.0,1705.0,663.0,17052.0,
658,553.0,1806.0,558.0,17083.0,
659,514.0,1749.0,578.0,17159.0,
660,498.0,1566.0,545.0,17391.0,
661,447.0,1582.0,515.0,17456.0,
662,491.0,1508.0,500.0,17501.0,
663,518.0,1439.0,436.0,17607.0,
664,536.0,1296.0,448.0,17720.0,
665,546.0,1212.0,457.0,17785.0,
666,551.0,1127.0,490.0,17832.0,
667,541.0,1097.0,499.0,17863.0,
668,591.0,1054.0,501.0,17854.0,
669,612.0,954.0,486.0,17948.0,
670,680.0,948.0,479.0,17893.0,
671,694.0,931.0,412.0,17963.0,
672,712.0,925.0,413.0,17950.0,
673,741.0,834.0,484.0,17941.0,
674,754.0,802.0,430.0,18014.0,
675,751.0,800.0,432.0,18017.0,
676,771.0,751.0,420.0,18058.0,
677,777.0,800.0,372.0,18051.0,
678,781.0,769.0,389.0,18061.0,
679,775.0,785.0,352.0,18088.0,
680,784.0,806.0,327.0,18083.0,
681,792.0,786.0,350.0,18072.0,
682,780.0,801.0,364.0,18055.0,
683,835.0,810.0,349.0,18006.0,
684,829.0,817.0,330.0,18024.0,
685,848.0,744.0,376.0,18032.0,
686,910.0,793.0,408.0,17889.0,
687,928.0,794.0,374.0,17904.0,
688,1079.0,748.0,446.0,17727.0,
689,1181.0,782.0,524.0,17513.0,
690,1133.0,840.0,587.0,17440.0,
691,1064.0,924.0,618.0,17394.0,
692,952.0,999.0,642.0,17407.0,
693,871.0,1117.0,598.0,17414.0,
694,843.0,1145.0,656.0,17356.0,
695,756.0,1157.0,679.0,17408.0,
696,710.0,1137.0,687.0,17466.0,
697,739.0,1175.0,640.0,17446.0,
698,797.0,1200.0,702.0,17301.0,
699,760.0,1173.0,770.0,17297.0,
700,686.0,1194.0,785.0,17335.0,
701,688.0,1199.0,731.0,17382.0,
702,620.0,1203.0,683.0,17494.0,
703,597.0,1105.0,649.0,17649.0,
704,629.0,1070.0,574.0,17727.0,
705,650.0,1071.0,527.0,17752.0,
706,644.0,984.0,545.0,17827.0,
707,632.0,992.0,446.0,17930.0,
708,585.0,1000.0,450.0,17965.0,
709,596.0,1023.0,403.0,17978.0,
710,587.0,1028.0,412.0,17973.0,
711,585.0,1014.0,430.0,17971.0,
712,578.0,971.0,424.0,18027.0,
713,576.0,965.0,406.0,18053.0,
714,603.0,926.0,383.0,18088.0,
715,631.0,891.0,341.0,18137.0,
716,656.0,917.0,289.0,18138.0,
717,746.0,877.0,281.0,18096.0,
718,846.0,856.0,310.0,17988.0,
719,875.0,832.0,375.0,17918.0,
720,910.0,820.0,398.0,17872.0,
721,1007.0,778.0,380.0,17835.0,
722,1036.0,746.0,335.0,17883.0,
723,1109.0,742.0,339.0,17810.0,
724,1152.0,765.0,356.0,17727.0,
725,1166.0,719.0,416.0,17699.0,
726,1296.0,700.0,505.0,17499.0,
727,1395.0,707.0,507.0,17391.0,
728,1402.0,787.0,554.0,17257.0,
729,1512.0,850.0,559.0,17079.0,
730,1533.0,873.0,544.0,17050.0,
