jour,S,I,E,R,
0,19980.0,20.0,0.0,0.0,
1,19967.0,20.0,13.0,0.0,
2,19915.0,22.0,63.0,0.0,
3,19854.0,30.0,116.0,0.0,
4,19751.0,59.0,189.0,1.0,
5,19547.0,78.0,370.0,5.0,
6,19053.0,172.0,769.0,6.0,
7,18343.0,299.0,1330.0,28.0,
8,17075.0,600.0,2280.0,45.0,
9,15384.0,1183.0,3309.0,124.0,
10,11684.0,1846.0,6288.0,182.0,
11,7701.0,3116.0,8845.0,338.0,
12,3854.0,5042.0,10437.0,667.0,
13,1562.0,6801.0,10271.0,1366.0,
14,278.0,9042.0,8630.0,2050.0,
15,39.0,10614.0,6600.0,2747.0,
16,5.0,11537.0,5097.0,3361.0,
17,1.0,12266.0,3252.0,4481.0,
18,0.0,11773.0,2277.0,5950.0,
19,0.0,11591.0,1482.0,6927.0,
20,9.0,10582.0,1061.0,8348.0,
21,1.0,9704.0,684.0,9611.0,
22,0.0,8724.0,606.0,10670.0,
23,0.0,7749.0,547.0,11704.0,
24,0.0,6586.0,544.0,12870.0,
25,0.0,5768.0,529.0,13703.0,
26,26.0,5222.0,402.0,14350.0,
27,47.0,4806.0,375.0,14772.0,
28,193.0,4265.0,398.0,15144.0,
29,70.0,4010.0,400.0,15520.0,
30,87.0,3657.0,306.0,15950.0,
31,58.0,3622.0,101.0,16219.0,
32,84.0,3212.0,126.0,16578.0,
33,82.0,3067.0,97.0,16754.0,
34,75.0,2668.0,90.0,17167.0,
35,108.0,2427.0,96.0,17369.0,
36,109.0,2116.0,126.0,17649.0,
37,118.0,1925.0,102.0,17855.0,
38,118.0,1936.0,80.0,17866.0,
39,66.0,1533.0,132.0,18269.0,
40,66.0,1289.0,115.0,18530.0,
41,66.0,1202.0,54.0,18678.0,
42,65.0,967.0,53.0,18915.0,
43,73.0,787.0,55.0,19085.0,
44,101.0,759.0,10.0,19130.0,
45,248.0,706.0,22.0,19024.0,
46,248.0,489.0,16.0,19247.0,
47,263.0,421.0,32.0,19284.0,
48,271.0,401.0,32.0,19296.0,
49,287.0,377.0,3.0,19333.0,
50,275.0,239.0,29.0,19457.0,
51,287.0,107.0,29.0,19577.0,
52,380.0,126.0,8.0,19486.0,
53,486.0,115.0,14.0,19385.0,
54,540.0,64.0,27.0,19369.0,
55,580.0,35.0,29.0,19356.0,
56,712.0,40.0,32.0,19216.0,
57,826.0,45.0,26.0,19103.0,
58,978.0,21.0,23.0,18978.0,
59,1119.0,29.0,21.0,18831.0,
60,1227.0,32.0,22.0,18719.0,
61,1341.0,40.0,12.0,18607.0,
62,1430.0,27.0,25.0,18518.0,
63,1486.0,27.0,29.0,18458.0,
64,1608.0,20.0,29.0,18343.0,
65,1702.0,23.0,31.0,18244.0,
66,1785.0,27.0,44.0,18144.0,
67,1808.0,28.0,33.0,18131.0,
68,1932.0,37.0,27.0,18004.0,
69,2001.0,40.0,25.0,17934.0,
70,2036.0,30.0,33.0,17901.0,
71,2050.0,31.0,33.0,17886.0,
72,2094.0,36.0,31.0,17839.0,
73,2099.0,43.0,27.0,17831.0,
74,2210.0,43.0,33.0,17714.0,
75,2290.0,50.0,38.0,17622.0,
76,2394.0,50.0,37.0,17519.0,
77,2448.0,56.0,51.0,17445.0,
78,2548.0,58.0,76.0,17318.0,
79,2585.0,64.0,99.0,17252.0,
80,2648.0,71.0,117.0,17164.0,
81,2642.0,106.0,128.0,17124.0,
82,2577.0,121.0,182.0,17120.0,
83,2491.0,191.0,194.0,17124.0,
84,2459.0,243.0,170.0,17128.0,
85,2352.0,304.0,209.0,17135.0,
86,2276.0,389.0,179.0,17156.0,
87,2099.0,385.0,353.0,17163.0,
88,1915.0,473.0,460.0,17152.0,
89,1802.0,511.0,493.0,17194.0,
90,1658.0,585.0,562.0,17195.0,
91,1631.0,652.0,584.0,17133.0,
92,1535.0,864.0,463.0,17138.0,
93,1377.0,941.0,503.0,17179.0,
94,1256.0,1004.0,501.0,17239.0,
95,1118.0,1119.0,487.0,17276.0,
96,899.0,1233.0,523.0,17345.0,
97,842.0,1290.0,562.0,17306.0,
98,748.0,1278.0,583.0,17391.0,
99,633.0,1302.0,624.0,17441.0,
100,512.0,1484.0,508.0,17496.0,
101,454.0,1570.0,371.0,17605.0,
102,407.0,1579.0,290.0,17724.0,
103,309.0,1561.0,322.0,17808.0,
104,276.0,1513.0,241.0,17970.0,
105,305.0,1366.0,285.0,18044.0,
106,292.0,1266.0,262.0,18180.0,
107,292.0,1246.0,192.0,18270.0,
108,388.0,1260.0,173.0,18179.0,
109,456.0,1245.0,159.0,18140.0,
110,494.0,1161.0,135.0,18210.0,
111,558.0,1176.0,129.0,18137.0,
112,697.0,1112.0,285.0,17906.0,
113,702.0,1042.0,345.0,17911.0,
114,705.0,1094.0,308.0,17893.0,
115,674.0,1083.0,329.0,17914.0,
116,691.0,1176.0,206.0,17927.0,
117,615.0,1248.0,185.0,17952.0,
118,539.0,1292.0,181.0,17988.0,
119,417.0,1195.0,269.0,18119.0,
120,407.0,1212.0,232.0,18149.0,
121,324.0,1233.0,230.0,18213.0,
122,285.0,1228.0,210.0,18277.0,
123,280.0,1225.0,154.0,18341.0,
124,379.0,1125.0,138.0,18358.0,
125,441.0,1098.0,202.0,18259.0,
126,381.0,1101.0,270.0,18248.0,
127,337.0,1135.0,283.0,18245.0,
128,349.0,1069.0,198.0,18384.0,
129,336.0,1008.0,133.0,18523.0,
130,418.0,969.0,117.0,18496.0,
131,460.0,944.0,166.0,18430.0,
132,502.0,939.0,171.0,18388.0,
133,525.0,915.0,177.0,18383.0,
134,560.0,910.0,161.0,18369.0,
135,614.0,862.0,171.0,18353.0,
136,627.0,835.0,250.0,18288.0,
137,637.0,784.0,241.0,18338.0,
138,626.0,805.0,238.0,18331.0,
139,658.0,807.0,144.0,18391.0,
140,742.0,717.0,186.0,18355.0,
141,699.0,689.0,248.0,18364.0,
142,742.0,671.0,252.0,18335.0,
143,813.0,642.0,267.0,18278.0,
144,848.0,598.0,264.0,18290.0,
145,910.0,517.0,277.0,18296.0,
146,930.0,619.0,218.0,18233.0,
147,950.0,622.0,228.0,18200.0,
148,947.0,575.0,341.0,18137.0,
149,1021.0,478.0,319.0,18182.0,
150,1060.0,520.0,295.0,18125.0,
151,1234.0,512.0,306.0,17948.0,
152,1266.0,605.0,282.0,17847.0,
153,1329.0,618.0,416.0,17637.0,
154,1381.0,593.0,426.0,17600.0,
155,1415.0,641.0,400.0,17544.0,
156,1404.0,645.0,419.0,17532.0,
157,1347.0,668.0,560.0,17425.0,
158,1308.0,679.0,530.0,17483.0,
159,1229.0,697.0,634.0,17440.0,
160,1313.0,775.0,640.0,17272.0,
161,1343.0,885.0,608.0,17164.0,
162,1451.0,845.0,566.0,17138.0,
163,1414.0,962.0,507.0,17117.0,
164,1333.0,1078.0,485.0,17104.0,
165,1156.0,1125.0,590.0,17129.0,
166,1030.0,1333.0,557.0,17080.0,
167,912.0,1510.0,631.0,16947.0,
168,791.0,1580.0,643.0,16986.0,
169,667.0,1711.0,568.0,17054.0,
170,516.0,1645.0,605.0,17234.0,
171,442.0,1639.0,488.0,17431.0,
172,382.0,1501.0,493.0,17624.0,
173,343.0,1422.0,404.0,17831.0,
174,385.0,1409.0,294.0,17912.0,
175,405.0,1403.0,276.0,17916.0,
176,380.0,1359.0,195.0,18066.0,
177,383.0,1218.0,166.0,18233.0,
178,378.0,1120.0,140.0,18362.0,
179,385.0,984.0,214.0,18417.0,
180,381.0,966.0,149.0,18504.0,
181,387.0,935.0,97.0,18581.0,
182,442.0,874.0,115.0,18569.0,
183,454.0,798.0,187.0,18561.0,
184,499.0,807.0,144.0,18550.0,
185,560.0,828.0,128.0,18484.0,
186,688.0,731.0,115.0,18466.0,
187,752.0,708.0,196.0,18344.0,
188,757.0,729.0,155.0,18359.0,
189,778.0,762.0,152.0,18308.0,
190,800.0,725.0,170.0,18305.0,
191,772.0,666.0,184.0,18378.0,
192,788.0,635.0,209.0,18368.0,
193,857.0,674.0,222.0,18247.0,
194,866.0,649.0,233.0,18252.0,
195,941.0,663.0,261.0,18135.0,
196,951.0,692.0,265.0,18092.0,
197,936.0,636.0,285.0,18143.0,
198,904.0,646.0,271.0,18179.0,
199,927.0,640.0,274.0,18159.0,
200,884.0,638.0,318.0,18160.0,
201,901.0,645.0,343.0,18111.0,
202,916.0,629.0,377.0,18078.0,
203,970.0,617.0,376.0,18037.0,
204,1164.0,630.0,387.0,17819.0,
205,1110.0,648.0,471.0,17771.0,
206,1199.0,613.0,523.0,17665.0,
207,1151.0,621.0,542.0,17686.0,
208,1133.0,706.0,558.0,17603.0,
209,1140.0,730.0,591.0,17539.0,
210,1191.0,846.0,515.0,17448.0,
211,1205.0,860.0,489.0,17446.0,
212,1191.0,848.0,608.0,17353.0,
213,1202.0,797.0,630.0,17371.0,
214,1346.0,770.0,732.0,17152.0,
215,1393.0,796.0,622.0,17189.0,
216,1469.0,843.0,642.0,17046.0,
217,1356.0,848.0,812.0,16984.0,
218,1293.0,913.0,870.0,16924.0,
219,1217.0,994.0,774.0,17015.0,
220,1153.0,1047.0,763.0,17037.0,
221,1103.0,1153.0,812.0,16932.0,
222,1029.0,1154.0,879.0,16938.0,
223,897.0,1202.0,951.0,16950.0,
224,889.0,1431.0,788.0,16892.0,
225,845.0,1560.0,684.0,16911.0,
226,808.0,1637.0,637.0,16918.0,
227,687.0,1614.0,652.0,17047.0,
228,593.0,1686.0,671.0,17050.0,
229,544.0,1704.0,550.0,17202.0,
230,520.0,1641.0,566.0,17273.0,
231,522.0,1626.0,581.0,17271.0,
232,479.0,1604.0,478.0,17439.0,
233,489.0,1619.0,453.0,17439.0,
234,573.0,1668.0,412.0,17347.0,
235,545.0,1653.0,418.0,17384.0,
236,521.0,1612.0,393.0,17474.0,
237,808.0,1580.0,440.0,17172.0,
238,783.0,1663.0,346.0,17208.0,
239,698.0,1697.0,374.0,17231.0,
240,576.0,1835.0,423.0,17166.0,
241,489.0,1881.0,413.0,17217.0,
242,441.0,1960.0,355.0,17244.0,
243,421.0,1941.0,233.0,17405.0,
244,495.0,1818.0,246.0,17441.0,
245,483.0,1784.0,253.0,17480.0,
246,531.0,1692.0,238.0,17539.0,
247,625.0,1615.0,258.0,17502.0,
248,570.0,1594.0,323.0,17513.0,
249,551.0,1501.0,377.0,17571.0,
250,585.0,1499.0,309.0,17607.0,
251,536.0,1259.0,369.0,17836.0,
252,493.0,1017.0,380.0,18110.0,
253,524.0,963.0,303.0,18210.0,
254,545.0,960.0,184.0,18311.0,
255,571.0,807.0,171.0,18451.0,
256,584.0,814.0,213.0,18389.0,
257,593.0,751.0,205.0,18451.0,
258,572.0,749.0,182.0,18497.0,
259,620.0,719.0,183.0,18478.0,
260,651.0,699.0,184.0,18466.0,
261,671.0,698.0,171.0,18460.0,
262,688.0,681.0,196.0,18435.0,
263,700.0,680.0,260.0,18360.0,
264,688.0,678.0,219.0,18415.0,
265,712.0,577.0,207.0,18504.0,
266,706.0,483.0,207.0,18604.0,
267,725.0,541.0,182.0,18552.0,
268,710.0,603.0,182.0,18505.0,
269,746.0,589.0,178.0,18487.0,
270,744.0,593.0,189.0,18474.0,
271,737.0,546.0,225.0,18492.0,
272,767.0,565.0,198.0,18470.0,
273,758.0,586.0,211.0,18445.0,
274,787.0,529.0,255.0,18429.0,
275,793.0,576.0,237.0,18394.0,
276,805.0,596.0,231.0,18368.0,
277,848.0,578.0,236.0,18338.0,
278,832.0,547.0,227.0,18394.0,
279,856.0,565.0,217.0,18362.0,
280,930.0,584.0,185.0,18301.0,
281,977.0,595.0,239.0,18189.0,
282,990.0,578.0,287.0,18145.0,
283,994.0,590.0,278.0,18138.0,
284,1008.0,684.0,215.0,18093.0,
285,1059.0,644.0,224.0,18073.0,
286,1120.0,711.0,240.0,17929.0,
287,1089.0,709.0,263.0,17939.0,
288,1041.0,735.0,361.0,17863.0,
289,1020.0,734.0,462.0,17784.0,
290,1029.0,840.0,441.0,17690.0,
291,1043.0,907.0,454.0,17596.0,
292,1054.0,925.0,481.0,17540.0,
293,1029.0,1062.0,420.0,17489.0,
294,1079.0,1135.0,332.0,17454.0,
295,1026.0,1165.0,442.0,17367.0,
296,1031.0,1215.0,460.0,17294.0,
297,984.0,1318.0,576.0,17122.0,
298,998.0,1341.0,601.0,17060.0,
299,1107.0,1405.0,607.0,16881.0,
300,1105.0,1412.0,638.0,16845.0,
301,1020.0,1386.0,676.0,16918.0,
302,1061.0,1349.0,648.0,16942.0,
303,994.0,1418.0,595.0,16993.0,
304,903.0,1490.0,639.0,16968.0,
305,858.0,1498.0,670.0,16974.0,
306,810.0,1601.0,583.0,17006.0,
307,725.0,1546.0,690.0,17039.0,
308,656.0,1540.0,615.0,17189.0,
309,641.0,1500.0,540.0,17319.0,
310,615.0,1438.0,540.0,17407.0,
311,604.0,1409.0,542.0,17445.0,
312,570.0,1349.0,516.0,17565.0,
313,578.0,1364.0,506.0,17552.0,
314,619.0,1281.0,409.0,17691.0,
315,663.0,1296.0,412.0,17629.0,
316,689.0,1188.0,488.0,17635.0,
317,687.0,1236.0,410.0,17667.0,
318,670.0,1207.0,434.0,17689.0,
319,701.0,1222.0,325.0,17752.0,
320,702.0,1202.0,345.0,17751.0,
321,665.0,1207.0,312.0,17816.0,
322,799.0,1204.0,363.0,17634.0,
323,967.0,1212.0,404.0,17417.0,
324,977.0,1176.0,365.0,17482.0,
325,1059.0,1196.0,397.0,17348.0,
326,1082.0,1142.0,345.0,17431.0,
327,1078.0,1061.0,386.0,17475.0,
328,1096.0,1073.0,373.0,17458.0,
329,1033.0,1101.0,448.0,17418.0,
330,1029.0,1126.0,357.0,17488.0,
331,1088.0,1054.0,426.0,17432.0,
332,1064.0,1099.0,455.0,17382.0,
333,1043.0,1017.0,508.0,17432.0,
334,947.0,1082.0,545.0,17426.0,
335,873.0,1045.0,573.0,17509.0,
336,826.0,1073.0,551.0,17550.0,
337,776.0,1021.0,623.0,17580.0,
338,756.0,1102.0,525.0,17617.0,
339,759.0,1089.0,575.0,17577.0,
340,714.0,1135.0,576.0,17575.0,
341,684.0,1134.0,535.0,17647.0,
342,645.0,1186.0,487.0,17682.0,
343,642.0,1220.0,505.0,17633.0,
344,635.0,1288.0,413.0,17664.0,
345,597.0,1330.0,453.0,17620.0,
346,575.0,1351.0,395.0,17679.0,
347,509.0,1294.0,453.0,17744.0,
348,473.0,1330.0,442.0,17755.0,
349,422.0,1303.0,425.0,17850.0,
350,438.0,1282.0,420.0,17860.0,
351,439.0,1210.0,382.0,17969.0,
352,422.0,1229.0,359.0,17990.0,
353,415.0,1073.0,365.0,18147.0,
354,438.0,1032.0,322.0,18208.0,
355,479.0,1046.0,310.0,18165.0,
356,487.0,1025.0,279.0,18209.0,
357,478.0,1037.0,246.0,18239.0,
358,516.0,1001.0,224.0,18259.0,
359,653.0,983.0,213.0,18151.0,
360,671.0,950.0,247.0,18132.0,
361,787.0,882.0,247.0,18084.0,
362,856.0,923.0,213.0,18008.0,
363,835.0,885.0,301.0,17979.0,
364,818.0,915.0,321.0,17946.0,
365,858.0,865.0,271.0,18006.0,
366,976.0,939.0,343.0,17742.0,
367,970.0,904.0,370.0,17756.0,
368,1014.0,973.0,324.0,17689.0,
369,1020.0,1009.0,227.0,17744.0,
370,989.0,971.0,302.0,17738.0,
371,982.0,1019.0,320.0,17679.0,
372,982.0,1034.0,274.0,17710.0,
373,956.0,996.0,368.0,17680.0,
374,905.0,999.0,438.0,17658.0,
375,875.0,1042.0,464.0,17619.0,
376,863.0,1075.0,458.0,17604.0,
377,872.0,1228.0,392.0,17508.0,
378,896.0,1293.0,320.0,17491.0,
379,839.0,1327.0,341.0,17493.0,
380,849.0,1385.0,371.0,17395.0,
381,850.0,1344.0,381.0,17425.0,
382,814.0,1318.0,446.0,17422.0,
383,845.0,1379.0,346.0,17430.0,
384,784.0,1357.0,400.0,17459.0,
385,758.0,1274.0,511.0,17457.0,
386,739.0,1383.0,441.0,17437.0,
387,738.0,1382.0,493.0,17387.0,
388,725.0,1412.0,544.0,17319.0,
389,706.0,1450.0,509.0,17335.0,
390,683.0,1363.0,578.0,17376.0,
391,621.0,1375.0,707.0,17297.0,
392,600.0,1377.0,674.0,17349.0,
393,561.0,1379.0,683.0,17377.0,
394,536.0,1493.0,644.0,17327.0,
395,511.0,1489.0,628.0,17372.0,
396,488.0,1406.0,697.0,17409.0,
397,532.0,1463.0,659.0,17346.0,
398,508.0,1502.0,618.0,17372.0,
399,514.0,1453.0,651.0,17382.0,
400,522.0,1465.0,630.0,17383.0,
401,563.0,1492.0,624.0,17321.0,
402,654.0,1573.0,544.0,17229.0,
403,642.0,1570.0,585.0,17203.0,
404,602.0,1544.0,556.0,17298.0,
405,546.0,1574.0,550.0,17330.0,
406,484.0,1395.0,627.0,17494.0,
407,503.0,1477.0,454.0,17566.0,
408,499.0,1421.0,470.0,17610.0,
409,479.0,1385.0,512.0,17624.0,
410,494.0,1413.0,434.0,17659.0,
411,575.0,1396.0,395.0,17634.0,
412,726.0,1350.0,398.0,17526.0,
413,723.0,1363.0,401.0,17513.0,
414,926.0,1371.0,394.0,17309.0,
415,977.0,1347.0,397.0,17279.0,
416,1007.0,1344.0,353.0,17296.0,
417,1054.0,1300.0,308.0,17338.0,
418,1150.0,1186.0,451.0,17213.0,
419,957.0,1119.0,653.0,17271.0,
420,862.0,1188.0,674.0,17276.0,
421,838.0,1192.0,657.0,17313.0,
422,850.0,1290.0,580.0,17280.0,
423,804.0,1320.0,564.0,17312.0,
424,716.0,1329.0,601.0,17354.0,
425,693.0,1369.0,575.0,17363.0,
426,709.0,1311.0,527.0,17453.0,
427,674.0,1279.0,531.0,17516.0,
428,698.0,1315.0,533.0,17454.0,
429,687.0,1375.0,490.0,17448.0,
430,693.0,1358.0,496.0,17453.0,
431,681.0,1350.0,497.0,17472.0,
432,708.0,1312.0,465.0,17515.0,
433,752.0,1248.0,494.0,17506.0,
434,732.0,1264.0,473.0,17531.0,
435,768.0,1260.0,458.0,17514.0,
436,774.0,1341.0,422.0,17463.0,
437,775.0,1303.0,459.0,17463.0,
438,789.0,1330.0,433.0,17448.0,
439,908.0,1312.0,496.0,17284.0,
440,947.0,1314.0,528.0,17211.0,
441,976.0,1405.0,575.0,17044.0,
442,1019.0,1545.0,553.0,16883.0,
443,892.0,1597.0,726.0,16785.0,
444,859.0,1619.0,783.0,16739.0,
445,908.0,1802.0,617.0,16673.0,
446,874.0,1934.0,602.0,16590.0,
447,812.0,1973.0,661.0,16554.0,
448,777.0,2011.0,802.0,16410.0,
449,702.0,2028.0,725.0,16545.0,
450,647.0,2049.0,695.0,16609.0,
451,717.0,2031.0,665.0,16587.0,
452,692.0,2052.0,637.0,16619.0,
453,659.0,2022.0,576.0,16743.0,
454,572.0,1961.0,669.0,16798.0,
455,553.0,1955.0,597.0,16895.0,
456,471.0,1973.0,617.0,16939.0,
457,442.0,1898.0,628.0,17032.0,
458,441.0,1838.0,596.0,17125.0,
459,424.0,1842.0,532.0,17202.0,
460,450.0,1864.0,541.0,17145.0,
461,504.0,1917.0,377.0,17202.0,
462,516.0,1893.0,289.0,17302.0,
463,614.0,1740.0,269.0,17377.0,
464,806.0,1691.0,310.0,17193.0,
465,731.0,1658.0,516.0,17095.0,
466,717.0,1710.0,522.0,17051.0,
467,694.0,1732.0,505.0,17069.0,
468,629.0,1855.0,404.0,17112.0,
469,622.0,1793.0,382.0,17203.0,
470,611.0,1831.0,417.0,17141.0,
471,554.0,1961.0,368.0,17117.0,
472,531.0,1812.0,426.0,17231.0,
473,545.0,1761.0,424.0,17270.0,
474,518.0,1796.0,402.0,17284.0,
475,544.0,1767.0,356.0,17333.0,
476,522.0,1677.0,360.0,17441.0,
477,500.0,1531.0,324.0,17645.0,
478,522.0,1332.0,290.0,17856.0,
479,694.0,1249.0,308.0,17749.0,
480,764.0,1115.0,286.0,17835.0,
481,708.0,1050.0,388.0,17854.0,
482,782.0,1003.0,355.0,17860.0,
483,825.0,904.0,382.0,17889.0,
484,830.0,884.0,412.0,17874.0,
485,814.0,971.0,331.0,17884.0,
486,786.0,922.0,364.0,17928.0,
487,754.0,941.0,325.0,17980.0,
488,816.0,923.0,273.0,17988.0,
489,906.0,815.0,346.0,17933.0,
490,930.0,831.0,381.0,17858.0,
491,930.0,762.0,312.0,17996.0,
492,915.0,820.0,248.0,18017.0,
493,889.0,762.0,272.0,18077.0,
494,897.0,760.0,313.0,18030.0,
495,902.0,751.0,346.0,18001.0,
496,866.0,796.0,333.0,18005.0,
497,841.0,772.0,308.0,18079.0,
498,836.0,852.0,257.0,18055.0,
499,838.0,822.0,280.0,18060.0,
500,813.0,862.0,287.0,18038.0,
501,796.0,883.0,320.0,18001.0,
502,813.0,795.0,327.0,18065.0,
503,798.0,828.0,327.0,18047.0,
504,797.0,828.0,341.0,18034.0,
505,777.0,836.0,392.0,17995.0,
506,777.0,878.0,384.0,17961.0,
507,778.0,957.0,340.0,17925.0,
508,781.0,949.0,302.0,17968.0,
509,735.0,940.0,265.0,18060.0,
510,706.0,903.0,318.0,18073.0,
511,691.0,940.0,330.0,18039.0,
512,664.0,977.0,305.0,18054.0,
513,659.0,926.0,314.0,18101.0,
514,675.0,917.0,327.0,18081.0,
515,678.0,968.0,242.0,18112.0,
516,665.0,1002.0,231.0,18102.0,
517,680.0,927.0,232.0,18161.0,
518,666.0,909.0,217.0,18208.0,
519,665.0,863.0,238.0,18234.0,
520,643.0,830.0,242.0,18285.0,
521,678.0,871.0,243.0,18208.0,
522,696.0,921.0,204.0,18179.0,
523,707.0,901.0,252.0,18140.0,
524,714.0,901.0,260.0,18125.0,
525,717.0,900.0,301.0,18082.0,
526,720.0,929.0,328.0,18023.0,
527,736.0,1000.0,316.0,17948.0,
528,703.0,977.0,376.0,17944.0,
529,717.0,1027.0,352.0,17904.0,
530,709.0,1094.0,311.0,17886.0,
531,857.0,1101.0,311.0,17731.0,
532,846.0,1122.0,321.0,17711.0,
533,857.0,1138.0,285.0,17720.0,
534,763.0,1131.0,441.0,17665.0,
535,772.0,1160.0,411.0,17657.0,
536,782.0,1150.0,473.0,17595.0,
537,771.0,1137.0,509.0,17583.0,
538,764.0,1126.0,512.0,17598.0,
539,747.0,1094.0,465.0,17694.0,
540,743.0,1089.0,447.0,17721.0,
541,820.0,1142.0,430.0,17608.0,
542,870.0,1117.0,464.0,17549.0,
543,830.0,1227.0,477.0,17466.0,
544,808.0,1368.0,415.0,17409.0,
545,790.0,1285.0,422.0,17503.0,
546,757.0,1273.0,444.0,17526.0,
547,777.0,1308.0,400.0,17515.0,
548,735.0,1400.0,421.0,17444.0,
549,688.0,1477.0,350.0,17485.0,
550,664.0,1458.0,382.0,17496.0,
551,694.0,1374.0,362.0,17570.0,
552,780.0,1318.0,369.0,17533.0,
553,807.0,1299.0,390.0,17504.0,
554,727.0,1297.0,413.0,17563.0,
555,635.0,1271.0,481.0,17613.0,
556,601.0,1342.0,431.0,17626.0,
557,591.0,1364.0,400.0,17645.0,
558,566.0,1388.0,327.0,17719.0,
559,576.0,1356.0,330.0,17738.0,
560,593.0,1312.0,330.0,17765.0,
561,556.0,1334.0,301.0,17809.0,
562,544.0,1257.0,343.0,17856.0,
563,537.0,1135.0,341.0,17987.0,
564,582.0,1069.0,265.0,18084.0,
565,605.0,955.0,279.0,18161.0,
566,631.0,868.0,311.0,18190.0,
567,639.0,907.0,283.0,18171.0,
568,667.0,891.0,277.0,18165.0,
569,692.0,884.0,292.0,18132.0,
570,720.0,885.0,293.0,18102.0,
571,791.0,852.0,342.0,18015.0,
572,849.0,804.0,351.0,17996.0,
573,901.0,838.0,359.0,17902.0,
574,1070.0,841.0,351.0,17738.0,
575,1060.0,893.0,459.0,17588.0,
576,983.0,920.0,581.0,17516.0,
577,997.0,983.0,563.0,17457.0,
578,963.0,974.0,592.0,17471.0,
579,948.0,1063.0,457.0,17532.0,
580,873.0,1200.0,484.0,17443.0,
581,865.0,1196.0,500.0,17439.0,
582,812.0,1249.0,487.0,17452.0,
583,840.0,1215.0,519.0,17426.0,
584,792.0,1169.0,488.0,17551.0,
585,835.0,1056.0,525.0,17584.0,
586,818.0,1104.0,484.0,17594.0,
587,860.0,1043.0,493.0,17604.0,
588,910.0,1006.0,539.0,17545.0,
589,969.0,1024.0,529.0,17478.0,
590,958.0,1021.0,510.0,17511.0,
591,997.0,1017.0,552.0,17434.0,
592,1010.0,1026.0,516.0,17448.0,
593,1015.0,1016.0,574.0,17395.0,
594,1056.0,1060.0,615.0,17269.0,
595,1113.0,1076.0,649.0,17162.0,
596,1111.0,1103.0,654.0,17132.0,
597,1105.0,1111.0,614.0,17170.0,
598,1139.0,1007.0,685.0,17169.0,
599,1106.0,999.0,655.0,17240.0,
600,1066.0,948.0,729.0,17257.0,
601,1041.0,937.0,724.0,17298.0,
602,970.0,958.0,752.0,17320.0,
603,994.0,1014.0,743.0,17249.0,
604,993.0,1081.0,637.0,17289.0,
605,941.0,1094.0,684.0,17281.0,
606,901.0,1114.0,609.0,17376.0,
607,875.0,1129.0,547.0,17449.0,
608,867.0,1178.0,489.0,17466.0,
609,839.0,1079.0,508.0,17574.0,
610,807.0,1097.0,491.0,17605.0,
611,778.0,1101.0,441.0,17680.0,
612,741.0,1037.0,442.0,17780.0,
613,695.0,1025.0,472.0,17808.0,
614,721.0,1041.0,437.0,17801.0,
615,711.0,1050.0,433.0,17806.0,
616,760.0,945.0,437.0,17858.0,
617,779.0,953.0,443.0,17825.0,
618,795.0,965.0,439.0,17801.0,
619,791.0,971.0,382.0,17856.0,
620,850.0,909.0,402.0,17839.0,
621,857.0,963.0,369.0,17811.0,
622,852.0,994.0,401.0,17753.0,
623,843.0,986.0,387.0,17784.0,
624,903.0,950.0,419.0,17728.0,
625,894.0,963.0,388.0,17755.0,
626,885.0,1027.0,377.0,17711.0,
627,967.0,1058.0,372.0,17603.0,
628,985.0,1013.0,507.0,17495.0,
629,1002.0,1066.0,508.0,17424.0,
630,943.0,1084.0,498.0,17475.0,
631,941.0,1056.0,543.0,17460.0,
632,904.0,1061.0,541.0,17494.0,
633,870.0,1057.0,577.0,17496.0,
634,857.0,1079.0,586.0,17478.0,
635,829.0,1213.0,513.0,17445.0,
636,802.0,1152.0,590.0,17456.0,
637,805.0,1173.0,507.0,17515.0,
638,803.0,1182.0,574.0,17441.0,
639,816.0,1169.0,545.0,17470.0,
640,798.0,1214.0,474.0,17514.0,
641,767.0,1223.0,457.0,17553.0,
642,798.0,1224.0,503.0,17475.0,
643,769.0,1207.0,495.0,17529.0,
644,783.0,1237.0,433.0,17547.0,
645,766.0,1276.0,404.0,17554.0,
646,738.0,1286.0,432.0,17544.0,
647,728.0,1219.0,528.0,17525.0,
648,745.0,1215.0,483.0,17557.0,
649,712.0,1210.0,495.0,17583.0,
650,740.0,1257.0,484.0,17519.0,
651,753.0,1261.0,451.0,17535.0,
652,797.0,1187.0,440.0,17576.0,
653,821.0,1154.0,469.0,17556.0,
654,843.0,1161.0,469.0,17527.0,
655,843.0,1089.0,528.0,17540.0,
656,890.0,1141.0,481.0,17488.0,
657,894.0,1094.0,528.0,17484.0,
658,887.0,1096.0,577.0,17440.0,
659,903.0,1086.0,578.0,17433.0,
660,905.0,1151.0,564.0,17380.0,
661,917.0,1140.0,569.0,17374.0,
662,904.0,1167.0,533.0,17396.0,
663,881.0,1260.0,516.0,17343.0,
664,860.0,1250.0,573.0,17317.0,
665,844.0,1278.0,528.0,17350.0,
666,804.0,1273.0,531.0,17392.0,
667,800.0,1262.0,528.0,17410.0,
668,764.0,1311.0,521.0,17404.0,
669,709.0,1324.0,545.0,17422.0,
670,665.0,1339.0,582.0,17414.0,
671,665.0,1281.0,598.0,17456.0,
672,678.0,1273.0,470.0,17579.0,
673,749.0,1271.0,419.0,17561.0,
674,755.0,1273.0,368.0,17604.0,
675,667.0,1183.0,477.0,17673.0,
676,647.0,1121.0,482.0,17750.0,
677,630.0,1145.0,416.0,17809.0,
678,614.0,1049.0,423.0,17914.0,
679,564.0,1097.0,444.0,17895.0,
680,537.0,1073.0,462.0,17928.0,
681,535.0,1066.0,444.0,17955.0,
682,530.0,989.0,412.0,18069.0,
683,512.0,1044.0,344.0,18100.0,
684,523.0,1036.0,339.0,18102.0,
685,528.0,1061.0,296.0,18115.0,
686,529.0,1025.0,316.0,18130.0,
687,531.0,946.0,305.0,18218.0,
688,587.0,952.0,265.0,18196.0,
689,636.0,880.0,240.0,18244.0,
690,710.0,920.0,287.0,18083.0,
691,730.0,916.0,272.0,18082.0,
692,754.0,938.0,288.0,18020.0,
693,768.0,969.0,269.0,17994.0,
694,771.0,938.0,283.0,18008.0,
695,759.0,928.0,264.0,18049.0,
696,763.0,926.0,256.0,18055.0,
697,753.0,965.0,240.0,18042.0,
698,739.0,969.0,231.0,18061.0,
699,735.0,976.0,252.0,18037.0,
700,715.0,983.0,268.0,18034.0,
701,699.0,999.0,217.0,18085.0,
702,664.0,981.0,227.0,18128.0,
703,671.0,980.0,178.0,18171.0,
704,652.0,875.0,255.0,18218.0,
705,658.0,849.0,193.0,18300.0,
706,666.0,862.0,225.0,18247.0,
707,692.0,810.0,224.0,18274.0,
708,774.0,837.0,215.0,18174.0,
709,770.0,876.0,244.0,18110.0,
710,758.0,865.0,275.0,18102.0,
711,920.0,870.0,286.0,17924.0,
712,1037.0,804.0,360.0,17799.0,
713,1057.0,813.0,334.0,17796.0,
714,1127.0,832.0,379.0,17662.0,
715,999.0,878.0,566.0,17557.0,
716,1026.0,888.0,509.0,17577.0,
717,1028.0,943.0,450.0,17579.0,
718,1081.0,991.0,412.0,17516.0,
719,1034.0,1024.0,465.0,17477.0,
720,1066.0,1144.0,396.0,17394.0,
721,987.0,1151.0,470.0,17392.0,
722,991.0,1223.0,461.0,17325.0,
723,953.0,1246.0,485.0,17316.0,
724,923.0,1306.0,473.0,17298.0,
725,900.0,1340.0,444.0,17316.0,
726,868.0,1421.0,482.0,17229.0,
727,880.0,1455.0,568.0,17097.0,
728,856.0,1526.0,560.0,17058.0,
729,831.0,1588.0,485.0,17096.0,
730,774.0,1600.0,526.0,17100.0,
