jour,S,I,E,R,
0,19980.0,20.0,0.0,0.0,
1,19965.0,20.0,15.0,0.0,
2,19897.0,29.0,74.0,0.0,
3,19776.0,46.0,176.0,2.0,
4,19606.0,84.0,303.0,7.0,
5,19275.0,143.0,538.0,44.0,
6,18647.0,266.0,1025.0,62.0,
7,17377.0,558.0,1964.0,101.0,
8,15476.0,1105.0,3253.0,166.0,
9,12384.0,2066.0,5158.0,392.0,
10,8351.0,3404.0,7475.0,770.0,
11,3868.0,5264.0,9530.0,1338.0,
12,1565.0,6642.0,9628.0,2165.0,
13,296.0,8776.0,7623.0,3305.0,
14,46.0,10134.0,5559.0,4261.0,
15,2.0,10728.0,3518.0,5752.0,
16,0.0,10758.0,2382.0,6860.0,
17,6.0,9945.0,1844.0,8205.0,
18,0.0,9174.0,1061.0,9765.0,
19,7.0,8551.0,682.0,10760.0,
20,11.0,7705.0,632.0,11652.0,
21,49.0,7057.0,503.0,12391.0,
22,89.0,6824.0,398.0,12689.0,
23,46.0,6158.0,369.0,13427.0,
24,110.0,5603.0,216.0,14071.0,
25,146.0,4803.0,232.0,14819.0,
26,241.0,4064.0,310.0,15385.0,
27,205.0,3563.0,438.0,15794.0,
28,400.0,3304.0,466.0,15830.0,
29,304.0,3256.0,454.0,15986.0,
30,352.0,3157.0,261.0,16230.0,
31,412.0,3127.0,247.0,16214.0,
32,472.0,3000.0,148.0,16380.0,
33,400.0,2716.0,222.0,16662.0,
34,477.0,2587.0,370.0,16566.0,
35,403.0,2520.0,192.0,16885.0,
36,382.0,2489.0,154.0,16975.0,
37,340.0,1899.0,189.0,17572.0,
38,241.0,1606.0,204.0,17949.0,
39,255.0,1569.0,119.0,18057.0,
40,263.0,1148.0,177.0,18412.0,
41,306.0,778.0,175.0,18741.0,
42,470.0,725.0,186.0,18619.0,
43,550.0,596.0,204.0,18650.0,
44,548.0,492.0,216.0,18744.0,
45,584.0,410.0,165.0,18841.0,
46,626.0,466.0,141.0,18767.0,
47,803.0,438.0,142.0,18617.0,
48,855.0,395.0,161.0,18589.0,
49,999.0,381.0,100.0,18520.0,
50,1066.0,349.0,108.0,18477.0,
51,1111.0,312.0,96.0,18481.0,
52,1129.0,267.0,106.0,18498.0,
53,1222.0,293.0,151.0,18334.0,
54,1270.0,294.0,144.0,18292.0,
55,1339.0,245.0,136.0,18280.0,
56,1439.0,280.0,130.0,18151.0,
57,1588.0,280.0,154.0,17978.0,
58,1601.0,311.0,195.0,17893.0,
59,1722.0,308.0,166.0,17804.0,
60,1739.0,298.0,256.0,17707.0,
61,1783.0,414.0,249.0,17554.0,
62,1707.0,419.0,275.0,17599.0,
63,1625.0,481.0,331.0,17563.0,
64,1563.0,526.0,273.0,17638.0,
65,1567.0,596.0,279.0,17558.0,
66,1493.0,587.0,262.0,17658.0,
67,1570.0,542.0,255.0,17633.0,
68,1541.0,601.0,239.0,17619.0,
69,1669.0,570.0,288.0,17473.0,
70,1802.0,631.0,298.0,17269.0,
71,1655.0,691.0,389.0,17265.0,
72,1605.0,631.0,403.0,17361.0,
73,1577.0,740.0,290.0,17393.0,
74,1385.0,718.0,430.0,17467.0,
75,1236.0,570.0,555.0,17639.0,
76,1180.0,736.0,428.0,17656.0,
77,1095.0,691.0,505.0,17709.0,
78,1047.0,727.0,457.0,17769.0,
79,1018.0,838.0,385.0,17759.0,
80,969.0,944.0,370.0,17717.0,
81,896.0,955.0,365.0,17784.0,
82,882.0,1055.0,345.0,17718.0,
83,815.0,1107.0,336.0,17742.0,
84,835.0,1098.0,323.0,17744.0,
85,775.0,1207.0,349.0,17669.0,
86,739.0,1175.0,300.0,17786.0,
87,731.0,1160.0,229.0,17880.0,
88,700.0,1209.0,342.0,17749.0,
89,681.0,1091.0,396.0,17832.0,
90,803.0,1176.0,235.0,17786.0,
91,858.0,1116.0,251.0,17775.0,
92,868.0,995.0,328.0,17809.0,
93,880.0,1015.0,278.0,17827.0,
94,842.0,975.0,360.0,17823.0,
95,811.0,971.0,352.0,17866.0,
96,851.0,1010.0,272.0,17867.0,
97,888.0,1017.0,245.0,17850.0,
98,866.0,1016.0,260.0,17858.0,
99,917.0,1012.0,256.0,17815.0,
100,925.0,898.0,276.0,17901.0,
101,948.0,887.0,223.0,17942.0,
102,898.0,861.0,305.0,17936.0,
103,920.0,807.0,241.0,18032.0,
104,890.0,771.0,278.0,18061.0,
105,880.0,840.0,253.0,18027.0,
106,867.0,794.0,278.0,18061.0,
107,874.0,828.0,279.0,18019.0,
108,935.0,824.0,275.0,17966.0,
109,886.0,780.0,282.0,18052.0,
110,929.0,856.0,170.0,18045.0,
111,1087.0,837.0,224.0,17852.0,
112,1171.0,866.0,236.0,17727.0,
113,1191.0,897.0,247.0,17665.0,
114,1171.0,879.0,334.0,17616.0,
115,1127.0,868.0,375.0,17630.0,
116,1004.0,882.0,545.0,17569.0,
117,969.0,891.0,485.0,17655.0,
118,910.0,935.0,480.0,17675.0,
119,910.0,933.0,503.0,17654.0,
120,918.0,948.0,521.0,17613.0,
121,879.0,961.0,409.0,17751.0,
122,892.0,919.0,361.0,17828.0,
123,879.0,827.0,378.0,17916.0,
124,829.0,897.0,339.0,17935.0,
125,822.0,886.0,306.0,17986.0,
126,800.0,877.0,273.0,18050.0,
127,811.0,876.0,264.0,18049.0,
128,886.0,875.0,217.0,18022.0,
129,1000.0,807.0,325.0,17868.0,
130,985.0,873.0,295.0,17847.0,
131,996.0,846.0,315.0,17843.0,
132,1010.0,806.0,377.0,17807.0,
133,1113.0,836.0,381.0,17670.0,
134,1111.0,875.0,369.0,17645.0,
135,1180.0,889.0,357.0,17574.0,
136,1215.0,808.0,402.0,17575.0,
137,1268.0,801.0,472.0,17459.0,
138,1290.0,847.0,357.0,17506.0,
139,1199.0,836.0,468.0,17497.0,
140,1179.0,863.0,413.0,17545.0,
141,1161.0,945.0,434.0,17460.0,
142,1068.0,1064.0,459.0,17409.0,
143,1061.0,1055.0,431.0,17453.0,
144,1031.0,1101.0,446.0,17422.0,
145,956.0,1041.0,441.0,17562.0,
146,911.0,1192.0,368.0,17529.0,
147,811.0,1205.0,441.0,17543.0,
148,802.0,1172.0,457.0,17569.0,
149,763.0,1334.0,325.0,17578.0,
150,700.0,1287.0,360.0,17653.0,
151,687.0,1196.0,310.0,17807.0,
152,670.0,1194.0,270.0,17866.0,
153,776.0,1080.0,266.0,17878.0,
154,793.0,1048.0,269.0,17890.0,
155,798.0,993.0,248.0,17961.0,
156,912.0,892.0,265.0,17931.0,
157,1031.0,860.0,275.0,17834.0,
158,1043.0,831.0,358.0,17768.0,
159,955.0,860.0,446.0,17739.0,
160,936.0,910.0,387.0,17767.0,
161,929.0,845.0,417.0,17809.0,
162,931.0,912.0,399.0,17758.0,
163,989.0,1060.0,311.0,17640.0,
164,988.0,1050.0,366.0,17596.0,
165,953.0,1069.0,352.0,17626.0,
166,959.0,1110.0,408.0,17523.0,
167,904.0,1095.0,480.0,17521.0,
168,885.0,1111.0,458.0,17546.0,
169,892.0,1179.0,402.0,17527.0,
170,900.0,1256.0,411.0,17433.0,
171,876.0,1244.0,347.0,17533.0,
172,809.0,1196.0,388.0,17607.0,
173,844.0,1152.0,414.0,17590.0,
174,868.0,1190.0,316.0,17626.0,
175,876.0,1192.0,286.0,17646.0,
176,826.0,1229.0,331.0,17614.0,
177,794.0,1189.0,403.0,17614.0,
178,764.0,1281.0,301.0,17654.0,
179,874.0,1374.0,308.0,17444.0,
180,886.0,1349.0,348.0,17417.0,
181,845.0,1414.0,328.0,17413.0,
182,842.0,1414.0,365.0,17379.0,
183,798.0,1412.0,459.0,17331.0,
184,818.0,1460.0,397.0,17325.0,
185,815.0,1358.0,418.0,17409.0,
186,953.0,1252.0,455.0,17340.0,
187,927.0,1250.0,554.0,17269.0,
188,904.0,1284.0,493.0,17319.0,
189,836.0,1213.0,570.0,17381.0,
190,905.0,1238.0,573.0,17284.0,
191,934.0,1232.0,520.0,17314.0,
192,922.0,1176.0,587.0,17315.0,
193,1098.0,1177.0,606.0,17119.0,
194,1138.0,1153.0,572.0,17137.0,
195,1256.0,1114.0,657.0,16973.0,
196,1243.0,1265.0,559.0,16933.0,
197,1254.0,1291.0,612.0,16843.0,
198,1163.0,1339.0,759.0,16739.0,
199,1146.0,1411.0,805.0,16638.0,
200,1021.0,1489.0,882.0,16608.0,
201,969.0,1600.0,872.0,16559.0,
202,941.0,1769.0,728.0,16562.0,
203,1012.0,1798.0,730.0,16460.0,
204,907.0,2014.0,691.0,16388.0,
205,776.0,2108.0,629.0,16487.0,
206,734.0,2164.0,541.0,16561.0,
207,817.0,2134.0,502.0,16547.0,
208,892.0,2095.0,472.0,16541.0,
209,885.0,1961.0,507.0,16647.0,
210,948.0,1925.0,409.0,16718.0,
211,1033.0,1941.0,342.0,16684.0,
212,1037.0,1718.0,403.0,16842.0,
213,1013.0,1719.0,448.0,16820.0,
214,966.0,1677.0,552.0,16805.0,
215,890.0,1554.0,639.0,16917.0,
216,788.0,1661.0,529.0,17022.0,
217,797.0,1518.0,578.0,17107.0,
218,748.0,1567.0,551.0,17134.0,
219,752.0,1657.0,518.0,17073.0,
220,722.0,1596.0,545.0,17137.0,
221,688.0,1538.0,560.0,17214.0,
222,729.0,1295.0,531.0,17445.0,
223,717.0,1331.0,442.0,17510.0,
224,734.0,1263.0,413.0,17590.0,
225,736.0,1203.0,412.0,17649.0,
226,835.0,1219.0,377.0,17569.0,
227,940.0,1091.0,409.0,17560.0,
228,988.0,1072.0,331.0,17609.0,
229,1078.0,971.0,404.0,17547.0,
230,1110.0,942.0,326.0,17622.0,
231,1119.0,870.0,392.0,17619.0,
232,1095.0,980.0,400.0,17525.0,
233,1022.0,990.0,410.0,17578.0,
234,963.0,989.0,349.0,17699.0,
235,940.0,929.0,392.0,17739.0,
236,1013.0,876.0,410.0,17701.0,
237,1022.0,901.0,308.0,17769.0,
238,1031.0,791.0,341.0,17837.0,
239,1012.0,829.0,321.0,17838.0,
240,970.0,855.0,342.0,17833.0,
241,1001.0,807.0,303.0,17889.0,
242,978.0,818.0,293.0,17911.0,
243,942.0,797.0,338.0,17923.0,
244,949.0,748.0,335.0,17968.0,
245,1003.0,777.0,274.0,17946.0,
246,1011.0,740.0,252.0,17997.0,
247,1088.0,677.0,249.0,17986.0,
248,1268.0,666.0,251.0,17815.0,
249,1326.0,663.0,350.0,17661.0,
250,1319.0,693.0,251.0,17737.0,
251,1430.0,630.0,276.0,17664.0,
252,1493.0,706.0,222.0,17579.0,
253,1560.0,644.0,320.0,17476.0,
254,1570.0,707.0,312.0,17411.0,
255,1601.0,723.0,379.0,17297.0,
256,1527.0,728.0,455.0,17290.0,
257,1474.0,780.0,458.0,17288.0,
258,1539.0,876.0,398.0,17187.0,
259,1600.0,898.0,366.0,17136.0,
260,1779.0,963.0,396.0,16862.0,
261,1732.0,957.0,494.0,16817.0,
262,1702.0,1039.0,518.0,16741.0,
263,1590.0,1132.0,564.0,16714.0,
264,1587.0,1186.0,542.0,16685.0,
265,1494.0,1321.0,521.0,16664.0,
266,1366.0,1308.0,627.0,16699.0,
267,1209.0,1441.0,660.0,16690.0,
268,1119.0,1560.0,560.0,16761.0,
269,1184.0,1631.0,606.0,16579.0,
270,1122.0,1569.0,727.0,16582.0,
271,1066.0,1631.0,630.0,16673.0,
272,883.0,1687.0,791.0,16639.0,
273,754.0,1651.0,732.0,16863.0,
274,700.0,1683.0,687.0,16930.0,
275,658.0,1751.0,614.0,16977.0,
276,621.0,1551.0,661.0,17167.0,
277,622.0,1592.0,554.0,17232.0,
278,601.0,1506.0,507.0,17386.0,
279,597.0,1520.0,419.0,17464.0,
280,618.0,1495.0,420.0,17467.0,
281,605.0,1474.0,385.0,17536.0,
282,622.0,1420.0,361.0,17597.0,
283,642.0,1406.0,339.0,17613.0,
284,669.0,1378.0,344.0,17609.0,
285,648.0,1233.0,384.0,17735.0,
286,654.0,1305.0,341.0,17700.0,
287,645.0,1317.0,326.0,17712.0,
288,648.0,1364.0,216.0,17772.0,
289,654.0,1316.0,284.0,17746.0,
290,650.0,1305.0,299.0,17746.0,
291,639.0,1341.0,298.0,17722.0,
292,648.0,1274.0,316.0,17762.0,
293,647.0,1269.0,306.0,17778.0,
294,624.0,1210.0,297.0,17869.0,
295,656.0,1150.0,278.0,17916.0,
296,656.0,1182.0,240.0,17922.0,
297,684.0,1142.0,284.0,17890.0,
298,669.0,1123.0,257.0,17951.0,
299,683.0,1129.0,283.0,17905.0,
300,703.0,1091.0,244.0,17962.0,
301,726.0,1115.0,241.0,17918.0,
302,828.0,1154.0,246.0,17772.0,
303,840.0,1166.0,327.0,17667.0,
304,863.0,1112.0,441.0,17584.0,
305,904.0,1171.0,403.0,17522.0,
306,940.0,1207.0,358.0,17495.0,
307,958.0,1190.0,367.0,17485.0,
308,1000.0,1167.0,359.0,17474.0,
309,1011.0,1244.0,351.0,17394.0,
310,956.0,1270.0,420.0,17354.0,
311,959.0,1230.0,458.0,17353.0,
312,914.0,1312.0,467.0,17307.0,
313,1029.0,1337.0,429.0,17205.0,
314,1157.0,1361.0,448.0,17034.0,
315,1121.0,1422.0,517.0,16940.0,
316,1107.0,1559.0,390.0,16944.0,
317,1002.0,1553.0,541.0,16904.0,
318,976.0,1497.0,467.0,17060.0,
319,971.0,1523.0,478.0,17028.0,
320,994.0,1461.0,459.0,17086.0,
321,1008.0,1508.0,485.0,16999.0,
322,980.0,1515.0,544.0,16961.0,
323,962.0,1542.0,603.0,16893.0,
324,917.0,1637.0,667.0,16779.0,
325,888.0,1660.0,508.0,16944.0,
326,876.0,1688.0,490.0,16946.0,
327,937.0,1619.0,493.0,16951.0,
328,1063.0,1520.0,531.0,16886.0,
329,1052.0,1523.0,574.0,16851.0,
330,953.0,1508.0,820.0,16719.0,
331,914.0,1644.0,694.0,16748.0,
332,925.0,1738.0,654.0,16683.0,
333,869.0,1794.0,602.0,16735.0,
334,834.0,1785.0,560.0,16821.0,
335,736.0,1770.0,617.0,16877.0,
336,704.0,1721.0,690.0,16885.0,
337,679.0,1623.0,754.0,16944.0,
338,678.0,1603.0,591.0,17128.0,
339,701.0,1654.0,615.0,17030.0,
340,708.0,1662.0,579.0,17051.0,
341,724.0,1690.0,514.0,17072.0,
342,757.0,1714.0,450.0,17079.0,
343,857.0,1636.0,454.0,17053.0,
344,799.0,1664.0,523.0,17014.0,
345,783.0,1683.0,513.0,17021.0,
346,847.0,1726.0,490.0,16937.0,
347,821.0,1768.0,501.0,16910.0,
348,812.0,1805.0,444.0,16939.0,
349,679.0,1788.0,541.0,16992.0,
350,691.0,1784.0,564.0,16961.0,
351,691.0,1687.0,578.0,17044.0,
352,658.0,1639.0,557.0,17146.0,
353,666.0,1602.0,520.0,17212.0,
354,661.0,1595.0,405.0,17339.0,
355,624.0,1548.0,488.0,17340.0,
356,626.0,1498.0,516.0,17360.0,
357,602.0,1488.0,432.0,17478.0,
358,607.0,1378.0,505.0,17510.0,
359,670.0,1321.0,457.0,17552.0,
360,643.0,1310.0,481.0,17566.0,
361,649.0,1257.0,516.0,17578.0,
362,826.0,1193.0,498.0,17483.0,
363,937.0,1133.0,477.0,17453.0,
364,959.0,1053.0,478.0,17510.0,
365,1021.0,964.0,486.0,17529.0,
366,1049.0,1038.0,503.0,17410.0,
367,1089.0,992.0,548.0,17371.0,
368,1176.0,982.0,559.0,17283.0,
369,1114.0,1074.0,553.0,17259.0,
370,1042.0,1118.0,593.0,17247.0,
371,1016.0,1235.0,506.0,17243.0,
372,938.0,1243.0,559.0,17260.0,
373,856.0,1259.0,653.0,17232.0,
374,795.0,1327.0,660.0,17218.0,
375,764.0,1390.0,636.0,17210.0,
376,719.0,1366.0,667.0,17248.0,
377,684.0,1487.0,570.0,17259.0,
378,628.0,1583.0,609.0,17180.0,
379,695.0,1749.0,475.0,17081.0,
380,715.0,1739.0,518.0,17028.0,
381,723.0,1771.0,570.0,16936.0,
382,709.0,1802.0,563.0,16926.0,
383,682.0,1813.0,562.0,16943.0,
384,684.0,1681.0,558.0,17077.0,
385,732.0,1710.0,541.0,17017.0,
386,756.0,1577.0,595.0,17072.0,
387,753.0,1601.0,542.0,17104.0,
388,743.0,1541.0,553.0,17163.0,
389,759.0,1563.0,482.0,17196.0,
390,782.0,1566.0,395.0,17257.0,
391,792.0,1528.0,450.0,17230.0,
392,890.0,1481.0,520.0,17109.0,
393,953.0,1479.0,531.0,17037.0,
394,950.0,1406.0,503.0,17141.0,
395,988.0,1376.0,532.0,17104.0,
396,1060.0,1305.0,579.0,17056.0,
397,1172.0,1322.0,583.0,16923.0,
398,1160.0,1416.0,500.0,16924.0,
399,1141.0,1434.0,400.0,17025.0,
400,1057.0,1405.0,468.0,17070.0,
401,1104.0,1435.0,423.0,17038.0,
402,1058.0,1299.0,470.0,17173.0,
403,1044.0,1266.0,469.0,17221.0,
404,1034.0,1251.0,494.0,17221.0,
405,981.0,1325.0,517.0,17177.0,
406,1048.0,1441.0,372.0,17139.0,
407,904.0,1427.0,482.0,17187.0,
408,837.0,1499.0,412.0,17252.0,
409,847.0,1373.0,354.0,17426.0,
410,882.0,1256.0,346.0,17516.0,
411,966.0,1045.0,403.0,17586.0,
412,1038.0,1018.0,388.0,17556.0,
413,1074.0,1090.0,370.0,17466.0,
414,1080.0,1046.0,410.0,17464.0,
415,1088.0,1133.0,418.0,17361.0,
416,1080.0,1204.0,474.0,17242.0,
417,1106.0,1275.0,526.0,17093.0,
418,1114.0,1358.0,482.0,17046.0,
419,1158.0,1441.0,421.0,16980.0,
420,1166.0,1350.0,546.0,16938.0,
421,1205.0,1391.0,475.0,16929.0,
422,1157.0,1352.0,572.0,16919.0,
423,1061.0,1530.0,464.0,16945.0,
424,1044.0,1495.0,445.0,17016.0,
425,888.0,1418.0,549.0,17145.0,
426,848.0,1324.0,612.0,17216.0,
427,826.0,1302.0,537.0,17335.0,
428,795.0,1277.0,473.0,17455.0,
429,801.0,1284.0,352.0,17563.0,
430,776.0,1257.0,318.0,17649.0,
431,767.0,1229.0,288.0,17716.0,
432,713.0,1246.0,310.0,17731.0,
433,727.0,1200.0,312.0,17761.0,
434,750.0,1153.0,294.0,17803.0,
435,740.0,1132.0,327.0,17801.0,
436,752.0,1050.0,350.0,17848.0,
437,778.0,1026.0,288.0,17908.0,
438,792.0,978.0,354.0,17876.0,
439,823.0,960.0,383.0,17834.0,
440,879.0,981.0,353.0,17787.0,
441,903.0,963.0,317.0,17817.0,
442,919.0,964.0,324.0,17793.0,
443,939.0,885.0,330.0,17846.0,
444,1009.0,772.0,323.0,17896.0,
445,1118.0,709.0,324.0,17849.0,
446,1196.0,729.0,307.0,17768.0,
447,1362.0,742.0,300.0,17596.0,
448,1470.0,689.0,341.0,17500.0,
449,1577.0,715.0,365.0,17343.0,
450,1551.0,709.0,532.0,17208.0,
451,1618.0,758.0,519.0,17105.0,
452,1642.0,738.0,509.0,17111.0,
453,1632.0,794.0,487.0,17087.0,
454,1578.0,775.0,541.0,17106.0,
455,1550.0,821.0,596.0,17033.0,
456,1513.0,803.0,665.0,17019.0,
457,1461.0,931.0,531.0,17077.0,
458,1421.0,999.0,563.0,17017.0,
459,1422.0,1034.0,571.0,16973.0,
460,1358.0,967.0,593.0,17082.0,
461,1311.0,1080.0,491.0,17118.0,
462,1263.0,1166.0,474.0,17097.0,
463,1336.0,1139.0,563.0,16962.0,
464,1403.0,1070.0,583.0,16944.0,
465,1379.0,1077.0,621.0,16923.0,
466,1357.0,1102.0,653.0,16888.0,
467,1253.0,1169.0,745.0,16833.0,
468,1107.0,1241.0,790.0,16862.0,
469,1064.0,1299.0,678.0,16959.0,
470,1015.0,1324.0,737.0,16924.0,
471,1017.0,1274.0,682.0,17027.0,
472,968.0,1328.0,684.0,17020.0,
473,899.0,1380.0,676.0,17045.0,
474,868.0,1435.0,601.0,17096.0,
475,785.0,1581.0,496.0,17138.0,
476,732.0,1524.0,579.0,17165.0,
477,735.0,1650.0,520.0,17095.0,
478,737.0,1637.0,532.0,17094.0,
479,710.0,1659.0,550.0,17081.0,
480,665.0,1727.0,441.0,17167.0,
481,654.0,1820.0,378.0,17148.0,
482,646.0,1837.0,337.0,17180.0,
483,656.0,1673.0,357.0,17314.0,
484,652.0,1641.0,313.0,17394.0,
485,629.0,1626.0,334.0,17411.0,
486,636.0,1568.0,358.0,17438.0,
487,643.0,1524.0,315.0,17518.0,
488,652.0,1484.0,317.0,17547.0,
489,714.0,1514.0,254.0,17518.0,
490,813.0,1501.0,281.0,17405.0,
491,807.0,1343.0,278.0,17572.0,
492,947.0,1260.0,318.0,17475.0,
493,1029.0,1244.0,415.0,17312.0,
494,1067.0,1284.0,359.0,17290.0,
495,1082.0,1305.0,372.0,17241.0,
496,1001.0,1272.0,534.0,17193.0,
497,968.0,1247.0,613.0,17172.0,
498,936.0,1291.0,584.0,17189.0,
499,874.0,1252.0,643.0,17231.0,
500,857.0,1273.0,583.0,17287.0,
501,837.0,1263.0,576.0,17324.0,
502,836.0,1360.0,475.0,17329.0,
503,840.0,1464.0,412.0,17284.0,
504,841.0,1526.0,400.0,17233.0,
505,807.0,1571.0,353.0,17269.0,
506,804.0,1562.0,356.0,17278.0,
507,761.0,1532.0,440.0,17267.0,
508,750.0,1571.0,430.0,17249.0,
509,765.0,1609.0,349.0,17277.0,
510,754.0,1491.0,395.0,17360.0,
511,886.0,1455.0,346.0,17313.0,
512,890.0,1401.0,292.0,17417.0,
513,1080.0,1314.0,351.0,17255.0,
514,1116.0,1206.0,413.0,17265.0,
515,1237.0,1235.0,365.0,17163.0,
516,1247.0,1270.0,324.0,17159.0,
517,1293.0,1225.0,335.0,17147.0,
518,1329.0,1195.0,419.0,17057.0,
519,1318.0,1135.0,472.0,17075.0,
520,1251.0,1153.0,629.0,16967.0,
521,1306.0,1174.0,608.0,16912.0,
522,1268.0,1249.0,602.0,16881.0,
523,1297.0,1331.0,542.0,16830.0,
524,1285.0,1309.0,575.0,16831.0,
525,1272.0,1280.0,686.0,16762.0,
526,1208.0,1269.0,720.0,16803.0,
527,1186.0,1272.0,658.0,16884.0,
528,1104.0,1187.0,725.0,16984.0,
529,1131.0,1223.0,719.0,16927.0,
530,1061.0,1297.0,718.0,16924.0,
531,1096.0,1345.0,716.0,16843.0,
532,1085.0,1415.0,733.0,16767.0,
533,1012.0,1376.0,783.0,16829.0,
534,1123.0,1328.0,755.0,16794.0,
535,1121.0,1290.0,728.0,16861.0,
536,1107.0,1338.0,675.0,16880.0,
537,1096.0,1396.0,618.0,16890.0,
538,1046.0,1385.0,772.0,16797.0,
539,1022.0,1442.0,766.0,16770.0,
540,990.0,1471.0,680.0,16859.0,
541,1100.0,1583.0,578.0,16739.0,
542,967.0,1535.0,740.0,16758.0,
543,893.0,1713.0,665.0,16729.0,
544,833.0,1823.0,619.0,16725.0,
545,797.0,1860.0,521.0,16822.0,
546,737.0,1801.0,556.0,16906.0,
547,666.0,1867.0,524.0,16943.0,
548,613.0,1886.0,509.0,16992.0,
549,568.0,1927.0,493.0,17012.0,
550,527.0,1950.0,430.0,17093.0,
551,506.0,1920.0,401.0,17173.0,
552,530.0,1872.0,403.0,17195.0,
553,503.0,1801.0,451.0,17245.0,
554,515.0,1695.0,396.0,17394.0,
555,518.0,1636.0,383.0,17463.0,
556,514.0,1603.0,344.0,17539.0,
557,526.0,1532.0,325.0,17617.0,
558,575.0,1472.0,311.0,17642.0,
559,597.0,1414.0,288.0,17701.0,
560,634.0,1336.0,297.0,17733.0,
561,662.0,1197.0,318.0,17823.0,
562,816.0,1093.0,305.0,17786.0,
563,903.0,1083.0,304.0,17710.0,
564,939.0,966.0,376.0,17719.0,
565,1030.0,961.0,373.0,17636.0,
566,1068.0,969.0,438.0,17525.0,
567,1081.0,920.0,547.0,17452.0,
568,1105.0,1025.0,464.0,17406.0,
569,1096.0,1056.0,462.0,17386.0,
570,1097.0,1049.0,500.0,17354.0,
571,1117.0,1092.0,497.0,17294.0,
572,1088.0,1015.0,546.0,17351.0,
573,1079.0,1019.0,491.0,17411.0,
574,1083.0,1077.0,434.0,17406.0,
575,1089.0,1051.0,430.0,17430.0,
576,1089.0,1094.0,403.0,17414.0,
577,1073.0,1139.0,387.0,17401.0,
578,1022.0,1125.0,492.0,17361.0,
579,1019.0,1047.0,513.0,17421.0,
580,984.0,1048.0,513.0,17455.0,
581,953.0,1116.0,489.0,17442.0,
582,904.0,1156.0,513.0,17427.0,
583,893.0,1178.0,500.0,17429.0,
584,868.0,1244.0,449.0,17439.0,
585,862.0,1238.0,406.0,17494.0,
586,862.0,1195.0,399.0,17544.0,
587,839.0,1175.0,373.0,17613.0,
588,861.0,1104.0,401.0,17634.0,
589,899.0,1035.0,443.0,17623.0,
590,906.0,1086.0,396.0,17612.0,
591,950.0,1028.0,397.0,17625.0,
592,970.0,1012.0,393.0,17625.0,
593,980.0,1039.0,388.0,17593.0,
594,988.0,959.0,440.0,17613.0,
595,1029.0,921.0,405.0,17645.0,
596,1112.0,912.0,470.0,17506.0,
597,1156.0,983.0,405.0,17456.0,
598,1267.0,1045.0,402.0,17286.0,
599,1284.0,1102.0,373.0,17241.0,
600,1291.0,1096.0,406.0,17207.0,
601,1317.0,1122.0,484.0,17077.0,
602,1336.0,1264.0,395.0,17005.0,
603,1384.0,1277.0,477.0,16862.0,
604,1379.0,1369.0,450.0,16802.0,
605,1220.0,1430.0,567.0,16783.0,
606,1134.0,1615.0,492.0,16759.0,
607,1052.0,1540.0,603.0,16805.0,
608,962.0,1649.0,615.0,16774.0,
609,946.0,1727.0,503.0,16824.0,
610,903.0,1756.0,514.0,16827.0,
611,828.0,1827.0,563.0,16782.0,
612,836.0,1810.0,584.0,16770.0,
613,833.0,1793.0,591.0,16783.0,
614,796.0,1930.0,522.0,16752.0,
615,833.0,2001.0,442.0,16724.0,
616,823.0,1996.0,454.0,16727.0,
617,797.0,1895.0,445.0,16863.0,
618,936.0,1932.0,411.0,16721.0,
619,966.0,1944.0,489.0,16601.0,
620,966.0,1972.0,531.0,16531.0,
621,992.0,1925.0,570.0,16513.0,
622,960.0,1832.0,619.0,16589.0,
623,977.0,1727.0,607.0,16689.0,
624,1066.0,1763.0,536.0,16635.0,
625,1015.0,1670.0,633.0,16682.0,
626,1002.0,1647.0,669.0,16682.0,
627,957.0,1769.0,576.0,16698.0,
628,960.0,1712.0,558.0,16770.0,
629,949.0,1750.0,506.0,16795.0,
630,865.0,1731.0,586.0,16818.0,
631,830.0,1810.0,504.0,16856.0,
632,823.0,1835.0,412.0,16930.0,
633,770.0,1826.0,476.0,16928.0,
634,752.0,1872.0,387.0,16989.0,
635,727.0,1790.0,385.0,17098.0,
636,756.0,1795.0,347.0,17102.0,
637,769.0,1662.0,365.0,17204.0,
638,729.0,1672.0,376.0,17223.0,
639,730.0,1616.0,423.0,17231.0,
640,715.0,1572.0,450.0,17263.0,
641,730.0,1633.0,375.0,17262.0,
642,724.0,1501.0,403.0,17372.0,
643,753.0,1481.0,382.0,17384.0,
644,773.0,1435.0,332.0,17460.0,
645,776.0,1264.0,347.0,17613.0,
646,881.0,1098.0,340.0,17681.0,
647,1011.0,1045.0,337.0,17607.0,
648,1133.0,1016.0,342.0,17509.0,
649,1213.0,949.0,390.0,17448.0,
650,1273.0,883.0,446.0,17398.0,
651,1302.0,852.0,520.0,17326.0,
652,1355.0,815.0,459.0,17371.0,
653,1432.0,826.0,457.0,17285.0,
654,1443.0,865.0,466.0,17226.0,
655,1481.0,896.0,495.0,17128.0,
656,1493.0,943.0,551.0,17013.0,
657,1515.0,1066.0,481.0,16938.0,
658,1396.0,1153.0,597.0,16854.0,
659,1294.0,1221.0,637.0,16848.0,
660,1242.0,1273.0,629.0,16856.0,
661,1151.0,1408.0,571.0,16870.0,
662,1083.0,1493.0,584.0,16840.0,
663,972.0,1705.0,510.0,16813.0,
664,879.0,1726.0,530.0,16865.0,
665,831.0,1730.0,565.0,16874.0,
666,730.0,1768.0,585.0,16917.0,
667,704.0,1780.0,562.0,16954.0,
668,678.0,1832.0,522.0,16968.0,
669,648.0,1880.0,489.0,16983.0,
670,640.0,1934.0,431.0,16995.0,
671,608.0,1901.0,402.0,17089.0,
672,612.0,1820.0,439.0,17129.0,
673,617.0,1777.0,411.0,17195.0,
674,620.0,1696.0,348.0,17336.0,
675,722.0,1646.0,394.0,17238.0,
676,731.0,1684.0,398.0,17187.0,
677,734.0,1622.0,324.0,17320.0,
678,791.0,1567.0,333.0,17309.0,
679,783.0,1517.0,334.0,17366.0,
680,758.0,1459.0,436.0,17347.0,
681,800.0,1495.0,338.0,17367.0,
682,916.0,1432.0,260.0,17392.0,
683,1149.0,1366.0,331.0,17154.0,
684,1225.0,1310.0,397.0,17068.0,
685,1154.0,1254.0,536.0,17056.0,
686,1153.0,1287.0,547.0,17013.0,
687,1113.0,1184.0,555.0,17148.0,
688,1107.0,1288.0,443.0,17162.0,
689,999.0,1313.0,466.0,17222.0,
690,1004.0,1396.0,399.0,17201.0,
691,1009.0,1333.0,423.0,17235.0,
692,1020.0,1246.0,459.0,17275.0,
693,1053.0,1198.0,445.0,17304.0,
694,1068.0,1204.0,401.0,17327.0,
695,1054.0,1194.0,355.0,17397.0,
696,1141.0,1125.0,389.0,17345.0,
697,1180.0,1056.0,418.0,17346.0,
698,1111.0,1007.0,501.0,17381.0,
699,1115.0,1034.0,479.0,17372.0,
700,1155.0,1013.0,428.0,17404.0,
701,1126.0,942.0,492.0,17440.0,
702,1143.0,936.0,500.0,17421.0,
703,1106.0,852.0,507.0,17535.0,
704,1078.0,904.0,545.0,17473.0,
705,1125.0,820.0,536.0,17519.0,
706,1103.0,879.0,480.0,17538.0,
707,1105.0,866.0,512.0,17517.0,
708,1116.0,791.0,533.0,17560.0,
709,1118.0,815.0,481.0,17586.0,
710,1132.0,784.0,407.0,17677.0,
711,1152.0,742.0,444.0,17662.0,
712,1144.0,762.0,479.0,17615.0,
713,1140.0,807.0,453.0,17600.0,
714,1164.0,811.0,405.0,17620.0,
715,1178.0,812.0,430.0,17580.0,
716,1176.0,826.0,415.0,17583.0,
717,1178.0,884.0,412.0,17526.0,
718,1165.0,947.0,353.0,17535.0,
719,1204.0,1004.0,422.0,17370.0,
720,1220.0,1013.0,447.0,17320.0,
721,1193.0,1029.0,491.0,17287.0,
722,1176.0,1088.0,479.0,17257.0,
723,1151.0,1092.0,509.0,17248.0,
724,1103.0,1118.0,531.0,17248.0,
725,1093.0,1145.0,562.0,17200.0,
726,1047.0,1256.0,557.0,17140.0,
727,1025.0,1268.0,517.0,17190.0,
728,1064.0,1281.0,558.0,17097.0,
729,1041.0,1315.0,522.0,17122.0,
730,1035.0,1309.0,649.0,17007.0,
