jour,S,I,E,R,
0,19980.0,20.0,0.0,0.0,
1,19965.0,20.0,15.0,0.0,
2,19915.0,22.0,63.0,0.0,
3,19846.0,30.0,123.0,1.0,
4,19711.0,58.0,230.0,1.0,
5,19521.0,88.0,365.0,26.0,
6,19052.0,162.0,738.0,48.0,
7,18290.0,371.0,1286.0,53.0,
8,16446.0,650.0,2811.0,93.0,
9,14469.0,1151.0,4170.0,210.0,
10,10958.0,2089.0,6552.0,401.0,
11,8107.0,2927.0,8197.0,769.0,
12,3732.0,4893.0,10160.0,1215.0,
13,1098.0,6712.0,10292.0,1898.0,
14,355.0,8500.0,8156.0,2989.0,
15,62.0,8831.0,6337.0,4770.0,
16,23.0,9456.0,4604.0,5917.0,
17,13.0,9249.0,3222.0,7516.0,
18,3.0,9164.0,2223.0,8610.0,
19,43.0,8149.0,1567.0,10241.0,
20,43.0,7290.0,1216.0,11451.0,
21,89.0,6381.0,655.0,12875.0,
22,77.0,5649.0,341.0,13933.0,
23,92.0,4833.0,308.0,14767.0,
24,80.0,4483.0,167.0,15270.0,
25,22.0,3560.0,182.0,16236.0,
26,10.0,3030.0,174.0,16786.0,
27,12.0,2449.0,110.0,17429.0,
28,23.0,1773.0,94.0,18110.0,
29,40.0,1619.0,34.0,18307.0,
30,30.0,1492.0,30.0,18448.0,
31,69.0,1292.0,35.0,18604.0,
32,124.0,1141.0,40.0,18695.0,
33,159.0,892.0,35.0,18914.0,
34,223.0,762.0,41.0,18974.0,
35,387.0,691.0,54.0,18868.0,
36,493.0,453.0,78.0,18976.0,
37,619.0,334.0,141.0,18906.0,
38,599.0,331.0,137.0,18933.0,
39,719.0,253.0,144.0,18884.0,
40,839.0,272.0,155.0,18734.0,
41,869.0,312.0,115.0,18704.0,
42,909.0,256.0,113.0,18722.0,
43,894.0,257.0,96.0,18753.0,
44,825.0,242.0,124.0,18809.0,
45,820.0,173.0,148.0,18859.0,
46,833.0,182.0,114.0,18871.0,
47,881.0,168.0,127.0,18824.0,
48,939.0,159.0,122.0,18780.0,
49,999.0,112.0,132.0,18757.0,
50,1037.0,108.0,142.0,18713.0,
51,1066.0,124.0,130.0,18680.0,
52,1079.0,115.0,129.0,18677.0,
53,1082.0,91.0,110.0,18717.0,
54,1189.0,114.0,86.0,18611.0,
55,1236.0,115.0,87.0,18562.0,
56,1273.0,112.0,94.0,18521.0,
57,1385.0,116.0,100.0,18399.0,
58,1401.0,113.0,107.0,18379.0,
59,1583.0,136.0,109.0,18172.0,
60,1640.0,117.0,102.0,18141.0,
61,1639.0,104.0,118.0,18139.0,
62,1652.0,110.0,124.0,18114.0,
63,1685.0,105.0,116.0,18094.0,
64,1826.0,86.0,103.0,17985.0,
65,1892.0,99.0,109.0,17900.0,
66,1935.0,97.0,91.0,17877.0,
67,1927.0,101.0,127.0,17845.0,
68,1914.0,126.0,124.0,17836.0,
69,1860.0,145.0,161.0,17834.0,
70,1862.0,163.0,144.0,17831.0,
71,1847.0,183.0,178.0,17792.0,
72,1855.0,151.0,175.0,17819.0,
73,1832.0,180.0,137.0,17851.0,
74,1839.0,186.0,119.0,17856.0,
75,1802.0,201.0,128.0,17869.0,
76,1750.0,189.0,152.0,17909.0,
77,1741.0,200.0,137.0,17922.0,
78,1679.0,221.0,177.0,17923.0,
79,1644.0,214.0,223.0,17919.0,
80,1607.0,254.0,186.0,17953.0,
81,1560.0,216.0,224.0,18000.0,
82,1512.0,246.0,212.0,18030.0,
83,1505.0,245.0,202.0,18048.0,
84,1466.0,259.0,224.0,18051.0,
85,1449.0,294.0,228.0,18029.0,
86,1400.0,265.0,248.0,18087.0,
87,1495.0,243.0,257.0,18005.0,
88,1617.0,289.0,262.0,17832.0,
89,1691.0,292.0,276.0,17741.0,
90,1804.0,307.0,307.0,17582.0,
91,1894.0,336.0,317.0,17453.0,
92,2006.0,348.0,320.0,17326.0,
93,2050.0,331.0,329.0,17290.0,
94,2209.0,341.0,294.0,17156.0,
95,2157.0,332.0,359.0,17152.0,
96,2284.0,377.0,376.0,16963.0,
97,2301.0,379.0,438.0,16882.0,
98,2253.0,398.0,507.0,16842.0,
99,2305.0,449.0,509.0,16737.0,
100,2339.0,564.0,466.0,16631.0,
101,2129.0,597.0,579.0,16695.0,
102,2076.0,611.0,568.0,16745.0,
103,1939.0,661.0,616.0,16784.0,
104,1917.0,630.0,764.0,16689.0,
105,1808.0,760.0,715.0,16717.0,
106,1612.0,829.0,745.0,16814.0,
107,1465.0,891.0,686.0,16958.0,
108,1322.0,913.0,698.0,17067.0,
109,1257.0,1000.0,579.0,17164.0,
110,1165.0,961.0,562.0,17312.0,
111,1094.0,947.0,549.0,17410.0,
112,994.0,848.0,592.0,17566.0,
113,949.0,835.0,498.0,17718.0,
114,884.0,932.0,445.0,17739.0,
115,841.0,874.0,447.0,17838.0,
116,785.0,778.0,412.0,18025.0,
117,775.0,756.0,356.0,18113.0,
118,733.0,702.0,353.0,18212.0,
119,694.0,671.0,302.0,18333.0,
120,696.0,622.0,299.0,18383.0,
121,698.0,636.0,274.0,18392.0,
122,680.0,602.0,305.0,18413.0,
123,665.0,620.0,297.0,18418.0,
124,692.0,488.0,285.0,18535.0,
125,710.0,507.0,271.0,18512.0,
126,708.0,507.0,233.0,18552.0,
127,741.0,435.0,214.0,18610.0,
128,787.0,430.0,212.0,18571.0,
129,837.0,433.0,166.0,18564.0,
130,971.0,409.0,156.0,18464.0,
131,1161.0,378.0,173.0,18288.0,
132,1169.0,382.0,145.0,18304.0,
133,1197.0,359.0,168.0,18276.0,
134,1302.0,334.0,206.0,18158.0,
135,1355.0,314.0,197.0,18134.0,
136,1336.0,337.0,215.0,18112.0,
137,1329.0,372.0,173.0,18126.0,
138,1398.0,388.0,148.0,18066.0,
139,1374.0,350.0,186.0,18090.0,
140,1386.0,344.0,147.0,18123.0,
141,1521.0,326.0,186.0,17967.0,
142,1525.0,327.0,213.0,17935.0,
143,1522.0,363.0,176.0,17939.0,
144,1441.0,351.0,319.0,17889.0,
145,1421.0,331.0,351.0,17897.0,
146,1423.0,308.0,322.0,17947.0,
147,1445.0,314.0,314.0,17927.0,
148,1420.0,344.0,309.0,17927.0,
149,1403.0,352.0,297.0,17948.0,
150,1427.0,371.0,281.0,17921.0,
151,1395.0,357.0,303.0,17945.0,
152,1495.0,286.0,317.0,17902.0,
153,1522.0,353.0,268.0,17857.0,
154,1539.0,430.0,266.0,17765.0,
155,1534.0,437.0,255.0,17774.0,
156,1476.0,388.0,295.0,17841.0,
157,1391.0,424.0,310.0,17875.0,
158,1502.0,450.0,347.0,17701.0,
159,1493.0,531.0,272.0,17704.0,
160,1368.0,528.0,348.0,17756.0,
161,1310.0,500.0,357.0,17833.0,
162,1295.0,512.0,266.0,17927.0,
163,1223.0,485.0,300.0,17992.0,
164,1182.0,530.0,243.0,18045.0,
165,1182.0,540.0,233.0,18045.0,
166,1249.0,476.0,268.0,18007.0,
167,1244.0,471.0,293.0,17992.0,
168,1270.0,474.0,269.0,17987.0,
169,1298.0,509.0,259.0,17934.0,
170,1370.0,524.0,244.0,17862.0,
171,1368.0,533.0,275.0,17824.0,
172,1384.0,512.0,243.0,17861.0,
173,1341.0,473.0,309.0,17877.0,
174,1377.0,471.0,381.0,17771.0,
175,1431.0,494.0,327.0,17748.0,
176,1460.0,483.0,346.0,17711.0,
177,1505.0,486.0,385.0,17624.0,
178,1476.0,498.0,395.0,17631.0,
179,1516.0,491.0,423.0,17570.0,
180,1539.0,528.0,401.0,17532.0,
181,1525.0,503.0,468.0,17504.0,
182,1560.0,529.0,451.0,17460.0,
183,1554.0,555.0,469.0,17422.0,
184,1624.0,550.0,498.0,17328.0,
185,1780.0,594.0,533.0,17093.0,
186,1759.0,632.0,543.0,17066.0,
187,1765.0,723.0,519.0,16993.0,
188,1766.0,667.0,548.0,17019.0,
189,1761.0,653.0,592.0,16994.0,
190,1655.0,719.0,691.0,16935.0,
191,1556.0,759.0,787.0,16898.0,
192,1514.0,789.0,723.0,16974.0,
193,1521.0,755.0,753.0,16971.0,
194,1490.0,698.0,751.0,17061.0,
195,1470.0,784.0,692.0,17054.0,
196,1593.0,775.0,706.0,16926.0,
197,1665.0,810.0,661.0,16864.0,
198,1581.0,770.0,722.0,16927.0,
199,1483.0,820.0,738.0,16959.0,
200,1429.0,709.0,739.0,17123.0,
201,1392.0,731.0,675.0,17202.0,
202,1334.0,768.0,595.0,17303.0,
203,1277.0,804.0,568.0,17351.0,
204,1202.0,849.0,567.0,17382.0,
205,1251.0,761.0,613.0,17375.0,
206,1269.0,817.0,566.0,17348.0,
207,1326.0,861.0,542.0,17271.0,
208,1328.0,912.0,531.0,17229.0,
209,1300.0,856.0,603.0,17241.0,
210,1252.0,944.0,643.0,17161.0,
211,1290.0,1068.0,585.0,17057.0,
212,1217.0,1070.0,602.0,17111.0,
213,1160.0,1123.0,609.0,17108.0,
214,1055.0,1160.0,679.0,17106.0,
215,1028.0,1186.0,668.0,17118.0,
216,965.0,1025.0,769.0,17241.0,
217,874.0,1075.0,816.0,17235.0,
218,800.0,1033.0,736.0,17431.0,
219,758.0,1102.0,618.0,17522.0,
220,719.0,1086.0,580.0,17615.0,
221,678.0,969.0,591.0,17762.0,
222,684.0,930.0,540.0,17846.0,
223,649.0,912.0,456.0,17983.0,
224,639.0,873.0,411.0,18077.0,
225,644.0,812.0,434.0,18110.0,
226,665.0,865.0,341.0,18129.0,
227,713.0,783.0,338.0,18166.0,
228,779.0,681.0,329.0,18211.0,
229,791.0,687.0,354.0,18168.0,
230,738.0,703.0,288.0,18271.0,
231,685.0,667.0,291.0,18357.0,
232,674.0,668.0,280.0,18378.0,
233,681.0,671.0,235.0,18413.0,
234,668.0,615.0,253.0,18464.0,
235,674.0,592.0,227.0,18507.0,
236,668.0,586.0,227.0,18519.0,
237,698.0,596.0,221.0,18485.0,
238,723.0,563.0,210.0,18504.0,
239,760.0,543.0,217.0,18480.0,
240,787.0,545.0,202.0,18466.0,
241,836.0,489.0,200.0,18475.0,
242,866.0,403.0,227.0,18504.0,
243,963.0,353.0,222.0,18462.0,
244,1022.0,316.0,221.0,18441.0,
245,1202.0,327.0,228.0,18243.0,
246,1240.0,310.0,189.0,18261.0,
247,1319.0,320.0,172.0,18189.0,
248,1336.0,275.0,192.0,18197.0,
249,1361.0,308.0,164.0,18167.0,
250,1367.0,286.0,144.0,18203.0,
251,1372.0,273.0,171.0,18184.0,
252,1422.0,279.0,181.0,18118.0,
253,1438.0,278.0,204.0,18080.0,
254,1466.0,278.0,195.0,18061.0,
255,1462.0,306.0,177.0,18055.0,
256,1486.0,292.0,221.0,18001.0,
257,1515.0,310.0,174.0,18001.0,
258,1561.0,282.0,190.0,17967.0,
259,1549.0,291.0,198.0,17962.0,
260,1559.0,278.0,206.0,17957.0,
261,1598.0,266.0,201.0,17935.0,
262,1669.0,285.0,189.0,17857.0,
263,1767.0,308.0,186.0,17739.0,
264,1854.0,283.0,227.0,17636.0,
265,1900.0,265.0,234.0,17601.0,
266,1942.0,312.0,197.0,17549.0,
267,1991.0,301.0,245.0,17463.0,
268,2032.0,319.0,291.0,17358.0,
269,2065.0,304.0,303.0,17328.0,
270,2108.0,338.0,340.0,17214.0,
271,2120.0,374.0,413.0,17093.0,
272,2105.0,412.0,386.0,17097.0,
273,2088.0,479.0,377.0,17056.0,
274,2074.0,453.0,492.0,16981.0,
275,2063.0,515.0,537.0,16885.0,
276,2000.0,550.0,583.0,16867.0,
277,1943.0,593.0,607.0,16857.0,
278,1941.0,676.0,649.0,16734.0,
279,1901.0,727.0,703.0,16669.0,
280,1879.0,779.0,743.0,16599.0,
281,1760.0,833.0,758.0,16649.0,
282,1723.0,870.0,767.0,16640.0,
283,1673.0,891.0,787.0,16649.0,
284,1688.0,949.0,705.0,16658.0,
285,1563.0,1030.0,718.0,16689.0,
286,1518.0,990.0,686.0,16806.0,
287,1422.0,960.0,794.0,16824.0,
288,1341.0,798.0,881.0,16980.0,
289,1319.0,934.0,722.0,17025.0,
290,1367.0,889.0,680.0,17064.0,
291,1434.0,1004.0,645.0,16917.0,
292,1393.0,943.0,692.0,16972.0,
293,1315.0,945.0,725.0,17015.0,
294,1348.0,807.0,764.0,17081.0,
295,1304.0,792.0,818.0,17086.0,
296,1284.0,867.0,769.0,17080.0,
297,1241.0,867.0,724.0,17168.0,
298,1263.0,987.0,625.0,17125.0,
299,1188.0,1049.0,645.0,17118.0,
300,1139.0,1193.0,624.0,17044.0,
301,1018.0,1180.0,732.0,17070.0,
302,955.0,1266.0,585.0,17194.0,
303,885.0,1336.0,540.0,17239.0,
304,806.0,1275.0,570.0,17349.0,
305,807.0,1282.0,528.0,17383.0,
306,784.0,1246.0,528.0,17442.0,
307,770.0,1310.0,435.0,17485.0,
308,737.0,1187.0,541.0,17535.0,
309,692.0,1195.0,518.0,17595.0,
310,629.0,1154.0,481.0,17736.0,
311,651.0,1187.0,382.0,17780.0,
312,632.0,1142.0,325.0,17901.0,
313,634.0,1045.0,352.0,17969.0,
314,652.0,1084.0,330.0,17934.0,
315,618.0,1023.0,316.0,18043.0,
316,611.0,887.0,313.0,18189.0,
317,609.0,839.0,277.0,18275.0,
318,634.0,768.0,256.0,18342.0,
319,662.0,680.0,260.0,18398.0,
320,694.0,645.0,265.0,18396.0,
321,728.0,577.0,250.0,18445.0,
322,730.0,550.0,267.0,18453.0,
323,756.0,533.0,266.0,18445.0,
324,794.0,511.0,212.0,18483.0,
325,807.0,488.0,184.0,18521.0,
326,820.0,440.0,158.0,18582.0,
327,864.0,422.0,153.0,18561.0,
328,912.0,374.0,136.0,18578.0,
329,934.0,342.0,162.0,18562.0,
330,973.0,307.0,173.0,18547.0,
331,1038.0,309.0,149.0,18504.0,
332,1101.0,283.0,162.0,18454.0,
333,1167.0,302.0,173.0,18358.0,
334,1218.0,269.0,184.0,18329.0,
335,1283.0,270.0,159.0,18288.0,
336,1343.0,265.0,186.0,18206.0,
337,1379.0,275.0,178.0,18168.0,
338,1395.0,283.0,195.0,18127.0,
339,1418.0,271.0,205.0,18106.0,
340,1450.0,274.0,217.0,18059.0,
341,1444.0,294.0,262.0,18000.0,
342,1461.0,290.0,264.0,17985.0,
343,1502.0,352.0,206.0,17940.0,
344,1513.0,368.0,239.0,17880.0,
345,1524.0,378.0,245.0,17853.0,
346,1522.0,384.0,243.0,17851.0,
347,1508.0,364.0,288.0,17840.0,
348,1516.0,401.0,287.0,17796.0,
349,1537.0,397.0,281.0,17785.0,
350,1552.0,396.0,290.0,17762.0,
351,1538.0,425.0,313.0,17724.0,
352,1482.0,433.0,364.0,17721.0,
353,1492.0,419.0,357.0,17732.0,
354,1498.0,441.0,335.0,17726.0,
355,1493.0,448.0,386.0,17673.0,
356,1484.0,478.0,368.0,17670.0,
357,1485.0,520.0,324.0,17671.0,
358,1437.0,575.0,341.0,17647.0,
359,1422.0,555.0,397.0,17626.0,
360,1448.0,516.0,415.0,17621.0,
361,1443.0,484.0,453.0,17620.0,
362,1465.0,519.0,447.0,17569.0,
363,1474.0,534.0,449.0,17543.0,
364,1533.0,518.0,466.0,17483.0,
365,1534.0,546.0,510.0,17410.0,
366,1534.0,460.0,590.0,17416.0,
367,1527.0,464.0,584.0,17425.0,
368,1525.0,547.0,502.0,17426.0,
369,1504.0,559.0,559.0,17378.0,
370,1497.0,660.0,533.0,17310.0,
371,1489.0,594.0,530.0,17387.0,
372,1440.0,567.0,578.0,17415.0,
373,1437.0,594.0,501.0,17468.0,
374,1387.0,568.0,534.0,17511.0,
375,1361.0,622.0,477.0,17540.0,
376,1356.0,610.0,431.0,17603.0,
377,1334.0,620.0,438.0,17608.0,
378,1323.0,628.0,374.0,17675.0,
379,1249.0,583.0,462.0,17706.0,
380,1262.0,565.0,423.0,17750.0,
381,1274.0,551.0,371.0,17804.0,
382,1216.0,531.0,403.0,17850.0,
383,1296.0,519.0,389.0,17796.0,
384,1331.0,535.0,383.0,17751.0,
385,1384.0,517.0,407.0,17692.0,
386,1412.0,486.0,443.0,17659.0,
387,1415.0,510.0,375.0,17700.0,
388,1458.0,488.0,356.0,17698.0,
389,1494.0,461.0,401.0,17644.0,
390,1686.0,465.0,387.0,17462.0,
391,1780.0,476.0,455.0,17289.0,
392,1830.0,497.0,456.0,17217.0,
393,1874.0,548.0,517.0,17061.0,
394,1813.0,510.0,580.0,17097.0,
395,1854.0,601.0,529.0,17016.0,
396,1862.0,597.0,531.0,17010.0,
397,1774.0,601.0,691.0,16934.0,
398,1772.0,672.0,682.0,16874.0,
399,1708.0,668.0,711.0,16913.0,
400,1644.0,698.0,653.0,17005.0,
401,1584.0,783.0,645.0,16988.0,
402,1535.0,838.0,692.0,16935.0,
403,1473.0,984.0,635.0,16908.0,
404,1412.0,995.0,632.0,16961.0,
405,1456.0,1011.0,707.0,16826.0,
406,1476.0,1103.0,726.0,16695.0,
407,1431.0,1206.0,662.0,16701.0,
408,1318.0,1216.0,792.0,16674.0,
409,1246.0,1276.0,735.0,16743.0,
410,1236.0,1371.0,698.0,16695.0,
411,1195.0,1345.0,736.0,16724.0,
412,1154.0,1278.0,778.0,16790.0,
413,1068.0,1215.0,827.0,16890.0,
414,1023.0,1303.0,627.0,17047.0,
415,1003.0,1217.0,647.0,17133.0,
416,947.0,1152.0,640.0,17261.0,
417,927.0,1146.0,537.0,17390.0,
418,834.0,1046.0,605.0,17515.0,
419,836.0,900.0,562.0,17702.0,
420,836.0,804.0,578.0,17782.0,
421,869.0,763.0,509.0,17859.0,
422,913.0,774.0,444.0,17869.0,
423,936.0,736.0,482.0,17846.0,
424,926.0,687.0,517.0,17870.0,
425,940.0,722.0,466.0,17872.0,
426,937.0,696.0,439.0,17928.0,
427,953.0,726.0,364.0,17957.0,
428,973.0,702.0,322.0,18003.0,
429,949.0,642.0,381.0,18028.0,
430,918.0,639.0,347.0,18096.0,
431,925.0,576.0,328.0,18171.0,
432,952.0,545.0,308.0,18195.0,
433,989.0,491.0,262.0,18258.0,
434,1015.0,430.0,271.0,18284.0,
435,1075.0,387.0,253.0,18285.0,
436,1096.0,359.0,296.0,18249.0,
437,1146.0,380.0,255.0,18219.0,
438,1182.0,349.0,225.0,18244.0,
439,1213.0,316.0,230.0,18241.0,
440,1277.0,325.0,199.0,18199.0,
441,1327.0,333.0,179.0,18161.0,
442,1378.0,314.0,206.0,18102.0,
443,1429.0,303.0,194.0,18074.0,
444,1442.0,278.0,243.0,18037.0,
445,1524.0,288.0,242.0,17946.0,
446,1595.0,288.0,248.0,17869.0,
447,1674.0,292.0,267.0,17767.0,
448,1704.0,266.0,289.0,17741.0,
449,1754.0,282.0,273.0,17691.0,
450,1787.0,319.0,274.0,17620.0,
451,1841.0,345.0,277.0,17537.0,
452,1855.0,340.0,302.0,17503.0,
453,1892.0,349.0,302.0,17457.0,
454,1948.0,346.0,295.0,17411.0,
455,1957.0,371.0,292.0,17380.0,
456,1993.0,383.0,326.0,17298.0,
457,1997.0,403.0,344.0,17256.0,
458,2000.0,386.0,349.0,17265.0,
459,2004.0,400.0,356.0,17240.0,
460,2026.0,414.0,288.0,17272.0,
461,1986.0,423.0,381.0,17210.0,
462,1956.0,443.0,421.0,17180.0,
463,1962.0,504.0,443.0,17091.0,
464,1911.0,514.0,496.0,17079.0,
465,1852.0,579.0,463.0,17106.0,
466,1772.0,626.0,457.0,17145.0,
467,1710.0,587.0,566.0,17137.0,
468,1652.0,580.0,557.0,17211.0,
469,1587.0,640.0,557.0,17216.0,
470,1552.0,699.0,474.0,17275.0,
471,1444.0,723.0,493.0,17340.0,
472,1397.0,688.0,492.0,17423.0,
473,1335.0,684.0,455.0,17526.0,
474,1292.0,683.0,450.0,17575.0,
475,1254.0,666.0,459.0,17621.0,
476,1223.0,630.0,472.0,17675.0,
477,1195.0,711.0,375.0,17719.0,
478,1146.0,708.0,399.0,17747.0,
479,1118.0,723.0,398.0,17761.0,
480,1116.0,690.0,426.0,17768.0,
481,1134.0,650.0,432.0,17784.0,
482,1119.0,667.0,410.0,17804.0,
483,1111.0,696.0,396.0,17797.0,
484,1097.0,624.0,400.0,17879.0,
485,1117.0,600.0,350.0,17933.0,
486,1156.0,612.0,329.0,17903.0,
487,1158.0,626.0,353.0,17863.0,
488,1197.0,557.0,331.0,17915.0,
489,1250.0,524.0,303.0,17923.0,
490,1244.0,516.0,287.0,17953.0,
491,1317.0,537.0,285.0,17861.0,
492,1386.0,511.0,317.0,17786.0,
493,1535.0,511.0,319.0,17635.0,
494,1574.0,542.0,336.0,17548.0,
495,1608.0,554.0,381.0,17457.0,
496,1614.0,569.0,378.0,17439.0,
497,1572.0,588.0,410.0,17430.0,
498,1598.0,577.0,436.0,17389.0,
499,1571.0,597.0,440.0,17392.0,
500,1510.0,625.0,467.0,17398.0,
501,1526.0,704.0,443.0,17327.0,
502,1492.0,774.0,429.0,17305.0,
503,1567.0,800.0,419.0,17214.0,
504,1431.0,749.0,519.0,17301.0,
505,1353.0,825.0,523.0,17299.0,
506,1322.0,843.0,444.0,17391.0,
507,1262.0,838.0,396.0,17504.0,
508,1218.0,766.0,419.0,17597.0,
509,1147.0,719.0,486.0,17648.0,
510,1118.0,768.0,410.0,17704.0,
511,1100.0,711.0,388.0,17801.0,
512,1104.0,693.0,396.0,17807.0,
513,1113.0,648.0,378.0,17861.0,
514,1114.0,650.0,347.0,17889.0,
515,1126.0,639.0,361.0,17874.0,
516,1097.0,646.0,358.0,17899.0,
517,1108.0,629.0,367.0,17896.0,
518,1143.0,618.0,361.0,17878.0,
519,1177.0,607.0,350.0,17866.0,
520,1168.0,673.0,331.0,17828.0,
521,1179.0,671.0,315.0,17835.0,
522,1197.0,638.0,283.0,17882.0,
523,1260.0,567.0,297.0,17876.0,
524,1356.0,587.0,293.0,17764.0,
525,1456.0,539.0,322.0,17683.0,
526,1446.0,520.0,286.0,17748.0,
527,1521.0,527.0,301.0,17651.0,
528,1522.0,541.0,391.0,17546.0,
529,1479.0,577.0,389.0,17555.0,
530,1492.0,648.0,370.0,17490.0,
531,1487.0,701.0,373.0,17439.0,
532,1439.0,678.0,421.0,17462.0,
533,1440.0,713.0,410.0,17437.0,
534,1450.0,735.0,379.0,17436.0,
535,1391.0,721.0,471.0,17417.0,
536,1386.0,719.0,439.0,17456.0,
537,1342.0,745.0,439.0,17474.0,
538,1312.0,788.0,397.0,17503.0,
539,1282.0,826.0,449.0,17443.0,
540,1270.0,817.0,505.0,17408.0,
541,1255.0,915.0,450.0,17380.0,
542,1215.0,915.0,510.0,17360.0,
543,1166.0,871.0,560.0,17403.0,
544,1177.0,867.0,494.0,17462.0,
545,1173.0,912.0,492.0,17423.0,
546,1161.0,972.0,493.0,17374.0,
547,1136.0,965.0,504.0,17395.0,
548,1134.0,978.0,580.0,17308.0,
549,1124.0,988.0,578.0,17310.0,
550,1117.0,1054.0,516.0,17313.0,
551,1170.0,1001.0,624.0,17205.0,
552,1326.0,904.0,631.0,17139.0,
553,1370.0,854.0,687.0,17089.0,
554,1419.0,804.0,677.0,17100.0,
555,1429.0,820.0,713.0,17038.0,
556,1558.0,827.0,778.0,16837.0,
557,1591.0,859.0,911.0,16639.0,
558,1552.0,834.0,967.0,16647.0,
559,1591.0,965.0,908.0,16536.0,
560,1661.0,1075.0,761.0,16503.0,
561,1573.0,1171.0,763.0,16493.0,
562,1603.0,1156.0,849.0,16392.0,
563,1583.0,1112.0,728.0,16577.0,
564,1394.0,1061.0,897.0,16648.0,
565,1302.0,1128.0,869.0,16701.0,
566,1155.0,1215.0,861.0,16769.0,
567,1046.0,1267.0,760.0,16927.0,
568,988.0,1240.0,793.0,16979.0,
569,952.0,1188.0,791.0,17069.0,
570,934.0,1206.0,794.0,17066.0,
571,924.0,1142.0,723.0,17211.0,
572,939.0,1158.0,677.0,17226.0,
573,943.0,1133.0,660.0,17264.0,
574,981.0,1089.0,591.0,17339.0,
575,982.0,1094.0,579.0,17345.0,
576,1006.0,1001.0,643.0,17350.0,
577,1029.0,1010.0,572.0,17389.0,
578,1130.0,1035.0,561.0,17274.0,
579,1122.0,992.0,589.0,17297.0,
580,1190.0,996.0,635.0,17179.0,
581,1236.0,990.0,658.0,17116.0,
582,1396.0,1009.0,710.0,16885.0,
583,1329.0,1107.0,732.0,16832.0,
584,1235.0,1146.0,823.0,16796.0,
585,1154.0,1220.0,894.0,16732.0,
586,1129.0,1253.0,862.0,16756.0,
587,1049.0,1329.0,895.0,16727.0,
588,983.0,1439.0,869.0,16709.0,
589,962.0,1532.0,855.0,16651.0,
590,944.0,1623.0,802.0,16631.0,
591,844.0,1703.0,833.0,16620.0,
592,726.0,1793.0,811.0,16670.0,
593,695.0,1758.0,721.0,16826.0,
594,646.0,1710.0,657.0,16987.0,
595,638.0,1602.0,619.0,17141.0,
596,657.0,1478.0,637.0,17228.0,
597,666.0,1414.0,660.0,17260.0,
598,694.0,1279.0,648.0,17379.0,
599,719.0,1225.0,582.0,17474.0,
600,740.0,1243.0,533.0,17484.0,
601,725.0,1289.0,534.0,17452.0,
602,750.0,1216.0,434.0,17600.0,
603,764.0,1174.0,387.0,17675.0,
604,765.0,1009.0,393.0,17833.0,
605,749.0,916.0,386.0,17949.0,
606,821.0,936.0,287.0,17956.0,
607,824.0,782.0,363.0,18031.0,
608,853.0,783.0,392.0,17972.0,
609,857.0,727.0,444.0,17972.0,
610,902.0,746.0,409.0,17943.0,
611,923.0,763.0,420.0,17894.0,
612,972.0,722.0,374.0,17932.0,
613,986.0,678.0,292.0,18044.0,
614,1046.0,653.0,270.0,18031.0,
615,1101.0,620.0,281.0,17998.0,
616,1198.0,572.0,262.0,17968.0,
617,1349.0,472.0,337.0,17842.0,
618,1384.0,451.0,350.0,17815.0,
619,1490.0,460.0,336.0,17714.0,
620,1497.0,424.0,372.0,17707.0,
621,1558.0,390.0,387.0,17665.0,
622,1576.0,416.0,391.0,17617.0,
623,1582.0,423.0,379.0,17616.0,
624,1583.0,439.0,354.0,17624.0,
625,1634.0,418.0,343.0,17605.0,
626,1683.0,445.0,343.0,17529.0,
627,1691.0,453.0,336.0,17520.0,
628,1687.0,420.0,418.0,17475.0,
629,1725.0,420.0,451.0,17404.0,
630,1725.0,471.0,437.0,17367.0,
631,1792.0,447.0,468.0,17293.0,
632,1817.0,424.0,457.0,17302.0,
633,1891.0,438.0,447.0,17224.0,
634,1883.0,483.0,431.0,17203.0,
635,1866.0,471.0,487.0,17176.0,
636,1858.0,500.0,495.0,17147.0,
637,1808.0,520.0,516.0,17156.0,
638,1778.0,569.0,578.0,17075.0,
639,1727.0,620.0,573.0,17080.0,
640,1671.0,662.0,593.0,17074.0,
641,1652.0,726.0,501.0,17121.0,
642,1612.0,728.0,563.0,17097.0,
643,1561.0,786.0,561.0,17092.0,
644,1663.0,747.0,545.0,17045.0,
645,1581.0,721.0,607.0,17091.0,
646,1625.0,805.0,601.0,16969.0,
647,1591.0,815.0,668.0,16926.0,
648,1558.0,842.0,621.0,16979.0,
649,1465.0,885.0,673.0,16977.0,
650,1389.0,864.0,725.0,17022.0,
651,1361.0,846.0,714.0,17079.0,
652,1302.0,837.0,688.0,17173.0,
653,1258.0,773.0,688.0,17281.0,
654,1310.0,783.0,628.0,17279.0,
655,1304.0,825.0,613.0,17258.0,
656,1299.0,753.0,559.0,17389.0,
657,1314.0,747.0,506.0,17433.0,
658,1271.0,761.0,482.0,17486.0,
659,1239.0,663.0,486.0,17612.0,
660,1170.0,632.0,538.0,17660.0,
661,1202.0,633.0,457.0,17708.0,
662,1212.0,655.0,427.0,17706.0,
663,1208.0,710.0,385.0,17697.0,
664,1181.0,653.0,453.0,17713.0,
665,1177.0,654.0,391.0,17778.0,
666,1203.0,599.0,417.0,17781.0,
667,1214.0,611.0,365.0,17810.0,
668,1197.0,592.0,356.0,17855.0,
669,1249.0,553.0,298.0,17900.0,
670,1265.0,508.0,267.0,17960.0,
671,1376.0,545.0,246.0,17833.0,
672,1427.0,466.0,244.0,17863.0,
673,1501.0,392.0,272.0,17835.0,
674,1561.0,415.0,276.0,17748.0,
675,1600.0,408.0,303.0,17689.0,
676,1607.0,363.0,352.0,17678.0,
677,1664.0,371.0,378.0,17587.0,
678,1786.0,374.0,369.0,17471.0,
679,1806.0,410.0,371.0,17413.0,
680,1884.0,433.0,366.0,17317.0,
681,1934.0,489.0,399.0,17178.0,
682,1958.0,512.0,438.0,17092.0,
683,1993.0,535.0,514.0,16958.0,
684,1996.0,551.0,589.0,16864.0,
685,1973.0,568.0,653.0,16806.0,
686,1920.0,658.0,630.0,16792.0,
687,1874.0,674.0,617.0,16835.0,
688,1851.0,665.0,673.0,16811.0,
689,1729.0,769.0,662.0,16840.0,
690,1676.0,799.0,617.0,16908.0,
691,1567.0,817.0,674.0,16942.0,
692,1504.0,853.0,647.0,16996.0,
693,1390.0,986.0,635.0,16989.0,
694,1259.0,968.0,776.0,16997.0,
695,1188.0,1058.0,692.0,17062.0,
696,1078.0,1012.0,799.0,17111.0,
697,1055.0,1097.0,696.0,17152.0,
698,1009.0,1097.0,660.0,17234.0,
699,980.0,1116.0,573.0,17331.0,
700,946.0,1143.0,548.0,17363.0,
701,912.0,1089.0,503.0,17496.0,
702,861.0,1053.0,474.0,17612.0,
703,957.0,961.0,467.0,17615.0,
704,1034.0,932.0,497.0,17537.0,
705,1158.0,793.0,534.0,17515.0,
706,1143.0,752.0,560.0,17545.0,
707,1146.0,743.0,521.0,17590.0,
708,1124.0,741.0,502.0,17633.0,
709,1095.0,755.0,466.0,17684.0,
710,1033.0,722.0,508.0,17737.0,
711,1002.0,792.0,474.0,17732.0,
712,977.0,804.0,488.0,17731.0,
713,957.0,775.0,573.0,17695.0,
714,988.0,788.0,539.0,17685.0,
715,973.0,799.0,544.0,17684.0,
716,980.0,772.0,543.0,17705.0,
717,956.0,839.0,546.0,17659.0,
718,995.0,820.0,497.0,17688.0,
719,998.0,727.0,544.0,17731.0,
720,1064.0,769.0,475.0,17692.0,
721,1123.0,752.0,493.0,17632.0,
722,1103.0,744.0,549.0,17604.0,
723,1116.0,767.0,486.0,17631.0,
724,1133.0,687.0,498.0,17682.0,
725,1137.0,641.0,502.0,17720.0,
726,1144.0,687.0,457.0,17712.0,
727,1135.0,661.0,477.0,17727.0,
728,1158.0,587.0,476.0,17779.0,
729,1188.0,595.0,431.0,17786.0,
730,1216.0,613.0,432.0,17739.0,
