jour,S,I,E,R,
0,19980.0,20.0,0.0,0.0,
1,19967.0,20.0,13.0,0.0,
2,19899.0,25.0,76.0,0.0,
3,19793.0,34.0,153.0,20.0,
4,19652.0,86.0,242.0,20.0,
5,19229.0,178.0,563.0,30.0,
6,18430.0,329.0,1180.0,61.0,
7,16936.0,701.0,2269.0,94.0,
8,15394.0,1131.0,3236.0,239.0,
9,11971.0,2077.0,5620.0,332.0,
10,8299.0,3676.0,7369.0,656.0,
11,3648.0,5681.0,9664.0,1007.0,
12,818.0,8828.0,8524.0,1830.0,
13,116.0,11060.0,6157.0,2667.0,
14,21.0,11677.0,4155.0,4147.0,
15,29.0,10971.0,2753.0,6247.0,
16,6.0,10665.0,1783.0,7546.0,
17,3.0,9981.0,928.0,9088.0,
18,124.0,8795.0,679.0,10402.0,
19,75.0,7542.0,574.0,11809.0,
20,75.0,6200.0,478.0,13247.0,
21,57.0,5218.0,438.0,14287.0,
22,13.0,4898.0,216.0,14873.0,
23,14.0,4581.0,73.0,15332.0,
24,3.0,4013.0,14.0,15970.0,
25,24.0,3502.0,1.0,16473.0,
26,25.0,2843.0,3.0,17129.0,
27,11.0,2556.0,17.0,17416.0,
28,58.0,2251.0,2.0,17689.0,
29,110.0,2086.0,8.0,17796.0,
30,125.0,1912.0,58.0,17905.0,
31,114.0,1724.0,66.0,18096.0,
32,117.0,1423.0,1.0,18459.0,
33,86.0,1012.0,47.0,18855.0,
34,98.0,927.0,5.0,18970.0,
35,124.0,813.0,6.0,19057.0,
36,147.0,571.0,33.0,19249.0,
37,134.0,280.0,15.0,19571.0,
38,134.0,134.0,8.0,19724.0,
39,192.0,48.0,0.0,19760.0,
40,363.0,40.0,1.0,19596.0,
41,429.0,41.0,5.0,19525.0,
42,474.0,29.0,2.0,19495.0,
43,483.0,16.0,0.0,19501.0,
44,490.0,4.0,0.0,19506.0,
45,529.0,4.0,1.0,19466.0,
46,546.0,4.0,0.0,19450.0,
47,556.0,3.0,2.0,19439.0,
48,580.0,3.0,0.0,19417.0,
49,812.0,3.0,2.0,19183.0,
50,836.0,4.0,1.0,19159.0,
51,912.0,4.0,1.0,19083.0,
52,1102.0,5.0,2.0,18891.0,
53,1217.0,6.0,0.0,18777.0,
54,1215.0,6.0,5.0,18774.0,
55,1543.0,7.0,4.0,18446.0,
56,1722.0,8.0,4.0,18266.0,
57,1769.0,5.0,3.0,18223.0,
58,1799.0,3.0,3.0,18195.0,
59,1826.0,1.0,3.0,18170.0,
60,1843.0,1.0,3.0,18153.0,
61,1863.0,1.0,3.0,18133.0,
62,1868.0,1.0,2.0,18129.0,
63,1869.0,2.0,2.0,18127.0,
64,1875.0,3.0,1.0,18121.0,
65,1892.0,4.0,0.0,18104.0,
66,1898.0,2.0,0.0,18100.0,
67,1898.0,2.0,0.0,18100.0,
68,1920.0,2.0,0.0,18078.0,
69,1946.0,2.0,1.0,18051.0,
70,1954.0,1.0,1.0,18044.0,
71,1958.0,1.0,0.0,18041.0,
72,1971.0,1.0,0.0,18028.0,
73,1998.0,1.0,0.0,18001.0,
74,2016.0,0.0,0.0,17984.0,
75,2234.0,0.0,0.0,17766.0,
76,2322.0,0.0,0.0,17678.0,
77,2506.0,0.0,0.0,17494.0,
78,2681.0,0.0,0.0,17319.0,
79,2849.0,0.0,0.0,17151.0,
80,2866.0,0.0,0.0,17134.0,
81,2966.0,0.0,0.0,17034.0,
82,3046.0,0.0,0.0,16954.0,
83,3152.0,0.0,0.0,16848.0,
84,3156.0,0.0,0.0,16844.0,
85,3212.0,0.0,0.0,16788.0,
86,3222.0,0.0,0.0,16778.0,
87,3259.0,0.0,0.0,16741.0,
88,3292.0,0.0,0.0,16708.0,
89,3336.0,0.0,0.0,16664.0,
90,3533.0,0.0,0.0,16467.0,
91,3569.0,0.0,0.0,16431.0,
92,3722.0,0.0,0.0,16278.0,
93,3779.0,0.0,0.0,16221.0,
94,3811.0,0.0,0.0,16189.0,
95,3872.0,0.0,0.0,16128.0,
96,3872.0,0.0,0.0,16128.0,
97,3872.0,0.0,0.0,16128.0,
98,4012.0,0.0,0.0,15988.0,
99,4064.0,0.0,0.0,15936.0,
100,4072.0,0.0,0.0,15928.0,
101,4073.0,0.0,0.0,15927.0,
102,4081.0,0.0,0.0,15919.0,
103,4088.0,0.0,0.0,15912.0,
104,4101.0,0.0,0.0,15899.0,
105,4102.0,0.0,0.0,15898.0,
106,4135.0,0.0,0.0,15865.0,
107,4201.0,0.0,0.0,15799.0,
108,4243.0,0.0,0.0,15757.0,
109,4508.0,0.0,0.0,15492.0,
110,4539.0,0.0,0.0,15461.0,
111,4615.0,0.0,0.0,15385.0,
112,4615.0,0.0,0.0,15385.0,
113,4615.0,0.0,0.0,15385.0,
114,4623.0,0.0,0.0,15377.0,
115,4623.0,0.0,0.0,15377.0,
116,4644.0,0.0,0.0,15356.0,
117,4650.0,0.0,0.0,15350.0,
118,4736.0,0.0,0.0,15264.0,
119,4736.0,0.0,0.0,15264.0,
120,4836.0,0.0,0.0,15164.0,
121,4866.0,0.0,0.0,15134.0,
122,4884.0,0.0,0.0,15116.0,
123,4885.0,0.0,0.0,15115.0,
124,4889.0,0.0,0.0,15111.0,
125,4890.0,0.0,0.0,15110.0,
126,4890.0,0.0,0.0,15110.0,
127,4890.0,0.0,0.0,15110.0,
128,4919.0,0.0,0.0,15081.0,
129,4959.0,0.0,0.0,15041.0,
130,5010.0,0.0,0.0,14990.0,
131,5090.0,0.0,0.0,14910.0,
132,5111.0,0.0,0.0,14889.0,
133,5147.0,0.0,0.0,14853.0,
134,5188.0,0.0,0.0,14812.0,
135,5255.0,0.0,0.0,14745.0,
136,5374.0,0.0,0.0,14626.0,
137,5396.0,0.0,0.0,14604.0,
138,5403.0,0.0,0.0,14597.0,
139,5403.0,0.0,0.0,14597.0,
140,5403.0,0.0,0.0,14597.0,
141,5407.0,0.0,0.0,14593.0,
142,5440.0,0.0,0.0,14560.0,
143,5447.0,0.0,0.0,14553.0,
144,5646.0,0.0,0.0,14354.0,
145,5665.0,0.0,0.0,14335.0,
146,5724.0,0.0,0.0,14276.0,
147,5724.0,0.0,0.0,14276.0,
148,5726.0,0.0,0.0,14274.0,
149,5809.0,0.0,0.0,14191.0,
150,5948.0,0.0,0.0,14052.0,
151,6068.0,0.0,0.0,13932.0,
152,6134.0,0.0,0.0,13866.0,
153,6178.0,0.0,0.0,13822.0,
154,6238.0,0.0,0.0,13762.0,
155,6440.0,0.0,0.0,13560.0,
156,6450.0,0.0,0.0,13550.0,
157,6471.0,0.0,0.0,13529.0,
158,6475.0,0.0,0.0,13525.0,
159,6475.0,0.0,0.0,13525.0,
160,6475.0,0.0,0.0,13525.0,
161,6475.0,0.0,0.0,13525.0,
162,6495.0,0.0,0.0,13505.0,
163,6527.0,0.0,0.0,13473.0,
164,6628.0,0.0,0.0,13372.0,
165,6698.0,0.0,0.0,13302.0,
166,6817.0,0.0,0.0,13183.0,
167,6876.0,0.0,0.0,13124.0,
168,7116.0,0.0,0.0,12884.0,
169,7212.0,0.0,0.0,12788.0,
170,7357.0,0.0,0.0,12643.0,
171,7458.0,0.0,0.0,12542.0,
172,7547.0,0.0,0.0,12453.0,
173,7550.0,0.0,0.0,12450.0,
174,7555.0,0.0,0.0,12445.0,
175,7555.0,0.0,0.0,12445.0,
176,7555.0,0.0,0.0,12445.0,
177,7555.0,0.0,0.0,12445.0,
178,7555.0,0.0,0.0,12445.0,
179,7555.0,0.0,0.0,12445.0,
180,7555.0,0.0,0.0,12445.0,
181,7555.0,0.0,0.0,12445.0,
182,7555.0,0.0,0.0,12445.0,
183,7555.0,0.0,0.0,12445.0,
184,7555.0,0.0,0.0,12445.0,
185,7556.0,0.0,0.0,12444.0,
186,7560.0,0.0,0.0,12440.0,
187,7560.0,0.0,0.0,12440.0,
188,7571.0,0.0,0.0,12429.0,
189,7571.0,0.0,0.0,12429.0,
190,7620.0,0.0,0.0,12380.0,
191,7620.0,0.0,0.0,12380.0,
192,7623.0,0.0,0.0,12377.0,
193,7697.0,0.0,0.0,12303.0,
194,7737.0,0.0,0.0,12263.0,
195,7840.0,0.0,0.0,12160.0,
196,7880.0,0.0,0.0,12120.0,
197,7884.0,0.0,0.0,12116.0,
198,7896.0,0.0,0.0,12104.0,
199,7939.0,0.0,0.0,12061.0,
200,8077.0,0.0,0.0,11923.0,
201,8138.0,0.0,0.0,11862.0,
202,8212.0,0.0,0.0,11788.0,
203,8406.0,0.0,0.0,11594.0,
204,8492.0,0.0,0.0,11508.0,
205,8609.0,0.0,0.0,11391.0,
206,8678.0,0.0,0.0,11322.0,
207,8829.0,0.0,0.0,11171.0,
208,8893.0,0.0,0.0,11107.0,
209,8901.0,0.0,0.0,11099.0,
210,8908.0,0.0,0.0,11092.0,
211,8908.0,0.0,0.0,11092.0,
212,8936.0,0.0,0.0,11064.0,
213,8937.0,0.0,0.0,11063.0,
214,8996.0,0.0,0.0,11004.0,
215,9062.0,0.0,0.0,10938.0,
216,9167.0,0.0,0.0,10833.0,
217,9264.0,0.0,0.0,10736.0,
218,9350.0,0.0,0.0,10650.0,
219,9356.0,0.0,0.0,10644.0,
220,9423.0,0.0,0.0,10577.0,
221,9424.0,0.0,0.0,10576.0,
222,9424.0,0.0,0.0,10576.0,
223,9426.0,0.0,0.0,10574.0,
224,9426.0,0.0,0.0,10574.0,
225,9426.0,0.0,0.0,10574.0,
226,9426.0,0.0,0.0,10574.0,
227,9426.0,0.0,0.0,10574.0,
228,9426.0,0.0,0.0,10574.0,
229,9434.0,0.0,0.0,10566.0,
230,9434.0,0.0,0.0,10566.0,
231,9458.0,0.0,0.0,10542.0,
232,9493.0,0.0,0.0,10507.0,
233,9493.0,0.0,0.0,10507.0,
234,9494.0,0.0,0.0,10506.0,
235,9498.0,0.0,0.0,10502.0,
236,9498.0,0.0,0.0,10502.0,
237,9677.0,0.0,0.0,10323.0,
238,9681.0,0.0,0.0,10319.0,
239,9682.0,0.0,0.0,10318.0,
240,9682.0,0.0,0.0,10318.0,
241,9682.0,0.0,0.0,10318.0,
242,9682.0,0.0,0.0,10318.0,
243,9682.0,0.0,0.0,10318.0,
244,9682.0,0.0,0.0,10318.0,
245,9682.0,0.0,0.0,10318.0,
246,9682.0,0.0,0.0,10318.0,
247,9682.0,0.0,0.0,10318.0,
248,9682.0,0.0,0.0,10318.0,
249,9682.0,0.0,0.0,10318.0,
250,9682.0,0.0,0.0,10318.0,
251,9682.0,0.0,0.0,10318.0,
252,9682.0,0.0,0.0,10318.0,
253,9682.0,0.0,0.0,10318.0,
254,9682.0,0.0,0.0,10318.0,
255,9682.0,0.0,0.0,10318.0,
256,9682.0,0.0,0.0,10318.0,
257,9684.0,0.0,0.0,10316.0,
258,9684.0,0.0,0.0,10316.0,
259,9691.0,0.0,0.0,10309.0,
260,9692.0,0.0,0.0,10308.0,
261,9697.0,0.0,0.0,10303.0,
262,9703.0,0.0,0.0,10297.0,
263,9739.0,0.0,0.0,10261.0,
264,9758.0,0.0,0.0,10242.0,
265,9899.0,0.0,0.0,10101.0,
266,10046.0,0.0,0.0,9954.0,
267,10050.0,0.0,0.0,9950.0,
268,10077.0,0.0,0.0,9923.0,
269,10205.0,0.0,0.0,9795.0,
270,10220.0,0.0,0.0,9780.0,
271,10366.0,0.0,0.0,9634.0,
272,10432.0,0.0,0.0,9568.0,
273,10488.0,0.0,0.0,9512.0,
274,10488.0,0.0,0.0,9512.0,
275,10488.0,0.0,0.0,9512.0,
276,10488.0,0.0,0.0,9512.0,
277,10488.0,0.0,0.0,9512.0,
278,10488.0,0.0,0.0,9512.0,
279,10488.0,0.0,0.0,9512.0,
280,10488.0,0.0,0.0,9512.0,
281,10488.0,0.0,0.0,9512.0,
282,10488.0,0.0,0.0,9512.0,
283,10492.0,0.0,0.0,9508.0,
284,10497.0,0.0,0.0,9503.0,
285,10514.0,0.0,0.0,9486.0,
286,10516.0,0.0,0.0,9484.0,
287,10519.0,0.0,0.0,9481.0,
288,10601.0,0.0,0.0,9399.0,
289,10685.0,0.0,0.0,9315.0,
290,10735.0,0.0,0.0,9265.0,
291,10764.0,0.0,0.0,9236.0,
292,10768.0,0.0,0.0,9232.0,
293,10780.0,0.0,0.0,9220.0,
294,10893.0,0.0,0.0,9107.0,
295,10901.0,0.0,0.0,9099.0,
296,10968.0,0.0,0.0,9032.0,
297,10999.0,0.0,0.0,9001.0,
298,11021.0,0.0,0.0,8979.0,
299,11025.0,0.0,0.0,8975.0,
300,11049.0,0.0,0.0,8951.0,
301,11097.0,0.0,0.0,8903.0,
302,11110.0,0.0,0.0,8890.0,
303,11135.0,0.0,0.0,8865.0,
304,11135.0,0.0,0.0,8865.0,
305,11135.0,0.0,0.0,8865.0,
306,11195.0,0.0,0.0,8805.0,
307,11279.0,0.0,0.0,8721.0,
308,11284.0,0.0,0.0,8716.0,
309,11300.0,0.0,0.0,8700.0,
310,11344.0,0.0,0.0,8656.0,
311,11366.0,0.0,0.0,8634.0,
312,11411.0,0.0,0.0,8589.0,
313,11443.0,0.0,0.0,8557.0,
314,11511.0,0.0,0.0,8489.0,
315,11715.0,0.0,0.0,8285.0,
316,11723.0,0.0,0.0,8277.0,
317,11792.0,0.0,0.0,8208.0,
318,11796.0,0.0,0.0,8204.0,
319,11802.0,0.0,0.0,8198.0,
320,11803.0,0.0,0.0,8197.0,
321,11803.0,0.0,0.0,8197.0,
322,11806.0,0.0,0.0,8194.0,
323,11806.0,0.0,0.0,8194.0,
324,11806.0,0.0,0.0,8194.0,
325,11806.0,0.0,0.0,8194.0,
326,11808.0,0.0,0.0,8192.0,
327,11835.0,0.0,0.0,8165.0,
328,11903.0,0.0,0.0,8097.0,
329,11924.0,0.0,0.0,8076.0,
330,12013.0,0.0,0.0,7987.0,
331,12119.0,0.0,0.0,7881.0,
332,12200.0,0.0,0.0,7800.0,
333,12264.0,0.0,0.0,7736.0,
334,12328.0,0.0,0.0,7672.0,
335,12333.0,0.0,0.0,7667.0,
336,12336.0,0.0,0.0,7664.0,
337,12352.0,0.0,0.0,7648.0,
338,12352.0,0.0,0.0,7648.0,
339,12353.0,0.0,0.0,7647.0,
340,12353.0,0.0,0.0,7647.0,
341,12353.0,0.0,0.0,7647.0,
342,12353.0,0.0,0.0,7647.0,
343,12353.0,0.0,0.0,7647.0,
344,12353.0,0.0,0.0,7647.0,
345,12353.0,0.0,0.0,7647.0,
346,12353.0,0.0,0.0,7647.0,
347,12353.0,0.0,0.0,7647.0,
348,12353.0,0.0,0.0,7647.0,
349,12353.0,0.0,0.0,7647.0,
350,12353.0,0.0,0.0,7647.0,
351,12353.0,0.0,0.0,7647.0,
352,12353.0,0.0,0.0,7647.0,
353,12353.0,0.0,0.0,7647.0,
354,12353.0,0.0,0.0,7647.0,
355,12353.0,0.0,0.0,7647.0,
356,12353.0,0.0,0.0,7647.0,
357,12353.0,0.0,0.0,7647.0,
358,12353.0,0.0,0.0,7647.0,
359,12353.0,0.0,0.0,7647.0,
360,12353.0,0.0,0.0,7647.0,
361,12355.0,0.0,0.0,7645.0,
362,12355.0,0.0,0.0,7645.0,
363,12355.0,0.0,0.0,7645.0,
364,12355.0,0.0,0.0,7645.0,
365,12382.0,0.0,0.0,7618.0,
366,12430.0,0.0,0.0,7570.0,
367,12494.0,0.0,0.0,7506.0,
368,12558.0,0.0,0.0,7442.0,
369,12602.0,0.0,0.0,7398.0,
370,12623.0,0.0,0.0,7377.0,
371,12666.0,0.0,0.0,7334.0,
372,12668.0,0.0,0.0,7332.0,
373,12710.0,0.0,0.0,7290.0,
374,12782.0,0.0,0.0,7218.0,
375,12789.0,0.0,0.0,7211.0,
376,12792.0,0.0,0.0,7208.0,
377,12792.0,0.0,0.0,7208.0,
378,12792.0,0.0,0.0,7208.0,
379,12792.0,0.0,0.0,7208.0,
380,12792.0,0.0,0.0,7208.0,
381,12792.0,0.0,0.0,7208.0,
382,12792.0,0.0,0.0,7208.0,
383,12795.0,0.0,0.0,7205.0,
384,12804.0,0.0,0.0,7196.0,
385,12804.0,0.0,0.0,7196.0,
386,12806.0,0.0,0.0,7194.0,
387,12846.0,0.0,0.0,7154.0,
388,12957.0,0.0,0.0,7043.0,
389,12984.0,0.0,0.0,7016.0,
390,12999.0,0.0,0.0,7001.0,
391,13084.0,0.0,0.0,6916.0,
392,13314.0,0.0,0.0,6686.0,
393,13372.0,0.0,0.0,6628.0,
394,13419.0,0.0,0.0,6581.0,
395,13420.0,0.0,0.0,6580.0,
396,13420.0,0.0,0.0,6580.0,
397,13568.0,0.0,0.0,6432.0,
398,13594.0,0.0,0.0,6406.0,
399,13594.0,0.0,0.0,6406.0,
400,13596.0,0.0,0.0,6404.0,
401,13600.0,0.0,0.0,6400.0,
402,13604.0,0.0,0.0,6396.0,
403,13640.0,0.0,0.0,6360.0,
404,13695.0,0.0,0.0,6305.0,
405,13836.0,0.0,0.0,6164.0,
406,13951.0,0.0,0.0,6049.0,
407,14076.0,0.0,0.0,5924.0,
408,14222.0,0.0,0.0,5778.0,
409,14308.0,0.0,0.0,5692.0,
410,14510.0,0.0,0.0,5490.0,
411,14637.0,0.0,0.0,5363.0,
412,14883.0,0.0,0.0,5117.0,
413,14906.0,0.0,0.0,5094.0,
414,14965.0,0.0,0.0,5035.0,
415,14972.0,0.0,0.0,5028.0,
416,14972.0,0.0,0.0,5028.0,
417,14987.0,0.0,0.0,5013.0,
418,14989.0,0.0,0.0,5011.0,
419,15140.0,0.0,0.0,4860.0,
420,15202.0,0.0,0.0,4798.0,
421,15211.0,0.0,0.0,4789.0,
422,15215.0,0.0,0.0,4785.0,
423,15215.0,0.0,0.0,4785.0,
424,15215.0,0.0,0.0,4785.0,
425,15302.0,0.0,0.0,4698.0,
426,15377.0,0.0,0.0,4623.0,
427,15402.0,0.0,0.0,4598.0,
428,15466.0,0.0,0.0,4534.0,
429,15473.0,0.0,0.0,4527.0,
430,15473.0,0.0,0.0,4527.0,
431,15473.0,0.0,0.0,4527.0,
432,15473.0,0.0,0.0,4527.0,
433,15473.0,0.0,0.0,4527.0,
434,15473.0,0.0,0.0,4527.0,
435,15473.0,0.0,0.0,4527.0,
436,15473.0,0.0,0.0,4527.0,
437,15473.0,0.0,0.0,4527.0,
438,15473.0,0.0,0.0,4527.0,
439,15473.0,0.0,0.0,4527.0,
440,15473.0,0.0,0.0,4527.0,
441,15473.0,0.0,0.0,4527.0,
442,15473.0,0.0,0.0,4527.0,
443,15473.0,0.0,0.0,4527.0,
444,15473.0,0.0,0.0,4527.0,
445,15473.0,0.0,0.0,4527.0,
446,15473.0,0.0,0.0,4527.0,
447,15483.0,0.0,0.0,4517.0,
448,15509.0,0.0,0.0,4491.0,
449,15567.0,0.0,0.0,4433.0,
450,15631.0,0.0,0.0,4369.0,
451,15647.0,0.0,0.0,4353.0,
452,15681.0,0.0,0.0,4319.0,
453,15739.0,0.0,0.0,4261.0,
454,15748.0,0.0,0.0,4252.0,
455,15748.0,0.0,0.0,4252.0,
456,15748.0,0.0,0.0,4252.0,
457,15748.0,0.0,0.0,4252.0,
458,15748.0,0.0,0.0,4252.0,
459,15748.0,0.0,0.0,4252.0,
460,15748.0,0.0,0.0,4252.0,
461,15748.0,0.0,0.0,4252.0,
462,15748.0,0.0,0.0,4252.0,
463,15748.0,0.0,0.0,4252.0,
464,15748.0,0.0,0.0,4252.0,
465,15748.0,0.0,0.0,4252.0,
466,15748.0,0.0,0.0,4252.0,
467,15748.0,0.0,0.0,4252.0,
468,15748.0,0.0,0.0,4252.0,
469,15748.0,0.0,0.0,4252.0,
470,15748.0,0.0,0.0,4252.0,
471,15748.0,0.0,0.0,4252.0,
472,15748.0,0.0,0.0,4252.0,
473,15748.0,0.0,0.0,4252.0,
474,15748.0,0.0,0.0,4252.0,
475,15748.0,0.0,0.0,4252.0,
476,15748.0,0.0,0.0,4252.0,
477,15748.0,0.0,0.0,4252.0,
478,15748.0,0.0,0.0,4252.0,
479,15748.0,0.0,0.0,4252.0,
480,15748.0,0.0,0.0,4252.0,
481,15748.0,0.0,0.0,4252.0,
482,15748.0,0.0,0.0,4252.0,
483,15748.0,0.0,0.0,4252.0,
484,15748.0,0.0,0.0,4252.0,
485,15748.0,0.0,0.0,4252.0,
486,15748.0,0.0,0.0,4252.0,
487,15754.0,0.0,0.0,4246.0,
488,15758.0,0.0,0.0,4242.0,
489,15758.0,0.0,0.0,4242.0,
490,15773.0,0.0,0.0,4227.0,
491,15775.0,0.0,0.0,4225.0,
492,15779.0,0.0,0.0,4221.0,
493,15791.0,0.0,0.0,4209.0,
494,15914.0,0.0,0.0,4086.0,
495,16000.0,0.0,0.0,4000.0,
496,16172.0,0.0,0.0,3828.0,
497,16269.0,0.0,0.0,3731.0,
498,16322.0,0.0,0.0,3678.0,
499,16360.0,0.0,0.0,3640.0,
500,16377.0,0.0,0.0,3623.0,
501,16380.0,0.0,0.0,3620.0,
502,16550.0,0.0,0.0,3450.0,
503,16553.0,0.0,0.0,3447.0,
504,16553.0,0.0,0.0,3447.0,
505,16553.0,0.0,0.0,3447.0,
506,16553.0,0.0,0.0,3447.0,
507,16553.0,0.0,0.0,3447.0,
508,16553.0,0.0,0.0,3447.0,
509,16553.0,0.0,0.0,3447.0,
510,16553.0,0.0,0.0,3447.0,
511,16553.0,0.0,0.0,3447.0,
512,16553.0,0.0,0.0,3447.0,
513,16553.0,0.0,0.0,3447.0,
514,16553.0,0.0,0.0,3447.0,
515,16553.0,0.0,0.0,3447.0,
516,16553.0,0.0,0.0,3447.0,
517,16553.0,0.0,0.0,3447.0,
518,16563.0,0.0,0.0,3437.0,
519,16563.0,0.0,0.0,3437.0,
520,16563.0,0.0,0.0,3437.0,
521,16618.0,0.0,0.0,3382.0,
522,16619.0,0.0,0.0,3381.0,
523,16716.0,0.0,0.0,3284.0,
524,16755.0,0.0,0.0,3245.0,
525,16813.0,0.0,0.0,3187.0,
526,16829.0,0.0,0.0,3171.0,
527,16829.0,0.0,0.0,3171.0,
528,16829.0,0.0,0.0,3171.0,
529,16829.0,0.0,0.0,3171.0,
530,16833.0,0.0,0.0,3167.0,
531,16833.0,0.0,0.0,3167.0,
532,16848.0,0.0,0.0,3152.0,
533,16850.0,0.0,0.0,3150.0,
534,16890.0,0.0,0.0,3110.0,
535,16948.0,0.0,0.0,3052.0,
536,16953.0,0.0,0.0,3047.0,
537,17002.0,0.0,0.0,2998.0,
538,17010.0,0.0,0.0,2990.0,
539,17078.0,0.0,0.0,2922.0,
540,17100.0,0.0,0.0,2900.0,
541,17100.0,0.0,0.0,2900.0,
542,17100.0,0.0,0.0,2900.0,
543,17100.0,0.0,0.0,2900.0,
544,17100.0,0.0,0.0,2900.0,
545,17100.0,0.0,0.0,2900.0,
546,17100.0,0.0,0.0,2900.0,
547,17100.0,0.0,0.0,2900.0,
548,17100.0,0.0,0.0,2900.0,
549,17100.0,0.0,0.0,2900.0,
550,17100.0,0.0,0.0,2900.0,
551,17100.0,0.0,0.0,2900.0,
552,17100.0,0.0,0.0,2900.0,
553,17100.0,0.0,0.0,2900.0,
554,17100.0,0.0,0.0,2900.0,
555,17100.0,0.0,0.0,2900.0,
556,17100.0,0.0,0.0,2900.0,
557,17100.0,0.0,0.0,2900.0,
558,17100.0,0.0,0.0,2900.0,
559,17100.0,0.0,0.0,2900.0,
560,17100.0,0.0,0.0,2900.0,
561,17100.0,0.0,0.0,2900.0,
562,17100.0,0.0,0.0,2900.0,
563,17100.0,0.0,0.0,2900.0,
564,17100.0,0.0,0.0,2900.0,
565,17100.0,0.0,0.0,2900.0,
566,17100.0,0.0,0.0,2900.0,
567,17100.0,0.0,0.0,2900.0,
568,17100.0,0.0,0.0,2900.0,
569,17100.0,0.0,0.0,2900.0,
570,17100.0,0.0,0.0,2900.0,
571,17100.0,0.0,0.0,2900.0,
572,17100.0,0.0,0.0,2900.0,
573,17100.0,0.0,0.0,2900.0,
574,17100.0,0.0,0.0,2900.0,
575,17100.0,0.0,0.0,2900.0,
576,17100.0,0.0,0.0,2900.0,
577,17100.0,0.0,0.0,2900.0,
578,17100.0,0.0,0.0,2900.0,
579,17100.0,0.0,0.0,2900.0,
580,17100.0,0.0,0.0,2900.0,
581,17100.0,0.0,0.0,2900.0,
582,17100.0,0.0,0.0,2900.0,
583,17100.0,0.0,0.0,2900.0,
584,17100.0,0.0,0.0,2900.0,
585,17100.0,0.0,0.0,2900.0,
586,17100.0,0.0,0.0,2900.0,
587,17100.0,0.0,0.0,2900.0,
588,17100.0,0.0,0.0,2900.0,
589,17100.0,0.0,0.0,2900.0,
590,17100.0,0.0,0.0,2900.0,
591,17100.0,0.0,0.0,2900.0,
592,17100.0,0.0,0.0,2900.0,
593,17100.0,0.0,0.0,2900.0,
594,17100.0,0.0,0.0,2900.0,
595,17100.0,0.0,0.0,2900.0,
596,17100.0,0.0,0.0,2900.0,
597,17100.0,0.0,0.0,2900.0,
598,17100.0,0.0,0.0,2900.0,
599,17100.0,0.0,0.0,2900.0,
600,17100.0,0.0,0.0,2900.0,
601,17100.0,0.0,0.0,2900.0,
602,17100.0,0.0,0.0,2900.0,
603,17100.0,0.0,0.0,2900.0,
604,17100.0,0.0,0.0,2900.0,
605,17100.0,0.0,0.0,2900.0,
606,17100.0,0.0,0.0,2900.0,
607,17100.0,0.0,0.0,2900.0,
608,17100.0,0.0,0.0,2900.0,
609,17100.0,0.0,0.0,2900.0,
610,17100.0,0.0,0.0,2900.0,
611,17100.0,0.0,0.0,2900.0,
612,17100.0,0.0,0.0,2900.0,
613,17100.0,0.0,0.0,2900.0,
614,17100.0,0.0,0.0,2900.0,
615,17100.0,0.0,0.0,2900.0,
616,17100.0,0.0,0.0,2900.0,
617,17100.0,0.0,0.0,2900.0,
618,17100.0,0.0,0.0,2900.0,
619,17100.0,0.0,0.0,2900.0,
620,17100.0,0.0,0.0,2900.0,
621,17100.0,0.0,0.0,2900.0,
622,17100.0,0.0,0.0,2900.0,
623,17100.0,0.0,0.0,2900.0,
624,17100.0,0.0,0.0,2900.0,
625,17100.0,0.0,0.0,2900.0,
626,17100.0,0.0,0.0,2900.0,
627,17100.0,0.0,0.0,2900.0,
628,17100.0,0.0,0.0,2900.0,
629,17100.0,0.0,0.0,2900.0,
630,17100.0,0.0,0.0,2900.0,
631,17100.0,0.0,0.0,2900.0,
632,17100.0,0.0,0.0,2900.0,
633,17100.0,0.0,0.0,2900.0,
634,17100.0,0.0,0.0,2900.0,
635,17100.0,0.0,0.0,2900.0,
636,17100.0,0.0,0.0,2900.0,
637,17100.0,0.0,0.0,2900.0,
638,17100.0,0.0,0.0,2900.0,
639,17100.0,0.0,0.0,2900.0,
640,17100.0,0.0,0.0,2900.0,
641,17100.0,0.0,0.0,2900.0,
642,17100.0,0.0,0.0,2900.0,
643,17100.0,0.0,0.0,2900.0,
644,17100.0,0.0,0.0,2900.0,
645,17100.0,0.0,0.0,2900.0,
646,17100.0,0.0,0.0,2900.0,
647,17100.0,0.0,0.0,2900.0,
648,17100.0,0.0,0.0,2900.0,
649,17100.0,0.0,0.0,2900.0,
650,17100.0,0.0,0.0,2900.0,
651,17100.0,0.0,0.0,2900.0,
652,17100.0,0.0,0.0,2900.0,
653,17100.0,0.0,0.0,2900.0,
654,17100.0,0.0,0.0,2900.0,
655,17100.0,0.0,0.0,2900.0,
656,17100.0,0.0,0.0,2900.0,
657,17100.0,0.0,0.0,2900.0,
658,17100.0,0.0,0.0,2900.0,
659,17100.0,0.0,0.0,2900.0,
660,17100.0,0.0,0.0,2900.0,
661,17100.0,0.0,0.0,2900.0,
662,17100.0,0.0,0.0,2900.0,
663,17100.0,0.0,0.0,2900.0,
664,17100.0,0.0,0.0,2900.0,
665,17100.0,0.0,0.0,2900.0,
666,17100.0,0.0,0.0,2900.0,
667,17100.0,0.0,0.0,2900.0,
668,17100.0,0.0,0.0,2900.0,
669,17100.0,0.0,0.0,2900.0,
670,17100.0,0.0,0.0,2900.0,
671,17100.0,0.0,0.0,2900.0,
672,17100.0,0.0,0.0,2900.0,
673,17100.0,0.0,0.0,2900.0,
674,17100.0,0.0,0.0,2900.0,
675,17100.0,0.0,0.0,2900.0,
676,17100.0,0.0,0.0,2900.0,
677,17100.0,0.0,0.0,2900.0,
678,17100.0,0.0,0.0,2900.0,
679,17100.0,0.0,0.0,2900.0,
680,17100.0,0.0,0.0,2900.0,
681,17100.0,0.0,0.0,2900.0,
682,17100.0,0.0,0.0,2900.0,
683,17100.0,0.0,0.0,2900.0,
684,17100.0,0.0,0.0,2900.0,
685,17100.0,0.0,0.0,2900.0,
686,17100.0,0.0,0.0,2900.0,
687,17100.0,0.0,0.0,2900.0,
688,17100.0,0.0,0.0,2900.0,
689,17100.0,0.0,0.0,2900.0,
690,17100.0,0.0,0.0,2900.0,
691,17100.0,0.0,0.0,2900.0,
692,17100.0,0.0,0.0,2900.0,
693,17100.0,0.0,0.0,2900.0,
694,17103.0,0.0,0.0,2897.0,
695,17116.0,0.0,0.0,2884.0,
696,17118.0,0.0,0.0,2882.0,
697,17144.0,0.0,0.0,2856.0,
698,17325.0,0.0,0.0,2675.0,
699,17351.0,0.0,0.0,2649.0,
700,17355.0,0.0,0.0,2645.0,
701,17355.0,0.0,0.0,2645.0,
702,17355.0,0.0,0.0,2645.0,
703,17355.0,0.0,0.0,2645.0,
704,17355.0,0.0,0.0,2645.0,
705,17355.0,0.0,0.0,2645.0,
706,17355.0,0.0,0.0,2645.0,
707,17355.0,0.0,0.0,2645.0,
708,17355.0,0.0,0.0,2645.0,
709,17355.0,0.0,0.0,2645.0,
710,17355.0,0.0,0.0,2645.0,
711,17355.0,0.0,0.0,2645.0,
712,17355.0,0.0,0.0,2645.0,
713,17355.0,0.0,0.0,2645.0,
714,17355.0,0.0,0.0,2645.0,
715,17355.0,0.0,0.0,2645.0,
716,17355.0,0.0,0.0,2645.0,
717,17355.0,0.0,0.0,2645.0,
718,17355.0,0.0,0.0,2645.0,
719,17355.0,0.0,0.0,2645.0,
720,17355.0,0.0,0.0,2645.0,
721,17355.0,0.0,0.0,2645.0,
722,17355.0,0.0,0.0,2645.0,
723,17355.0,0.0,0.0,2645.0,
724,17355.0,0.0,0.0,2645.0,
725,17355.0,0.0,0.0,2645.0,
726,17355.0,0.0,0.0,2645.0,
727,17355.0,0.0,0.0,2645.0,
728,17355.0,0.0,0.0,2645.0,
729,17355.0,0.0,0.0,2645.0,
730,17355.0,0.0,0.0,2645.0,
