jour,S,I,E,R,
0,19980.0,20.0,0.0,0.0,
1,19968.0,20.0,12.0,0.0,
2,19919.0,4.0,57.0,20.0,
3,19894.0,13.0,72.0,21.0,
4,19832.0,29.0,116.0,23.0,
5,19710.0,61.0,203.0,26.0,
6,19379.0,113.0,476.0,32.0,
7,18776.0,207.0,975.0,42.0,
8,17793.0,498.0,1647.0,62.0,
9,16068.0,852.0,2997.0,83.0,
10,13189.0,1693.0,4937.0,181.0,
11,8834.0,3165.0,7648.0,353.0,
12,4632.0,5052.0,9755.0,561.0,
13,1528.0,7478.0,9887.0,1107.0,
14,425.0,10277.0,7523.0,1775.0,
15,94.0,11983.0,5174.0,2749.0,
16,10.0,12013.0,3710.0,4267.0,
17,5.0,11540.0,2693.0,5762.0,
18,0.0,11009.0,1767.0,7224.0,
19,0.0,10269.0,1132.0,8599.0,
20,0.0,9080.0,1043.0,9877.0,
21,0.0,7951.0,1020.0,11029.0,
22,0.0,7140.0,1017.0,11843.0,
23,0.0,6369.0,759.0,12872.0,
24,0.0,5455.0,560.0,13985.0,
25,0.0,5006.0,276.0,14718.0,
26,0.0,4361.0,246.0,15393.0,
27,0.0,3786.0,63.0,16151.0,
28,0.0,3011.0,33.0,16956.0,
29,5.0,2565.0,11.0,17419.0,
30,16.0,2029.0,0.0,17955.0,
31,16.0,1585.0,2.0,18397.0,
32,82.0,1455.0,6.0,18457.0,
33,82.0,1082.0,10.0,18826.0,
34,166.0,920.0,23.0,18891.0,
35,224.0,749.0,38.0,18989.0,
36,344.0,677.0,9.0,18970.0,
37,397.0,672.0,6.0,18925.0,
38,493.0,590.0,84.0,18833.0,
39,520.0,595.0,107.0,18778.0,
40,437.0,605.0,183.0,18775.0,
41,490.0,619.0,203.0,18688.0,
42,576.0,591.0,181.0,18652.0,
43,635.0,586.0,134.0,18645.0,
44,679.0,620.0,66.0,18635.0,
45,911.0,563.0,134.0,18392.0,
46,990.0,595.0,134.0,18281.0,
47,981.0,567.0,178.0,18274.0,
48,1191.0,538.0,238.0,18033.0,
49,1126.0,549.0,287.0,18038.0,
50,1086.0,580.0,335.0,17999.0,
51,1041.0,473.0,322.0,18164.0,
52,964.0,441.0,381.0,18214.0,
53,893.0,448.0,411.0,18248.0,
54,755.0,538.0,417.0,18290.0,
55,746.0,549.0,391.0,18314.0,
56,732.0,607.0,277.0,18384.0,
57,701.0,531.0,313.0,18455.0,
58,769.0,546.0,296.0,18389.0,
59,743.0,440.0,345.0,18472.0,
60,905.0,487.0,376.0,18232.0,
61,921.0,493.0,387.0,18199.0,
62,1019.0,550.0,282.0,18149.0,
63,923.0,587.0,314.0,18176.0,
64,878.0,524.0,395.0,18203.0,
65,887.0,590.0,263.0,18260.0,
66,835.0,641.0,295.0,18229.0,
67,892.0,597.0,290.0,18221.0,
68,946.0,674.0,120.0,18260.0,
69,904.0,618.0,202.0,18276.0,
70,890.0,631.0,174.0,18305.0,
71,852.0,570.0,173.0,18405.0,
72,772.0,536.0,224.0,18468.0,
73,736.0,541.0,179.0,18544.0,
74,711.0,535.0,218.0,18536.0,
75,660.0,616.0,200.0,18524.0,
76,615.0,644.0,182.0,18559.0,
77,574.0,654.0,196.0,18576.0,
78,553.0,721.0,146.0,18580.0,
79,500.0,680.0,207.0,18613.0,
80,496.0,728.0,120.0,18656.0,
81,693.0,665.0,91.0,18551.0,
82,718.0,606.0,132.0,18544.0,
83,815.0,608.0,172.0,18405.0,
84,789.0,603.0,202.0,18406.0,
85,787.0,652.0,210.0,18351.0,
86,825.0,638.0,241.0,18296.0,
87,879.0,619.0,200.0,18302.0,
88,890.0,585.0,228.0,18297.0,
89,980.0,575.0,262.0,18183.0,
90,982.0,586.0,304.0,18128.0,
91,958.0,621.0,339.0,18082.0,
92,946.0,631.0,269.0,18154.0,
93,915.0,649.0,244.0,18192.0,
94,890.0,653.0,278.0,18179.0,
95,876.0,587.0,313.0,18224.0,
96,896.0,523.0,304.0,18277.0,
97,924.0,491.0,266.0,18319.0,
98,995.0,464.0,274.0,18267.0,
99,1035.0,442.0,264.0,18259.0,
100,1170.0,445.0,295.0,18090.0,
101,1199.0,461.0,301.0,18039.0,
102,1242.0,460.0,266.0,18032.0,
103,1279.0,478.0,295.0,17948.0,
104,1267.0,502.0,243.0,17988.0,
105,1180.0,514.0,287.0,18019.0,
106,1167.0,558.0,246.0,18029.0,
107,1127.0,552.0,291.0,18030.0,
108,1079.0,615.0,307.0,17999.0,
109,1136.0,608.0,321.0,17935.0,
110,1101.0,627.0,362.0,17910.0,
111,1111.0,578.0,405.0,17906.0,
112,1139.0,631.0,378.0,17852.0,
113,1046.0,621.0,458.0,17875.0,
114,1010.0,751.0,393.0,17846.0,
115,1000.0,810.0,364.0,17826.0,
116,925.0,759.0,377.0,17939.0,
117,909.0,740.0,332.0,18019.0,
118,926.0,727.0,317.0,18030.0,
119,944.0,747.0,280.0,18029.0,
120,941.0,746.0,262.0,18051.0,
121,938.0,702.0,284.0,18076.0,
122,920.0,726.0,250.0,18104.0,
123,1083.0,731.0,217.0,17969.0,
124,1209.0,714.0,275.0,17802.0,
125,1172.0,674.0,396.0,17758.0,
126,1135.0,674.0,458.0,17733.0,
127,1198.0,686.0,515.0,17601.0,
128,1166.0,728.0,509.0,17597.0,
129,1119.0,759.0,553.0,17569.0,
130,1070.0,781.0,592.0,17557.0,
131,1048.0,855.0,537.0,17560.0,
132,1003.0,886.0,561.0,17550.0,
133,934.0,976.0,522.0,17568.0,
134,831.0,983.0,562.0,17624.0,
135,781.0,1028.0,474.0,17717.0,
136,723.0,949.0,442.0,17886.0,
137,689.0,940.0,466.0,17905.0,
138,726.0,1008.0,342.0,17924.0,
139,681.0,914.0,334.0,18071.0,
140,794.0,904.0,318.0,17984.0,
141,919.0,825.0,270.0,17986.0,
142,956.0,785.0,253.0,18006.0,
143,954.0,747.0,257.0,18042.0,
144,976.0,747.0,182.0,18095.0,
145,929.0,690.0,320.0,18061.0,
146,894.0,748.0,313.0,18045.0,
147,896.0,768.0,298.0,18038.0,
148,858.0,655.0,344.0,18143.0,
149,928.0,673.0,252.0,18147.0,
150,921.0,643.0,256.0,18180.0,
151,1052.0,606.0,235.0,18107.0,
152,1237.0,579.0,181.0,18003.0,
153,1271.0,564.0,257.0,17908.0,
154,1439.0,527.0,288.0,17746.0,
155,1777.0,555.0,323.0,17345.0,
156,1859.0,516.0,350.0,17275.0,
157,1902.0,461.0,384.0,17253.0,
158,1849.0,516.0,463.0,17172.0,
159,1938.0,623.0,473.0,16966.0,
160,1907.0,644.0,492.0,16957.0,
161,1817.0,722.0,476.0,16985.0,
162,1785.0,737.0,569.0,16909.0,
163,1654.0,803.0,661.0,16882.0,
164,1693.0,920.0,591.0,16796.0,
165,1549.0,1068.0,565.0,16818.0,
166,1615.0,1095.0,545.0,16745.0,
167,1568.0,1111.0,638.0,16683.0,
168,1416.0,1229.0,629.0,16726.0,
169,1387.0,1306.0,716.0,16591.0,
170,1300.0,1307.0,731.0,16662.0,
171,1259.0,1412.0,663.0,16666.0,
172,1041.0,1253.0,810.0,16896.0,
173,892.0,1273.0,775.0,17060.0,
174,831.0,1103.0,870.0,17196.0,
175,813.0,1130.0,827.0,17230.0,
176,742.0,1264.0,748.0,17246.0,
177,662.0,1369.0,675.0,17294.0,
178,664.0,1423.0,648.0,17265.0,
179,742.0,1334.0,645.0,17279.0,
180,640.0,1161.0,724.0,17475.0,
181,579.0,1197.0,649.0,17575.0,
182,579.0,1196.0,586.0,17639.0,
183,561.0,1248.0,503.0,17688.0,
184,564.0,1207.0,524.0,17705.0,
185,548.0,1236.0,482.0,17734.0,
186,539.0,1233.0,453.0,17775.0,
187,547.0,1210.0,426.0,17817.0,
188,521.0,1083.0,333.0,18063.0,
189,513.0,1067.0,261.0,18159.0,
190,543.0,1052.0,215.0,18190.0,
191,544.0,937.0,236.0,18283.0,
192,626.0,834.0,231.0,18309.0,
193,698.0,881.0,186.0,18235.0,
194,736.0,876.0,214.0,18174.0,
195,796.0,839.0,236.0,18129.0,
196,844.0,801.0,240.0,18115.0,
197,891.0,727.0,265.0,18117.0,
198,1056.0,734.0,297.0,17913.0,
199,1090.0,704.0,238.0,17968.0,
200,1124.0,648.0,274.0,17954.0,
201,1103.0,678.0,281.0,17938.0,
202,1245.0,695.0,330.0,17730.0,
203,1318.0,684.0,417.0,17581.0,
204,1277.0,749.0,472.0,17502.0,
205,1302.0,822.0,427.0,17449.0,
206,1305.0,885.0,337.0,17473.0,
207,1281.0,968.0,339.0,17412.0,
208,1254.0,900.0,329.0,17517.0,
209,1229.0,837.0,389.0,17545.0,
210,1214.0,877.0,365.0,17544.0,
211,1237.0,886.0,372.0,17505.0,
212,1262.0,812.0,378.0,17548.0,
213,1149.0,840.0,459.0,17552.0,
214,1147.0,772.0,446.0,17635.0,
215,1118.0,717.0,500.0,17665.0,
216,1080.0,754.0,491.0,17675.0,
217,1069.0,828.0,431.0,17672.0,
218,1070.0,814.0,459.0,17657.0,
219,994.0,851.0,456.0,17699.0,
220,1117.0,761.0,434.0,17688.0,
221,1169.0,723.0,392.0,17716.0,
222,1214.0,766.0,393.0,17627.0,
223,1190.0,711.0,447.0,17652.0,
224,1276.0,787.0,394.0,17543.0,
225,1166.0,862.0,487.0,17485.0,
226,1199.0,883.0,476.0,17442.0,
227,1104.0,927.0,459.0,17510.0,
228,1120.0,983.0,525.0,17372.0,
229,1086.0,1019.0,465.0,17430.0,
230,1058.0,1102.0,464.0,17376.0,
231,1037.0,1249.0,410.0,17304.0,
232,992.0,1052.0,480.0,17476.0,
233,977.0,1044.0,453.0,17526.0,
234,945.0,1053.0,389.0,17613.0,
235,907.0,1076.0,371.0,17646.0,
236,834.0,1019.0,386.0,17761.0,
237,862.0,936.0,387.0,17815.0,
238,865.0,891.0,386.0,17858.0,
239,947.0,848.0,385.0,17820.0,
240,958.0,829.0,402.0,17811.0,
241,1005.0,847.0,368.0,17780.0,
242,999.0,836.0,404.0,17761.0,
243,1215.0,802.0,476.0,17507.0,
244,1172.0,844.0,550.0,17434.0,
245,1089.0,953.0,512.0,17446.0,
246,1076.0,987.0,494.0,17443.0,
247,1051.0,1051.0,481.0,17417.0,
248,1043.0,1012.0,569.0,17376.0,
249,1006.0,1074.0,596.0,17324.0,
250,958.0,1151.0,577.0,17314.0,
251,970.0,1123.0,618.0,17289.0,
252,928.0,1155.0,601.0,17316.0,
253,826.0,1110.0,651.0,17413.0,
254,765.0,1210.0,617.0,17408.0,
255,736.0,1270.0,496.0,17498.0,
256,707.0,1277.0,487.0,17529.0,
257,678.0,1348.0,380.0,17594.0,
258,657.0,1271.0,374.0,17698.0,
259,677.0,1164.0,351.0,17808.0,
260,697.0,1137.0,335.0,17831.0,
261,686.0,1110.0,279.0,17925.0,
262,749.0,1093.0,269.0,17889.0,
263,784.0,1080.0,234.0,17902.0,
264,901.0,1011.0,248.0,17840.0,
265,946.0,899.0,256.0,17899.0,
266,937.0,899.0,194.0,17970.0,
267,954.0,806.0,234.0,18006.0,
268,1088.0,781.0,252.0,17879.0,
269,1149.0,786.0,217.0,17848.0,
270,1132.0,755.0,304.0,17809.0,
271,1099.0,696.0,373.0,17832.0,
272,1159.0,758.0,371.0,17712.0,
273,1235.0,732.0,380.0,17653.0,
274,1373.0,708.0,424.0,17495.0,
275,1754.0,718.0,534.0,16994.0,
276,1813.0,808.0,565.0,16814.0,
277,1865.0,835.0,673.0,16627.0,
278,1728.0,913.0,828.0,16531.0,
279,1578.0,1056.0,781.0,16585.0,
280,1604.0,1027.0,957.0,16412.0,
281,1574.0,1206.0,800.0,16420.0,
282,1390.0,1397.0,856.0,16357.0,
283,1337.0,1606.0,774.0,16283.0,
284,1282.0,1559.0,952.0,16207.0,
285,1246.0,1631.0,945.0,16178.0,
286,1208.0,1745.0,846.0,16201.0,
287,1165.0,1865.0,872.0,16098.0,
288,1155.0,1943.0,815.0,16087.0,
289,960.0,2105.0,885.0,16050.0,
290,802.0,2312.0,836.0,16050.0,
291,677.0,2459.0,772.0,16092.0,
292,630.0,2601.0,644.0,16125.0,
293,562.0,2602.0,643.0,16193.0,
294,538.0,2701.0,622.0,16139.0,
295,512.0,2712.0,657.0,16119.0,
296,505.0,2705.0,606.0,16184.0,
297,487.0,2727.0,510.0,16276.0,
298,462.0,2745.0,466.0,16327.0,
299,480.0,2616.0,505.0,16399.0,
300,471.0,2554.0,453.0,16522.0,
301,456.0,2485.0,521.0,16538.0,
302,456.0,2442.0,543.0,16559.0,
303,506.0,2294.0,524.0,16676.0,
304,523.0,2165.0,531.0,16781.0,
305,526.0,1996.0,533.0,16945.0,
306,582.0,1873.0,466.0,17079.0,
307,651.0,1815.0,435.0,17099.0,
308,820.0,1686.0,459.0,17035.0,
309,872.0,1579.0,325.0,17224.0,
310,980.0,1458.0,322.0,17240.0,
311,1038.0,1385.0,339.0,17238.0,
312,952.0,1379.0,453.0,17216.0,
313,943.0,1268.0,522.0,17267.0,
314,989.0,1172.0,578.0,17261.0,
315,997.0,1246.0,535.0,17222.0,
316,957.0,1290.0,585.0,17168.0,
317,906.0,1239.0,672.0,17183.0,
318,888.0,1349.0,568.0,17195.0,
319,854.0,1300.0,499.0,17347.0,
320,821.0,1321.0,463.0,17395.0,
321,811.0,1242.0,455.0,17492.0,
322,828.0,1144.0,549.0,17479.0,
323,852.0,1108.0,460.0,17580.0,
324,836.0,1102.0,493.0,17569.0,
325,886.0,1103.0,479.0,17532.0,
326,917.0,1079.0,500.0,17504.0,
327,1046.0,1115.0,470.0,17369.0,
328,1055.0,1065.0,564.0,17316.0,
329,1101.0,1032.0,580.0,17287.0,
330,1159.0,1083.0,562.0,17196.0,
331,1133.0,1118.0,571.0,17178.0,
332,1134.0,1087.0,628.0,17151.0,
333,1120.0,1140.0,504.0,17236.0,
334,1055.0,1154.0,504.0,17287.0,
335,1029.0,1124.0,543.0,17304.0,
336,1022.0,1088.0,509.0,17381.0,
337,1022.0,1026.0,491.0,17461.0,
338,953.0,1017.0,480.0,17550.0,
339,875.0,970.0,533.0,17622.0,
340,874.0,945.0,491.0,17690.0,
341,843.0,877.0,522.0,17758.0,
342,819.0,897.0,484.0,17800.0,
343,814.0,890.0,413.0,17883.0,
344,789.0,768.0,454.0,17989.0,
345,798.0,843.0,387.0,17972.0,
346,831.0,860.0,369.0,17940.0,
347,885.0,842.0,365.0,17908.0,
348,907.0,793.0,406.0,17894.0,
349,965.0,722.0,459.0,17854.0,
350,1021.0,721.0,463.0,17795.0,
351,1034.0,794.0,449.0,17723.0,
352,999.0,810.0,529.0,17662.0,
353,960.0,836.0,533.0,17671.0,
354,917.0,824.0,574.0,17685.0,
355,911.0,919.0,526.0,17644.0,
356,839.0,869.0,573.0,17719.0,
357,835.0,943.0,482.0,17740.0,
358,836.0,942.0,535.0,17687.0,
359,778.0,977.0,519.0,17726.0,
360,756.0,996.0,507.0,17741.0,
361,752.0,1043.0,541.0,17664.0,
362,756.0,1030.0,449.0,17765.0,
363,742.0,1019.0,451.0,17788.0,
364,763.0,1026.0,412.0,17799.0,
365,739.0,985.0,430.0,17846.0,
366,726.0,1012.0,403.0,17859.0,
367,729.0,990.0,377.0,17904.0,
368,718.0,978.0,386.0,17918.0,
369,736.0,888.0,404.0,17972.0,
370,733.0,843.0,362.0,18062.0,
371,763.0,779.0,386.0,18072.0,
372,768.0,730.0,333.0,18169.0,
373,789.0,685.0,301.0,18225.0,
374,790.0,667.0,314.0,18229.0,
375,800.0,689.0,244.0,18267.0,
376,807.0,637.0,291.0,18265.0,
377,793.0,634.0,257.0,18316.0,
378,818.0,614.0,219.0,18349.0,
379,823.0,623.0,223.0,18331.0,
380,876.0,561.0,235.0,18328.0,
381,888.0,542.0,207.0,18363.0,
382,932.0,559.0,177.0,18332.0,
383,974.0,508.0,200.0,18318.0,
384,1025.0,479.0,197.0,18299.0,
385,1038.0,479.0,212.0,18271.0,
386,1128.0,467.0,214.0,18191.0,
387,1194.0,428.0,233.0,18145.0,
388,1237.0,480.0,237.0,18046.0,
389,1290.0,477.0,271.0,17962.0,
390,1335.0,519.0,251.0,17895.0,
391,1329.0,564.0,255.0,17852.0,
392,1320.0,575.0,352.0,17753.0,
393,1336.0,608.0,354.0,17702.0,
394,1343.0,669.0,373.0,17615.0,
395,1309.0,756.0,376.0,17559.0,
396,1281.0,739.0,437.0,17543.0,
397,1252.0,792.0,362.0,17594.0,
398,1218.0,776.0,430.0,17576.0,
399,1192.0,857.0,366.0,17585.0,
400,1151.0,883.0,373.0,17593.0,
401,1084.0,933.0,329.0,17654.0,
402,1021.0,921.0,333.0,17725.0,
403,971.0,862.0,438.0,17729.0,
404,985.0,908.0,357.0,17750.0,
405,943.0,901.0,374.0,17782.0,
406,958.0,872.0,419.0,17751.0,
407,951.0,877.0,434.0,17738.0,
408,988.0,944.0,368.0,17700.0,
409,948.0,929.0,345.0,17778.0,
410,919.0,930.0,319.0,17832.0,
411,921.0,875.0,315.0,17889.0,
412,932.0,797.0,292.0,17979.0,
413,933.0,796.0,278.0,17993.0,
414,986.0,826.0,290.0,17898.0,
415,1000.0,784.0,303.0,17913.0,
416,1043.0,764.0,339.0,17854.0,
417,1110.0,777.0,288.0,17825.0,
418,1134.0,758.0,315.0,17793.0,
419,1128.0,734.0,273.0,17865.0,
420,1173.0,640.0,361.0,17826.0,
421,1164.0,593.0,416.0,17827.0,
422,1152.0,677.0,348.0,17823.0,
423,1101.0,752.0,318.0,17829.0,
424,1075.0,745.0,330.0,17850.0,
425,1108.0,795.0,236.0,17861.0,
426,1110.0,815.0,304.0,17771.0,
427,1052.0,811.0,432.0,17705.0,
428,1024.0,763.0,479.0,17734.0,
429,1026.0,808.0,429.0,17737.0,
430,1018.0,793.0,391.0,17798.0,
431,1018.0,802.0,348.0,17832.0,
432,1017.0,797.0,408.0,17778.0,
433,1026.0,854.0,390.0,17730.0,
434,1017.0,897.0,343.0,17743.0,
435,1048.0,862.0,375.0,17715.0,
436,1103.0,875.0,308.0,17714.0,
437,1163.0,829.0,330.0,17678.0,
438,1178.0,815.0,375.0,17632.0,
439,1229.0,831.0,400.0,17540.0,
440,1242.0,914.0,429.0,17415.0,
441,1257.0,925.0,549.0,17269.0,
442,1241.0,958.0,569.0,17232.0,
443,1259.0,998.0,593.0,17150.0,
444,1261.0,983.0,601.0,17155.0,
445,1291.0,1005.0,576.0,17128.0,
446,1196.0,1095.0,575.0,17134.0,
447,1212.0,1150.0,635.0,17003.0,
448,1186.0,1177.0,606.0,17031.0,
449,1138.0,1131.0,599.0,17132.0,
450,1084.0,1221.0,525.0,17170.0,
451,1043.0,1217.0,587.0,17153.0,
452,1021.0,1200.0,613.0,17166.0,
453,1028.0,1235.0,556.0,17181.0,
454,995.0,1213.0,551.0,17241.0,
455,935.0,1147.0,616.0,17302.0,
456,964.0,1189.0,604.0,17243.0,
457,1008.0,1137.0,656.0,17199.0,
458,970.0,1206.0,573.0,17251.0,
459,977.0,1275.0,507.0,17241.0,
460,926.0,1249.0,553.0,17272.0,
461,900.0,1367.0,514.0,17219.0,
462,864.0,1382.0,530.0,17224.0,
463,840.0,1326.0,604.0,17230.0,
464,843.0,1318.0,613.0,17226.0,
465,924.0,1269.0,622.0,17185.0,
466,877.0,1374.0,533.0,17216.0,
467,994.0,1383.0,489.0,17134.0,
468,926.0,1386.0,533.0,17155.0,
469,878.0,1359.0,604.0,17159.0,
470,856.0,1384.0,514.0,17246.0,
471,812.0,1397.0,467.0,17324.0,
472,842.0,1380.0,439.0,17339.0,
473,830.0,1315.0,516.0,17339.0,
474,862.0,1309.0,516.0,17313.0,
475,847.0,1320.0,608.0,17225.0,
476,935.0,1331.0,572.0,17162.0,
477,921.0,1352.0,496.0,17231.0,
478,923.0,1336.0,573.0,17168.0,
479,916.0,1306.0,531.0,17247.0,
480,937.0,1355.0,436.0,17272.0,
481,965.0,1315.0,439.0,17281.0,
482,908.0,1289.0,539.0,17264.0,
483,856.0,1248.0,613.0,17283.0,
484,847.0,1222.0,578.0,17353.0,
485,850.0,1223.0,593.0,17334.0,
486,796.0,1310.0,557.0,17337.0,
487,766.0,1343.0,505.0,17386.0,
488,767.0,1272.0,500.0,17461.0,
489,788.0,1195.0,518.0,17499.0,
490,841.0,1148.0,501.0,17510.0,
491,827.0,1040.0,464.0,17669.0,
492,855.0,988.0,467.0,17690.0,
493,933.0,959.0,458.0,17650.0,
494,1030.0,828.0,514.0,17628.0,
495,1096.0,818.0,516.0,17570.0,
496,1076.0,897.0,519.0,17508.0,
497,1088.0,945.0,464.0,17503.0,
498,1105.0,936.0,422.0,17537.0,
499,1059.0,975.0,439.0,17527.0,
500,1006.0,1053.0,388.0,17553.0,
501,984.0,1050.0,404.0,17562.0,
502,1029.0,1057.0,446.0,17468.0,
503,1005.0,1035.0,501.0,17459.0,
504,949.0,1163.0,497.0,17391.0,
505,977.0,1174.0,549.0,17300.0,
506,988.0,1159.0,516.0,17337.0,
507,935.0,1135.0,516.0,17414.0,
508,930.0,1107.0,476.0,17487.0,
509,830.0,1133.0,532.0,17505.0,
510,745.0,1113.0,560.0,17582.0,
511,725.0,1130.0,495.0,17650.0,
512,724.0,1170.0,473.0,17633.0,
513,740.0,1162.0,431.0,17667.0,
514,756.0,1082.0,390.0,17772.0,
515,808.0,1061.0,416.0,17715.0,
516,931.0,1016.0,445.0,17608.0,
517,990.0,984.0,524.0,17502.0,
518,993.0,989.0,442.0,17576.0,
519,1008.0,1017.0,449.0,17526.0,
520,1020.0,1088.0,432.0,17460.0,
521,1059.0,1116.0,370.0,17455.0,
522,1010.0,1072.0,458.0,17460.0,
523,1071.0,1015.0,463.0,17451.0,
524,1018.0,958.0,472.0,17552.0,
525,1038.0,915.0,467.0,17580.0,
526,1056.0,979.0,468.0,17497.0,
527,1078.0,957.0,474.0,17491.0,
528,1071.0,963.0,455.0,17511.0,
529,1009.0,901.0,481.0,17609.0,
530,982.0,931.0,502.0,17585.0,
531,970.0,912.0,489.0,17629.0,
532,968.0,960.0,465.0,17607.0,
533,950.0,994.0,514.0,17542.0,
534,942.0,1020.0,470.0,17568.0,
535,958.0,987.0,444.0,17611.0,
536,997.0,998.0,444.0,17561.0,
537,998.0,931.0,440.0,17631.0,
538,1026.0,866.0,470.0,17638.0,
539,1081.0,838.0,465.0,17616.0,
540,1144.0,849.0,481.0,17526.0,
541,1195.0,820.0,514.0,17471.0,
542,1279.0,855.0,524.0,17342.0,
543,1324.0,935.0,533.0,17208.0,
544,1308.0,899.0,578.0,17215.0,
545,1326.0,984.0,539.0,17151.0,
546,1333.0,1051.0,625.0,16991.0,
547,1311.0,1086.0,692.0,16911.0,
548,1288.0,1130.0,586.0,16996.0,
549,1348.0,1165.0,526.0,16961.0,
550,1324.0,1169.0,505.0,17002.0,
551,1250.0,1263.0,550.0,16937.0,
552,1223.0,1340.0,609.0,16828.0,
553,1154.0,1414.0,584.0,16848.0,
554,1132.0,1540.0,598.0,16730.0,
555,1108.0,1590.0,512.0,16790.0,
556,1024.0,1580.0,559.0,16837.0,
557,921.0,1647.0,620.0,16812.0,
558,818.0,1711.0,710.0,16761.0,
559,793.0,1714.0,738.0,16755.0,
560,766.0,1747.0,691.0,16796.0,
561,808.0,1736.0,682.0,16774.0,
562,717.0,1820.0,675.0,16788.0,
563,775.0,1858.0,569.0,16798.0,
564,710.0,1864.0,589.0,16837.0,
565,709.0,1890.0,541.0,16860.0,
566,706.0,1921.0,487.0,16886.0,
567,702.0,1947.0,545.0,16806.0,
568,737.0,2015.0,507.0,16741.0,
569,633.0,2025.0,612.0,16730.0,
570,559.0,2195.0,615.0,16631.0,
571,524.0,2220.0,579.0,16677.0,
572,438.0,2286.0,568.0,16708.0,
573,457.0,2262.0,448.0,16833.0,
574,414.0,2235.0,480.0,16871.0,
575,394.0,2293.0,479.0,16834.0,
576,415.0,2315.0,410.0,16860.0,
577,435.0,2236.0,419.0,16910.0,
578,438.0,2081.0,367.0,17114.0,
579,452.0,1946.0,370.0,17232.0,
580,517.0,1875.0,376.0,17232.0,
581,590.0,1725.0,396.0,17289.0,
582,605.0,1590.0,336.0,17469.0,
583,635.0,1420.0,367.0,17578.0,
584,702.0,1260.0,390.0,17648.0,
585,729.0,1265.0,362.0,17644.0,
586,755.0,1227.0,385.0,17633.0,
587,744.0,1172.0,403.0,17681.0,
588,739.0,1149.0,439.0,17673.0,
589,735.0,1160.0,368.0,17737.0,
590,775.0,1113.0,341.0,17771.0,
591,804.0,1051.0,347.0,17798.0,
592,862.0,1041.0,330.0,17767.0,
593,891.0,972.0,387.0,17750.0,
594,1065.0,909.0,392.0,17634.0,
595,1144.0,847.0,406.0,17603.0,
596,1268.0,843.0,420.0,17469.0,
597,1280.0,746.0,543.0,17431.0,
598,1306.0,756.0,594.0,17344.0,
599,1338.0,851.0,550.0,17261.0,
600,1318.0,880.0,522.0,17280.0,
601,1341.0,884.0,507.0,17268.0,
602,1300.0,906.0,557.0,17237.0,
603,1313.0,892.0,568.0,17227.0,
604,1304.0,971.0,546.0,17179.0,
605,1300.0,1066.0,472.0,17162.0,
606,1229.0,1077.0,547.0,17147.0,
607,1176.0,1115.0,604.0,17105.0,
608,1251.0,1144.0,607.0,16998.0,
609,1238.0,1232.0,555.0,16975.0,
610,1218.0,1189.0,675.0,16918.0,
611,1170.0,1166.0,728.0,16936.0,
612,1125.0,1280.0,662.0,16933.0,
613,1060.0,1307.0,635.0,16998.0,
614,1012.0,1255.0,694.0,17039.0,
615,934.0,1274.0,675.0,17117.0,
616,908.0,1421.0,547.0,17124.0,
617,844.0,1429.0,504.0,17223.0,
618,814.0,1481.0,420.0,17285.0,
619,782.0,1428.0,422.0,17368.0,
620,742.0,1371.0,395.0,17492.0,
621,714.0,1297.0,442.0,17547.0,
622,718.0,1220.0,450.0,17612.0,
623,729.0,1121.0,423.0,17727.0,
624,737.0,1052.0,382.0,17829.0,
625,764.0,1041.0,315.0,17880.0,
626,788.0,1064.0,264.0,17884.0,
627,768.0,993.0,265.0,17974.0,
628,779.0,932.0,250.0,18039.0,
629,789.0,902.0,240.0,18069.0,
630,767.0,881.0,296.0,18056.0,
631,782.0,799.0,362.0,18057.0,
632,784.0,803.0,349.0,18064.0,
633,830.0,828.0,297.0,18045.0,
634,842.0,847.0,277.0,18034.0,
635,870.0,843.0,241.0,18046.0,
636,868.0,764.0,299.0,18069.0,
637,884.0,718.0,300.0,18098.0,
638,899.0,716.0,301.0,18084.0,
639,917.0,722.0,326.0,18035.0,
640,927.0,717.0,333.0,18023.0,
641,924.0,745.0,325.0,18006.0,
642,939.0,723.0,342.0,17996.0,
643,968.0,688.0,375.0,17969.0,
644,992.0,698.0,355.0,17955.0,
645,1011.0,700.0,361.0,17928.0,
646,968.0,733.0,393.0,17906.0,
647,1025.0,733.0,398.0,17844.0,
648,1223.0,721.0,378.0,17678.0,
649,1244.0,694.0,357.0,17705.0,
650,1307.0,700.0,397.0,17596.0,
651,1341.0,676.0,425.0,17558.0,
652,1343.0,675.0,380.0,17602.0,
653,1368.0,686.0,408.0,17538.0,
654,1420.0,756.0,433.0,17391.0,
655,1438.0,760.0,398.0,17404.0,
656,1380.0,766.0,493.0,17361.0,
657,1339.0,784.0,536.0,17341.0,
658,1289.0,891.0,501.0,17319.0,
659,1278.0,893.0,497.0,17332.0,
660,1205.0,837.0,589.0,17369.0,
661,1182.0,833.0,535.0,17450.0,
662,1155.0,816.0,553.0,17476.0,
663,1168.0,788.0,519.0,17525.0,
664,1194.0,877.0,419.0,17510.0,
665,1164.0,848.0,374.0,17614.0,
666,1138.0,789.0,411.0,17662.0,
667,1141.0,781.0,452.0,17626.0,
668,1159.0,779.0,476.0,17586.0,
669,1153.0,732.0,550.0,17565.0,
670,1165.0,780.0,477.0,17578.0,
671,1174.0,814.0,446.0,17566.0,
672,1180.0,809.0,500.0,17511.0,
673,1196.0,811.0,458.0,17535.0,
674,1177.0,781.0,502.0,17540.0,
675,1193.0,790.0,473.0,17544.0,
676,1174.0,841.0,467.0,17518.0,
677,1160.0,810.0,535.0,17495.0,
678,1149.0,889.0,501.0,17461.0,
679,1133.0,895.0,518.0,17454.0,
680,1117.0,917.0,468.0,17498.0,
681,1096.0,828.0,526.0,17550.0,
682,1125.0,860.0,494.0,17521.0,
683,1115.0,850.0,466.0,17569.0,
684,1093.0,896.0,423.0,17588.0,
685,1111.0,806.0,412.0,17671.0,
686,1111.0,816.0,467.0,17606.0,
687,1129.0,807.0,477.0,17587.0,
688,1158.0,758.0,466.0,17618.0,
689,1252.0,729.0,408.0,17611.0,
690,1309.0,778.0,401.0,17512.0,
691,1397.0,766.0,445.0,17392.0,
692,1469.0,765.0,463.0,17303.0,
693,1473.0,796.0,530.0,17201.0,
694,1492.0,867.0,489.0,17152.0,
695,1468.0,926.0,490.0,17116.0,
696,1422.0,981.0,552.0,17045.0,
697,1284.0,963.0,663.0,17090.0,
698,1251.0,1101.0,602.0,17046.0,
699,1175.0,1205.0,556.0,17064.0,
700,1106.0,1152.0,593.0,17149.0,
701,1036.0,1134.0,623.0,17207.0,
702,1010.0,1179.0,552.0,17259.0,
703,951.0,1099.0,639.0,17311.0,
704,976.0,1120.0,582.0,17322.0,
705,1113.0,1147.0,590.0,17150.0,
706,1044.0,1252.0,587.0,17117.0,
707,989.0,1193.0,629.0,17189.0,
708,963.0,1263.0,599.0,17175.0,
709,916.0,1355.0,567.0,17162.0,
710,860.0,1356.0,516.0,17268.0,
711,815.0,1365.0,460.0,17360.0,
712,798.0,1315.0,498.0,17389.0,
713,785.0,1310.0,438.0,17467.0,
714,676.0,1288.0,489.0,17547.0,
715,668.0,1274.0,438.0,17620.0,
716,653.0,1172.0,434.0,17741.0,
717,653.0,1125.0,456.0,17766.0,
718,656.0,1152.0,339.0,17853.0,
719,661.0,1130.0,296.0,17913.0,
720,643.0,1089.0,315.0,17953.0,
721,662.0,1052.0,285.0,18001.0,
722,663.0,978.0,316.0,18043.0,
723,678.0,932.0,291.0,18099.0,
724,686.0,873.0,304.0,18137.0,
725,718.0,825.0,282.0,18175.0,
726,730.0,754.0,316.0,18200.0,
727,764.0,733.0,274.0,18229.0,
728,777.0,712.0,284.0,18227.0,
729,815.0,667.0,298.0,18220.0,
730,862.0,689.0,288.0,18161.0,
