jour,S,I,E,R,
0,19980.0,20.0,0.0,0.0,
1,19967.0,20.0,13.0,0.0,
2,19913.0,23.0,64.0,0.0,
3,19823.0,35.0,142.0,0.0,
4,19672.0,59.0,266.0,3.0,
5,19419.0,102.0,469.0,10.0,
6,19061.0,206.0,708.0,25.0,
7,18149.0,377.0,1426.0,48.0,
8,16511.0,606.0,2766.0,117.0,
9,14390.0,1267.0,4120.0,223.0,
10,10236.0,2075.0,7284.0,405.0,
11,6656.0,3323.0,9209.0,812.0,
12,3971.0,5377.0,9476.0,1176.0,
13,1267.0,7089.0,9917.0,1727.0,
14,280.0,8385.0,8606.0,2729.0,
15,33.0,9205.0,6616.0,4146.0,
16,17.0,9098.0,5299.0,5586.0,
17,3.0,8706.0,4186.0,7105.0,
18,0.0,8583.0,3008.0,8409.0,
19,0.0,8650.0,1802.0,9548.0,
20,0.0,8091.0,1399.0,10510.0,
21,0.0,7488.0,1077.0,11435.0,
22,0.0,6777.0,621.0,12602.0,
23,0.0,5763.0,408.0,13829.0,
24,0.0,5156.0,314.0,14530.0,
25,0.0,4505.0,224.0,15271.0,
26,0.0,3795.0,138.0,16067.0,
27,0.0,3222.0,111.0,16667.0,
28,0.0,2488.0,110.0,17402.0,
29,0.0,2210.0,10.0,17780.0,
30,2.0,1920.0,0.0,18078.0,
31,2.0,1477.0,1.0,18520.0,
32,2.0,1268.0,0.0,18730.0,
33,2.0,1205.0,0.0,18793.0,
34,2.0,1041.0,0.0,18957.0,
35,2.0,790.0,0.0,19208.0,
36,59.0,775.0,0.0,19166.0,
37,59.0,741.0,0.0,19200.0,
38,60.0,715.0,1.0,19224.0,
39,173.0,598.0,14.0,19215.0,
40,187.0,523.0,45.0,19245.0,
41,170.0,408.0,26.0,19396.0,
42,150.0,384.0,22.0,19444.0,
43,139.0,291.0,14.0,19556.0,
44,139.0,195.0,0.0,19666.0,
45,140.0,167.0,0.0,19693.0,
46,194.0,114.0,0.0,19692.0,
47,266.0,110.0,8.0,19616.0,
48,288.0,115.0,3.0,19594.0,
49,350.0,15.0,3.0,19632.0,
50,541.0,0.0,4.0,19455.0,
51,659.0,1.0,3.0,19337.0,
52,721.0,4.0,0.0,19275.0,
53,768.0,3.0,2.0,19227.0,
54,926.0,3.0,3.0,19068.0,
55,976.0,3.0,5.0,19016.0,
56,1042.0,4.0,4.0,18950.0,
57,1127.0,4.0,5.0,18864.0,
58,1202.0,5.0,5.0,18788.0,
59,1228.0,5.0,6.0,18761.0,
60,1283.0,2.0,7.0,18708.0,
61,1283.0,3.0,6.0,18708.0,
62,1379.0,3.0,6.0,18612.0,
63,1442.0,5.0,5.0,18548.0,
64,1575.0,6.0,4.0,18415.0,
65,1642.0,8.0,4.0,18346.0,
66,1735.0,7.0,5.0,18253.0,
67,1764.0,4.0,6.0,18226.0,
68,1812.0,3.0,5.0,18180.0,
69,1838.0,3.0,5.0,18154.0,
70,1862.0,2.0,7.0,18129.0,
71,1893.0,2.0,7.0,18098.0,
72,1917.0,5.0,4.0,18074.0,
73,1916.0,4.0,5.0,18075.0,
74,1984.0,4.0,5.0,18007.0,
75,2112.0,4.0,5.0,17879.0,
76,2197.0,5.0,4.0,17794.0,
77,2255.0,5.0,5.0,17735.0,
78,2280.0,9.0,0.0,17711.0,
79,2277.0,8.0,3.0,17712.0,
80,2379.0,7.0,6.0,17608.0,
81,2396.0,7.0,5.0,17592.0,
82,2394.0,7.0,7.0,17592.0,
83,2392.0,5.0,7.0,17596.0,
84,2391.0,5.0,7.0,17597.0,
85,2392.0,5.0,8.0,17595.0,
86,2392.0,6.0,7.0,17595.0,
87,2391.0,9.0,5.0,17595.0,
88,2387.0,10.0,6.0,17597.0,
89,2382.0,9.0,10.0,17599.0,
90,2379.0,9.0,11.0,17601.0,
91,2378.0,12.0,9.0,17601.0,
92,2371.0,11.0,12.0,17606.0,
93,2364.0,16.0,12.0,17608.0,
94,2360.0,21.0,10.0,17609.0,
95,2358.0,22.0,11.0,17609.0,
96,2355.0,23.0,9.0,17613.0,
97,2349.0,23.0,11.0,17617.0,
98,2342.0,22.0,18.0,17618.0,
99,2336.0,24.0,20.0,17620.0,
100,2328.0,29.0,24.0,17619.0,
101,2321.0,33.0,25.0,17621.0,
102,2308.0,43.0,26.0,17623.0,
103,2292.0,42.0,39.0,17627.0,
104,2273.0,47.0,53.0,17627.0,
105,2251.0,59.0,64.0,17626.0,
106,2262.0,68.0,49.0,17621.0,
107,2242.0,65.0,67.0,17626.0,
108,2224.0,58.0,85.0,17633.0,
109,2222.0,81.0,78.0,17619.0,
110,2222.0,95.0,112.0,17571.0,
111,2196.0,106.0,127.0,17571.0,
112,2342.0,105.0,125.0,17428.0,
113,2414.0,101.0,147.0,17338.0,
114,2410.0,99.0,179.0,17312.0,
115,2648.0,131.0,163.0,17058.0,
116,2646.0,162.0,196.0,16996.0,
117,2606.0,163.0,269.0,16962.0,
118,2510.0,199.0,301.0,16990.0,
119,2419.0,249.0,346.0,16986.0,
120,2284.0,308.0,358.0,17050.0,
121,2252.0,386.0,400.0,16962.0,
122,2235.0,436.0,351.0,16978.0,
123,2187.0,443.0,370.0,17000.0,
124,2017.0,453.0,420.0,17110.0,
125,1862.0,428.0,496.0,17214.0,
126,1738.0,534.0,449.0,17279.0,
127,1624.0,648.0,400.0,17328.0,
128,1380.0,643.0,530.0,17447.0,
129,1249.0,718.0,513.0,17520.0,
130,1169.0,730.0,432.0,17669.0,
131,1096.0,769.0,404.0,17731.0,
132,964.0,730.0,443.0,17863.0,
133,891.0,669.0,432.0,18008.0,
134,771.0,613.0,463.0,18153.0,
135,700.0,742.0,400.0,18158.0,
136,639.0,620.0,381.0,18360.0,
137,585.0,595.0,370.0,18450.0,
138,539.0,608.0,325.0,18528.0,
139,518.0,560.0,305.0,18617.0,
140,485.0,532.0,283.0,18700.0,
141,476.0,458.0,205.0,18861.0,
142,479.0,360.0,208.0,18953.0,
143,455.0,321.0,194.0,19030.0,
144,486.0,291.0,161.0,19062.0,
145,496.0,280.0,150.0,19074.0,
146,570.0,285.0,128.0,19017.0,
147,584.0,254.0,112.0,19050.0,
148,685.0,230.0,110.0,18975.0,
149,716.0,205.0,100.0,18979.0,
150,724.0,174.0,108.0,18994.0,
151,756.0,165.0,73.0,19006.0,
152,788.0,137.0,96.0,18979.0,
153,967.0,144.0,62.0,18827.0,
154,1046.0,141.0,62.0,18751.0,
155,1100.0,151.0,71.0,18678.0,
156,1202.0,143.0,69.0,18586.0,
157,1311.0,154.0,78.0,18457.0,
158,1413.0,163.0,101.0,18323.0,
159,1464.0,165.0,97.0,18274.0,
160,1624.0,191.0,76.0,18109.0,
161,1635.0,182.0,85.0,18098.0,
162,1713.0,186.0,114.0,17987.0,
163,1770.0,175.0,118.0,17937.0,
164,1882.0,205.0,163.0,17750.0,
165,1954.0,178.0,186.0,17682.0,
166,1999.0,137.0,204.0,17660.0,
167,2023.0,184.0,203.0,17590.0,
168,1996.0,211.0,210.0,17583.0,
169,1997.0,244.0,192.0,17567.0,
170,1991.0,232.0,239.0,17538.0,
171,1899.0,247.0,290.0,17564.0,
172,1900.0,272.0,316.0,17512.0,
173,1882.0,295.0,383.0,17440.0,
174,1814.0,352.0,369.0,17465.0,
175,1738.0,353.0,398.0,17511.0,
176,1726.0,399.0,375.0,17500.0,
177,1986.0,407.0,441.0,17166.0,
178,2070.0,404.0,491.0,17035.0,
179,2114.0,395.0,504.0,16987.0,
180,2106.0,379.0,606.0,16909.0,
181,2042.0,469.0,593.0,16896.0,
182,2001.0,496.0,598.0,16905.0,
183,2011.0,480.0,685.0,16824.0,
184,1994.0,488.0,673.0,16845.0,
185,1923.0,463.0,697.0,16917.0,
186,1980.0,527.0,595.0,16898.0,
187,2031.0,541.0,671.0,16757.0,
188,1985.0,547.0,663.0,16805.0,
189,1898.0,690.0,777.0,16635.0,
190,1776.0,956.0,674.0,16594.0,
191,1516.0,1023.0,783.0,16678.0,
192,1365.0,1162.0,683.0,16790.0,
193,1216.0,1316.0,608.0,16860.0,
194,1060.0,1276.0,600.0,17064.0,
195,988.0,1265.0,602.0,17145.0,
196,912.0,1249.0,622.0,17217.0,
197,786.0,1271.0,715.0,17228.0,
198,629.0,1190.0,789.0,17392.0,
199,574.0,1175.0,759.0,17492.0,
200,441.0,1208.0,779.0,17572.0,
201,390.0,1158.0,750.0,17702.0,
202,366.0,1159.0,716.0,17759.0,
203,363.0,1218.0,599.0,17820.0,
204,385.0,1283.0,514.0,17818.0,
205,382.0,1157.0,500.0,17961.0,
206,424.0,1232.0,432.0,17912.0,
207,433.0,1295.0,385.0,17887.0,
208,419.0,1254.0,286.0,18041.0,
209,463.0,1164.0,274.0,18099.0,
210,426.0,1067.0,265.0,18242.0,
211,398.0,1107.0,229.0,18266.0,
212,389.0,988.0,229.0,18394.0,
213,387.0,878.0,210.0,18525.0,
214,381.0,809.0,151.0,18659.0,
215,349.0,715.0,169.0,18767.0,
216,354.0,675.0,140.0,18831.0,
217,334.0,599.0,122.0,18945.0,
218,389.0,515.0,137.0,18959.0,
219,432.0,453.0,106.0,19009.0,
220,511.0,424.0,98.0,18967.0,
221,599.0,346.0,123.0,18932.0,
222,677.0,305.0,117.0,18901.0,
223,757.0,257.0,115.0,18871.0,
224,792.0,245.0,119.0,18844.0,
225,1011.0,224.0,125.0,18640.0,
226,1055.0,224.0,91.0,18630.0,
227,1133.0,197.0,101.0,18569.0,
228,1164.0,187.0,106.0,18543.0,
229,1239.0,168.0,124.0,18469.0,
230,1261.0,163.0,105.0,18471.0,
231,1310.0,157.0,102.0,18431.0,
232,1376.0,133.0,91.0,18400.0,
233,1428.0,132.0,86.0,18354.0,
234,1539.0,100.0,105.0,18256.0,
235,1601.0,101.0,108.0,18190.0,
236,1690.0,99.0,122.0,18089.0,
237,1732.0,117.0,92.0,18059.0,
238,1788.0,121.0,75.0,18016.0,
239,1924.0,118.0,110.0,17848.0,
240,1962.0,105.0,141.0,17792.0,
241,1996.0,101.0,158.0,17745.0,
242,2058.0,121.0,170.0,17651.0,
243,2099.0,144.0,170.0,17587.0,
244,2161.0,143.0,170.0,17526.0,
245,2180.0,186.0,176.0,17458.0,
246,2189.0,210.0,192.0,17409.0,
247,2137.0,239.0,245.0,17379.0,
248,2108.0,274.0,283.0,17335.0,
249,2079.0,304.0,296.0,17321.0,
250,2114.0,370.0,241.0,17275.0,
251,2033.0,364.0,351.0,17252.0,
252,2068.0,400.0,382.0,17150.0,
253,1950.0,508.0,438.0,17104.0,
254,1851.0,607.0,385.0,17157.0,
255,1764.0,618.0,384.0,17234.0,
256,1607.0,574.0,508.0,17311.0,
257,1467.0,688.0,538.0,17307.0,
258,1401.0,704.0,531.0,17364.0,
259,1292.0,690.0,598.0,17420.0,
260,1201.0,720.0,553.0,17526.0,
261,1179.0,739.0,439.0,17643.0,
262,1162.0,752.0,410.0,17676.0,
263,1215.0,702.0,424.0,17659.0,
264,1159.0,775.0,375.0,17691.0,
265,1133.0,784.0,416.0,17667.0,
266,1122.0,790.0,419.0,17669.0,
267,1092.0,738.0,416.0,17754.0,
268,1025.0,655.0,418.0,17902.0,
269,992.0,651.0,453.0,17904.0,
270,1051.0,620.0,433.0,17896.0,
271,1011.0,635.0,370.0,17984.0,
272,1154.0,557.0,439.0,17850.0,
273,1134.0,556.0,409.0,17901.0,
274,1091.0,537.0,418.0,17954.0,
275,1062.0,519.0,446.0,17973.0,
276,1171.0,564.0,449.0,17816.0,
277,1220.0,574.0,537.0,17669.0,
278,1178.0,599.0,499.0,17724.0,
279,1157.0,650.0,527.0,17666.0,
280,1064.0,699.0,525.0,17712.0,
281,994.0,735.0,514.0,17757.0,
282,915.0,721.0,510.0,17854.0,
283,881.0,824.0,407.0,17888.0,
284,789.0,870.0,447.0,17894.0,
285,684.0,861.0,471.0,17984.0,
286,717.0,936.0,409.0,17938.0,
287,739.0,940.0,436.0,17885.0,
288,733.0,992.0,362.0,17913.0,
289,695.0,969.0,324.0,18012.0,
290,714.0,917.0,300.0,18069.0,
291,740.0,875.0,278.0,18107.0,
292,727.0,787.0,326.0,18160.0,
293,656.0,684.0,416.0,18244.0,
294,695.0,744.0,298.0,18263.0,
295,726.0,721.0,333.0,18220.0,
296,710.0,683.0,365.0,18242.0,
297,789.0,696.0,340.0,18175.0,
298,793.0,680.0,284.0,18243.0,
299,856.0,668.0,269.0,18207.0,
300,919.0,672.0,271.0,18138.0,
301,974.0,583.0,298.0,18145.0,
302,952.0,589.0,313.0,18146.0,
303,1094.0,604.0,314.0,17988.0,
304,1047.0,615.0,330.0,18008.0,
305,1033.0,628.0,361.0,17978.0,
306,1065.0,623.0,350.0,17962.0,
307,1073.0,652.0,381.0,17894.0,
308,1102.0,622.0,341.0,17935.0,
309,1013.0,647.0,410.0,17930.0,
310,1013.0,609.0,414.0,17964.0,
311,978.0,621.0,405.0,17996.0,
312,996.0,636.0,363.0,18005.0,
313,975.0,607.0,340.0,18078.0,
314,921.0,605.0,381.0,18093.0,
315,898.0,671.0,348.0,18083.0,
316,889.0,744.0,316.0,18051.0,
317,893.0,822.0,299.0,17986.0,
318,890.0,824.0,243.0,18043.0,
319,867.0,785.0,291.0,18057.0,
320,864.0,755.0,268.0,18113.0,
321,876.0,743.0,253.0,18128.0,
322,865.0,709.0,237.0,18189.0,
323,853.0,606.0,274.0,18267.0,
324,877.0,575.0,262.0,18286.0,
325,898.0,524.0,250.0,18328.0,
326,923.0,481.0,259.0,18337.0,
327,973.0,454.0,254.0,18319.0,
328,982.0,465.0,244.0,18309.0,
329,1025.0,442.0,282.0,18251.0,
330,1029.0,462.0,248.0,18261.0,
331,1052.0,402.0,222.0,18324.0,
332,1077.0,327.0,272.0,18324.0,
333,1151.0,305.0,273.0,18271.0,
334,1198.0,337.0,229.0,18236.0,
335,1223.0,326.0,262.0,18189.0,
336,1241.0,283.0,272.0,18204.0,
337,1260.0,309.0,297.0,18134.0,
338,1273.0,372.0,283.0,18072.0,
339,1261.0,369.0,288.0,18082.0,
340,1268.0,403.0,294.0,18035.0,
341,1278.0,389.0,308.0,18025.0,
342,1358.0,367.0,337.0,17938.0,
343,1439.0,422.0,294.0,17845.0,
344,1554.0,433.0,272.0,17741.0,
345,1620.0,441.0,342.0,17597.0,
346,1654.0,471.0,332.0,17543.0,
347,1773.0,455.0,420.0,17352.0,
348,1846.0,452.0,420.0,17282.0,
349,1828.0,473.0,461.0,17238.0,
350,1843.0,466.0,460.0,17231.0,
351,1883.0,474.0,506.0,17137.0,
352,1883.0,519.0,475.0,17123.0,
353,1842.0,495.0,549.0,17114.0,
354,1870.0,532.0,549.0,17049.0,
355,1863.0,546.0,585.0,17006.0,
356,1845.0,567.0,636.0,16952.0,
357,1778.0,642.0,679.0,16901.0,
358,1689.0,718.0,722.0,16871.0,
359,1592.0,877.0,644.0,16887.0,
360,1506.0,918.0,693.0,16883.0,
361,1467.0,962.0,704.0,16867.0,
362,1459.0,1071.0,694.0,16776.0,
363,1425.0,1024.0,768.0,16783.0,
364,1310.0,1084.0,792.0,16814.0,
365,1237.0,1167.0,712.0,16884.0,
366,1201.0,1190.0,639.0,16970.0,
367,1110.0,1215.0,741.0,16934.0,
368,1073.0,1247.0,720.0,16960.0,
369,980.0,1241.0,833.0,16946.0,
370,888.0,1309.0,652.0,17151.0,
371,800.0,1325.0,672.0,17203.0,
372,800.0,1310.0,562.0,17328.0,
373,755.0,1329.0,485.0,17431.0,
374,780.0,1160.0,545.0,17515.0,
375,736.0,1219.0,463.0,17582.0,
376,688.0,1128.0,450.0,17734.0,
377,709.0,1107.0,395.0,17789.0,
378,636.0,1017.0,436.0,17911.0,
379,538.0,947.0,470.0,18045.0,
380,515.0,918.0,415.0,18152.0,
381,563.0,938.0,313.0,18186.0,
382,560.0,937.0,223.0,18280.0,
383,590.0,926.0,193.0,18291.0,
384,574.0,799.0,195.0,18432.0,
385,582.0,713.0,197.0,18508.0,
386,576.0,671.0,251.0,18502.0,
387,564.0,654.0,251.0,18531.0,
388,554.0,622.0,260.0,18564.0,
389,553.0,576.0,283.0,18588.0,
390,565.0,580.0,238.0,18617.0,
391,570.0,575.0,227.0,18628.0,
392,594.0,539.0,230.0,18637.0,
393,600.0,544.0,202.0,18654.0,
394,605.0,551.0,181.0,18663.0,
395,625.0,479.0,210.0,18686.0,
396,629.0,503.0,179.0,18689.0,
397,634.0,508.0,173.0,18685.0,
398,602.0,523.0,190.0,18685.0,
399,615.0,493.0,234.0,18658.0,
400,625.0,475.0,250.0,18650.0,
401,629.0,436.0,268.0,18667.0,
402,707.0,368.0,256.0,18669.0,
403,792.0,361.0,257.0,18590.0,
404,835.0,310.0,246.0,18609.0,
405,885.0,337.0,237.0,18541.0,
406,993.0,350.0,227.0,18430.0,
407,1074.0,317.0,229.0,18380.0,
408,1088.0,347.0,193.0,18372.0,
409,1099.0,348.0,179.0,18374.0,
410,1102.0,333.0,165.0,18400.0,
411,1140.0,307.0,197.0,18356.0,
412,1330.0,296.0,237.0,18137.0,
413,1370.0,288.0,291.0,18051.0,
414,1401.0,336.0,270.0,17993.0,
415,1378.0,365.0,277.0,17980.0,
416,1397.0,382.0,239.0,17982.0,
417,1367.0,418.0,242.0,17973.0,
418,1323.0,387.0,309.0,17981.0,
419,1268.0,399.0,319.0,18014.0,
420,1246.0,421.0,319.0,18014.0,
421,1219.0,437.0,305.0,18039.0,
422,1165.0,444.0,357.0,18034.0,
423,1183.0,480.0,280.0,18057.0,
424,1190.0,486.0,286.0,18038.0,
425,1148.0,535.0,249.0,18068.0,
426,1176.0,522.0,296.0,18006.0,
427,1304.0,547.0,320.0,17829.0,
428,1366.0,504.0,316.0,17814.0,
429,1495.0,465.0,398.0,17642.0,
430,1474.0,503.0,380.0,17643.0,
431,1587.0,511.0,404.0,17498.0,
432,1548.0,509.0,387.0,17556.0,
433,1583.0,551.0,388.0,17478.0,
434,1588.0,533.0,445.0,17434.0,
435,1604.0,564.0,499.0,17333.0,
436,1681.0,533.0,605.0,17181.0,
437,1562.0,615.0,685.0,17138.0,
438,1644.0,696.0,578.0,17082.0,
439,1595.0,691.0,526.0,17188.0,
440,1531.0,738.0,538.0,17193.0,
441,1364.0,732.0,561.0,17343.0,
442,1317.0,751.0,581.0,17351.0,
443,1201.0,911.0,481.0,17407.0,
444,1125.0,739.0,500.0,17636.0,
445,1069.0,674.0,480.0,17777.0,
446,998.0,642.0,473.0,17887.0,
447,946.0,671.0,433.0,17950.0,
448,961.0,654.0,376.0,18009.0,
449,888.0,703.0,361.0,18048.0,
450,873.0,617.0,338.0,18172.0,
451,901.0,634.0,354.0,18111.0,
452,1031.0,585.0,330.0,18054.0,
453,1081.0,586.0,309.0,18024.0,
454,1072.0,580.0,283.0,18065.0,
455,1073.0,539.0,343.0,18045.0,
456,1093.0,498.0,372.0,18037.0,
457,1116.0,529.0,363.0,17992.0,
458,1176.0,487.0,421.0,17916.0,
459,1231.0,512.0,429.0,17828.0,
460,1411.0,504.0,522.0,17563.0,
461,1382.0,532.0,520.0,17566.0,
462,1441.0,542.0,533.0,17484.0,
463,1416.0,553.0,541.0,17490.0,
464,1472.0,618.0,517.0,17393.0,
465,1464.0,626.0,572.0,17338.0,
466,1397.0,709.0,549.0,17345.0,
467,1348.0,767.0,577.0,17308.0,
468,1317.0,765.0,585.0,17333.0,
469,1269.0,737.0,661.0,17333.0,
470,1214.0,734.0,685.0,17367.0,
471,1385.0,736.0,727.0,17152.0,
472,1412.0,726.0,712.0,17150.0,
473,1383.0,750.0,715.0,17152.0,
474,1415.0,780.0,633.0,17172.0,
475,1412.0,811.0,647.0,17130.0,
476,1455.0,818.0,649.0,17078.0,
477,1416.0,819.0,609.0,17156.0,
478,1459.0,896.0,556.0,17089.0,
479,1413.0,908.0,609.0,17070.0,
480,1392.0,913.0,576.0,17119.0,
481,1192.0,900.0,732.0,17176.0,
482,1093.0,1032.0,644.0,17231.0,
483,1069.0,1115.0,496.0,17320.0,
484,1019.0,1124.0,446.0,17411.0,
485,972.0,1045.0,514.0,17469.0,
486,901.0,1083.0,512.0,17504.0,
487,822.0,1129.0,514.0,17535.0,
488,785.0,1079.0,504.0,17632.0,
489,767.0,1077.0,459.0,17697.0,
490,722.0,1070.0,477.0,17731.0,
491,694.0,1129.0,454.0,17723.0,
492,679.0,1081.0,435.0,17805.0,
493,665.0,1030.0,472.0,17833.0,
494,682.0,1020.0,456.0,17842.0,
495,692.0,978.0,436.0,17894.0,
496,698.0,1041.0,395.0,17866.0,
497,684.0,1036.0,412.0,17868.0,
498,655.0,940.0,438.0,17967.0,
499,628.0,976.0,360.0,18036.0,
500,610.0,910.0,299.0,18181.0,
501,605.0,801.0,302.0,18292.0,
502,634.0,780.0,307.0,18279.0,
503,627.0,704.0,353.0,18316.0,
504,671.0,648.0,351.0,18330.0,
505,690.0,640.0,323.0,18347.0,
506,716.0,550.0,297.0,18437.0,
507,756.0,521.0,325.0,18398.0,
508,782.0,537.0,282.0,18399.0,
509,871.0,472.0,308.0,18349.0,
510,928.0,455.0,298.0,18319.0,
511,975.0,480.0,244.0,18301.0,
512,994.0,415.0,237.0,18354.0,
513,1039.0,430.0,257.0,18274.0,
514,1008.0,388.0,318.0,18286.0,
515,1036.0,352.0,296.0,18316.0,
516,1023.0,397.0,287.0,18293.0,
517,1023.0,421.0,303.0,18253.0,
518,1005.0,467.0,296.0,18232.0,
519,1059.0,456.0,330.0,18155.0,
520,1029.0,466.0,323.0,18182.0,
521,1031.0,487.0,287.0,18195.0,
522,1050.0,487.0,285.0,18178.0,
523,1075.0,447.0,283.0,18195.0,
524,1094.0,428.0,337.0,18141.0,
525,1112.0,370.0,333.0,18185.0,
526,1131.0,382.0,306.0,18181.0,
527,1201.0,380.0,332.0,18087.0,
528,1232.0,382.0,342.0,18044.0,
529,1341.0,366.0,338.0,17955.0,
530,1358.0,398.0,328.0,17916.0,
531,1377.0,406.0,298.0,17919.0,
532,1475.0,395.0,351.0,17779.0,
533,1638.0,367.0,343.0,17652.0,
534,1693.0,390.0,354.0,17563.0,
535,1724.0,422.0,370.0,17484.0,
536,1902.0,436.0,397.0,17265.0,
537,1982.0,419.0,417.0,17182.0,
538,2063.0,410.0,474.0,17053.0,
539,2044.0,447.0,472.0,17037.0,
540,2024.0,464.0,544.0,16968.0,
541,1908.0,498.0,659.0,16935.0,
542,1806.0,471.0,815.0,16908.0,
543,1750.0,610.0,810.0,16830.0,
544,1766.0,676.0,780.0,16778.0,
545,1693.0,755.0,876.0,16676.0,
546,1662.0,837.0,938.0,16563.0,
547,1590.0,1013.0,837.0,16560.0,
548,1538.0,1010.0,812.0,16640.0,
549,1452.0,991.0,894.0,16663.0,
550,1359.0,935.0,960.0,16746.0,
551,1289.0,1024.0,942.0,16745.0,
552,1220.0,1082.0,883.0,16815.0,
553,1114.0,1212.0,855.0,16819.0,
554,956.0,1295.0,925.0,16824.0,
555,870.0,1402.0,789.0,16939.0,
556,776.0,1400.0,660.0,17164.0,
557,702.0,1415.0,563.0,17320.0,
558,666.0,1371.0,576.0,17387.0,
559,566.0,1399.0,610.0,17425.0,
560,550.0,1425.0,526.0,17499.0,
561,496.0,1343.0,509.0,17652.0,
562,462.0,1355.0,504.0,17679.0,
563,447.0,1241.0,486.0,17826.0,
564,453.0,1196.0,479.0,17872.0,
565,438.0,1234.0,443.0,17885.0,
566,419.0,1234.0,386.0,17961.0,
567,430.0,1231.0,310.0,18029.0,
568,457.0,1166.0,295.0,18082.0,
569,459.0,1147.0,301.0,18093.0,
570,501.0,1042.0,294.0,18163.0,
571,601.0,1002.0,324.0,18073.0,
572,607.0,1044.0,260.0,18089.0,
573,617.0,1023.0,274.0,18086.0,
574,749.0,941.0,322.0,17988.0,
575,770.0,948.0,293.0,17989.0,
576,782.0,924.0,285.0,18009.0,
577,807.0,853.0,357.0,17983.0,
578,835.0,809.0,342.0,18014.0,
579,823.0,727.0,399.0,18051.0,
580,838.0,684.0,389.0,18089.0,
581,833.0,678.0,437.0,18052.0,
582,838.0,736.0,400.0,18026.0,
583,880.0,728.0,467.0,17925.0,
584,841.0,741.0,454.0,17964.0,
585,838.0,798.0,462.0,17902.0,
586,829.0,780.0,421.0,17970.0,
587,786.0,759.0,493.0,17962.0,
588,797.0,711.0,483.0,18009.0,
589,807.0,650.0,438.0,18105.0,
590,849.0,644.0,390.0,18117.0,
591,864.0,562.0,367.0,18207.0,
592,874.0,525.0,360.0,18241.0,
593,934.0,510.0,334.0,18222.0,
594,949.0,488.0,299.0,18264.0,
595,960.0,485.0,273.0,18282.0,
596,1019.0,489.0,241.0,18251.0,
597,1047.0,448.0,255.0,18250.0,
598,1063.0,473.0,223.0,18241.0,
599,1076.0,500.0,276.0,18148.0,
600,1117.0,516.0,235.0,18132.0,
601,1138.0,456.0,253.0,18153.0,
602,1197.0,419.0,294.0,18090.0,
603,1384.0,383.0,260.0,17973.0,
604,1545.0,386.0,307.0,17762.0,
605,1626.0,367.0,297.0,17710.0,
606,1707.0,374.0,282.0,17637.0,
607,1776.0,410.0,303.0,17511.0,
608,1780.0,411.0,340.0,17469.0,
609,1717.0,463.0,412.0,17408.0,
610,1714.0,524.0,416.0,17346.0,
611,1703.0,598.0,429.0,17270.0,
612,1647.0,652.0,469.0,17232.0,
613,1628.0,723.0,426.0,17223.0,
614,1519.0,780.0,436.0,17265.0,
615,1490.0,757.0,482.0,17271.0,
616,1446.0,760.0,461.0,17333.0,
617,1397.0,803.0,437.0,17363.0,
618,1345.0,800.0,448.0,17407.0,
619,1228.0,773.0,515.0,17484.0,
620,1152.0,814.0,449.0,17585.0,
621,1111.0,827.0,461.0,17601.0,
622,1058.0,797.0,502.0,17643.0,
623,997.0,767.0,520.0,17716.0,
624,939.0,759.0,439.0,17863.0,
625,883.0,792.0,437.0,17888.0,
626,849.0,802.0,423.0,17926.0,
627,825.0,842.0,424.0,17909.0,
628,819.0,801.0,426.0,17954.0,
629,773.0,797.0,440.0,17990.0,
630,752.0,822.0,440.0,17986.0,
631,735.0,828.0,407.0,18030.0,
632,700.0,834.0,365.0,18101.0,
633,726.0,824.0,383.0,18067.0,
634,685.0,794.0,420.0,18101.0,
635,703.0,725.0,351.0,18221.0,
636,700.0,677.0,316.0,18307.0,
637,809.0,578.0,314.0,18299.0,
638,869.0,481.0,367.0,18283.0,
639,891.0,478.0,300.0,18331.0,
640,865.0,410.0,337.0,18388.0,
641,901.0,429.0,306.0,18364.0,
642,925.0,400.0,298.0,18377.0,
643,902.0,389.0,326.0,18383.0,
644,886.0,410.0,323.0,18381.0,
645,908.0,388.0,347.0,18357.0,
646,914.0,424.0,267.0,18395.0,
647,912.0,412.0,290.0,18386.0,
648,902.0,406.0,278.0,18414.0,
649,893.0,363.0,290.0,18454.0,
650,917.0,403.0,235.0,18445.0,
651,920.0,424.0,248.0,18408.0,
652,919.0,438.0,220.0,18423.0,
653,923.0,458.0,231.0,18388.0,
654,919.0,448.0,224.0,18409.0,
655,916.0,453.0,239.0,18392.0,
656,918.0,436.0,251.0,18395.0,
657,939.0,430.0,273.0,18358.0,
658,950.0,423.0,280.0,18347.0,
659,951.0,411.0,293.0,18345.0,
660,944.0,370.0,312.0,18374.0,
661,973.0,376.0,289.0,18362.0,
662,959.0,356.0,305.0,18380.0,
663,956.0,370.0,299.0,18375.0,
664,949.0,403.0,294.0,18354.0,
665,950.0,421.0,275.0,18354.0,
666,983.0,404.0,267.0,18346.0,
667,998.0,424.0,267.0,18311.0,
668,1017.0,424.0,271.0,18288.0,
669,1019.0,391.0,286.0,18304.0,
670,1030.0,381.0,281.0,18308.0,
671,1066.0,359.0,304.0,18271.0,
672,1077.0,379.0,310.0,18234.0,
673,1088.0,427.0,297.0,18188.0,
674,1092.0,447.0,315.0,18146.0,
675,1083.0,464.0,336.0,18117.0,
676,1092.0,457.0,366.0,18085.0,
677,1110.0,405.0,394.0,18091.0,
678,1115.0,428.0,374.0,18083.0,
679,1136.0,414.0,382.0,18068.0,
680,1152.0,414.0,394.0,18040.0,
681,1155.0,433.0,401.0,18011.0,
682,1220.0,456.0,375.0,17949.0,
683,1227.0,473.0,409.0,17891.0,
684,1236.0,479.0,387.0,17898.0,
685,1224.0,463.0,407.0,17906.0,
686,1192.0,531.0,363.0,17914.0,
687,1202.0,527.0,342.0,17929.0,
688,1193.0,502.0,377.0,17928.0,
689,1160.0,500.0,371.0,17969.0,
690,1168.0,494.0,410.0,17928.0,
691,1175.0,524.0,423.0,17878.0,
692,1170.0,502.0,476.0,17852.0,
693,1168.0,515.0,473.0,17844.0,
694,1209.0,517.0,469.0,17805.0,
695,1177.0,569.0,417.0,17837.0,
696,1203.0,609.0,379.0,17809.0,
697,1203.0,613.0,411.0,17773.0,
698,1170.0,601.0,461.0,17768.0,
699,1162.0,658.0,442.0,17738.0,
700,1092.0,717.0,420.0,17771.0,
701,1063.0,767.0,430.0,17740.0,
702,1014.0,769.0,464.0,17753.0,
703,984.0,836.0,485.0,17695.0,
704,1007.0,779.0,507.0,17707.0,
705,979.0,771.0,484.0,17766.0,
706,1003.0,820.0,419.0,17758.0,
707,983.0,745.0,462.0,17810.0,
708,1075.0,753.0,448.0,17724.0,
709,1033.0,782.0,568.0,17617.0,
710,985.0,800.0,623.0,17592.0,
711,930.0,805.0,612.0,17653.0,
712,905.0,837.0,599.0,17659.0,
713,920.0,794.0,621.0,17665.0,
714,955.0,793.0,622.0,17630.0,
715,986.0,794.0,615.0,17605.0,
716,1013.0,827.0,590.0,17570.0,
717,984.0,895.0,557.0,17564.0,
718,944.0,964.0,483.0,17609.0,
719,919.0,942.0,518.0,17621.0,
720,880.0,938.0,527.0,17655.0,
721,864.0,960.0,497.0,17679.0,
722,817.0,954.0,457.0,17772.0,
723,828.0,927.0,478.0,17767.0,
724,850.0,859.0,452.0,17839.0,
725,859.0,802.0,415.0,17924.0,
726,884.0,688.0,381.0,18047.0,
727,924.0,675.0,322.0,18079.0,
728,1039.0,654.0,346.0,17961.0,
729,1035.0,679.0,353.0,17933.0,
730,1067.0,650.0,341.0,17942.0,
