jour,S,I,E,R,
0,19980.0,20.0,0.0,0.0,
1,19969.0,20.0,11.0,0.0,
2,19893.0,24.0,83.0,0.0,
3,19794.0,38.0,165.0,3.0,
4,19588.0,82.0,321.0,9.0,
5,19254.0,132.0,596.0,18.0,
6,18734.0,248.0,993.0,25.0,
7,17631.0,417.0,1906.0,46.0,
8,16067.0,685.0,3162.0,86.0,
9,13404.0,1318.0,5081.0,197.0,
10,9953.0,2349.0,7429.0,269.0,
11,5412.0,3911.0,10106.0,571.0,
12,2360.0,5831.0,10721.0,1088.0,
13,731.0,7832.0,9718.0,1719.0,
14,131.0,10077.0,7398.0,2394.0,
15,27.0,11201.0,5458.0,3314.0,
16,3.0,12014.0,3786.0,4197.0,
17,8.0,11877.0,2544.0,5571.0,
18,22.0,11283.0,1738.0,6957.0,
19,137.0,10668.0,1251.0,7944.0,
20,89.0,10021.0,746.0,9144.0,
21,48.0,8852.0,421.0,10679.0,
22,77.0,8003.0,170.0,11750.0,
23,105.0,6931.0,184.0,12780.0,
24,53.0,6192.0,184.0,13571.0,
25,99.0,5462.0,193.0,14246.0,
26,120.0,4824.0,182.0,14874.0,
27,103.0,4161.0,172.0,15564.0,
28,132.0,3815.0,183.0,15870.0,
29,295.0,3447.0,224.0,16034.0,
30,293.0,2891.0,297.0,16519.0,
31,298.0,2202.0,228.0,17272.0,
32,278.0,1932.0,269.0,17521.0,
33,381.0,1858.0,229.0,17532.0,
34,398.0,1739.0,166.0,17697.0,
35,394.0,1766.0,131.0,17709.0,
36,420.0,1620.0,79.0,17881.0,
37,395.0,1588.0,238.0,17779.0,
38,344.0,1410.0,301.0,17945.0,
39,424.0,1227.0,240.0,18109.0,
40,723.0,1220.0,198.0,17859.0,
41,1004.0,1207.0,270.0,17519.0,
42,1190.0,1137.0,323.0,17350.0,
43,1321.0,1035.0,333.0,17311.0,
44,1356.0,1010.0,363.0,17271.0,
45,1426.0,1016.0,445.0,17113.0,
46,1282.0,1142.0,594.0,16982.0,
47,1276.0,970.0,621.0,17133.0,
48,1169.0,1021.0,599.0,17211.0,
49,981.0,1018.0,676.0,17325.0,
50,948.0,1105.0,642.0,17305.0,
51,808.0,1242.0,577.0,17373.0,
52,853.0,1335.0,565.0,17247.0,
53,874.0,1327.0,470.0,17329.0,
54,781.0,1289.0,508.0,17422.0,
55,854.0,1209.0,533.0,17404.0,
56,775.0,1141.0,467.0,17617.0,
57,733.0,1211.0,369.0,17687.0,
58,715.0,1117.0,462.0,17706.0,
59,808.0,1100.0,494.0,17598.0,
60,762.0,1106.0,461.0,17671.0,
61,674.0,1004.0,527.0,17795.0,
62,602.0,1080.0,435.0,17883.0,
63,599.0,1082.0,419.0,17900.0,
64,615.0,1061.0,378.0,17946.0,
65,574.0,1048.0,388.0,17990.0,
66,561.0,1042.0,335.0,18062.0,
67,658.0,996.0,326.0,18020.0,
68,750.0,911.0,391.0,17948.0,
69,815.0,893.0,320.0,17972.0,
70,909.0,859.0,346.0,17886.0,
71,1096.0,904.0,381.0,17619.0,
72,1167.0,827.0,462.0,17544.0,
73,1186.0,968.0,396.0,17450.0,
74,1195.0,1010.0,426.0,17369.0,
75,1264.0,985.0,439.0,17312.0,
76,1234.0,936.0,578.0,17252.0,
77,1240.0,862.0,655.0,17243.0,
78,1271.0,947.0,607.0,17175.0,
79,1394.0,1009.0,652.0,16945.0,
80,1460.0,1065.0,724.0,16751.0,
81,1392.0,1062.0,821.0,16725.0,
82,1368.0,1141.0,927.0,16564.0,
83,1346.0,1205.0,918.0,16531.0,
84,1244.0,1192.0,938.0,16626.0,
85,1210.0,1360.0,871.0,16559.0,
86,1133.0,1584.0,665.0,16618.0,
87,1031.0,1634.0,737.0,16598.0,
88,903.0,1520.0,769.0,16808.0,
89,850.0,1593.0,594.0,16963.0,
90,770.0,1481.0,659.0,17090.0,
91,683.0,1628.0,645.0,17044.0,
92,616.0,1737.0,470.0,17177.0,
93,541.0,1640.0,395.0,17424.0,
94,637.0,1588.0,397.0,17378.0,
95,690.0,1623.0,418.0,17269.0,
96,665.0,1562.0,345.0,17428.0,
97,631.0,1426.0,332.0,17611.0,
98,610.0,1496.0,275.0,17619.0,
99,604.0,1332.0,236.0,17828.0,
100,637.0,1265.0,218.0,17880.0,
101,567.0,1261.0,241.0,17931.0,
102,542.0,1182.0,251.0,18025.0,
103,622.0,1077.0,318.0,17983.0,
104,626.0,1047.0,284.0,18043.0,
105,680.0,1019.0,236.0,18065.0,
106,710.0,1027.0,319.0,17944.0,
107,717.0,990.0,298.0,17995.0,
108,764.0,895.0,351.0,17990.0,
109,820.0,850.0,397.0,17933.0,
110,841.0,848.0,337.0,17974.0,
111,877.0,771.0,377.0,17975.0,
112,967.0,795.0,384.0,17854.0,
113,1163.0,829.0,406.0,17602.0,
114,1276.0,771.0,432.0,17521.0,
115,1471.0,769.0,546.0,17214.0,
116,1552.0,745.0,688.0,17015.0,
117,1624.0,768.0,759.0,16849.0,
118,1610.0,841.0,811.0,16738.0,
119,1548.0,939.0,841.0,16672.0,
120,1483.0,1011.0,946.0,16560.0,
121,1374.0,1102.0,989.0,16535.0,
122,1267.0,1396.0,903.0,16434.0,
123,1374.0,1514.0,860.0,16252.0,
124,1198.0,1610.0,977.0,16215.0,
125,921.0,1907.0,976.0,16196.0,
126,779.0,1954.0,888.0,16379.0,
127,715.0,1873.0,860.0,16552.0,
128,683.0,1917.0,736.0,16664.0,
129,640.0,1863.0,600.0,16897.0,
130,621.0,1805.0,631.0,16943.0,
131,538.0,1926.0,558.0,16978.0,
132,530.0,1808.0,561.0,17101.0,
133,553.0,1886.0,492.0,17069.0,
134,584.0,1767.0,359.0,17290.0,
135,605.0,1671.0,352.0,17372.0,
136,701.0,1490.0,435.0,17374.0,
137,752.0,1311.0,350.0,17587.0,
138,865.0,1156.0,353.0,17626.0,
139,899.0,1107.0,373.0,17621.0,
140,899.0,1036.0,405.0,17660.0,
141,922.0,981.0,442.0,17655.0,
142,1045.0,819.0,462.0,17674.0,
143,1157.0,823.0,480.0,17540.0,
144,1221.0,831.0,478.0,17470.0,
145,1319.0,817.0,536.0,17328.0,
146,1349.0,791.0,622.0,17238.0,
147,1346.0,794.0,697.0,17163.0,
148,1412.0,852.0,716.0,17020.0,
149,1394.0,840.0,705.0,17061.0,
150,1417.0,921.0,614.0,17048.0,
151,1412.0,892.0,649.0,17047.0,
152,1411.0,1031.0,687.0,16871.0,
153,1466.0,1055.0,725.0,16754.0,
154,1441.0,1026.0,846.0,16687.0,
155,1367.0,1107.0,958.0,16568.0,
156,1310.0,1216.0,965.0,16509.0,
157,1260.0,1323.0,1013.0,16404.0,
158,1152.0,1543.0,927.0,16378.0,
159,1012.0,1680.0,901.0,16407.0,
160,874.0,1715.0,919.0,16492.0,
161,765.0,1791.0,932.0,16512.0,
162,740.0,1880.0,887.0,16493.0,
163,656.0,1949.0,870.0,16525.0,
164,573.0,1941.0,866.0,16620.0,
165,521.0,1937.0,854.0,16688.0,
166,502.0,2062.0,723.0,16713.0,
167,521.0,2191.0,547.0,16741.0,
168,486.0,2136.0,555.0,16823.0,
169,492.0,2115.0,553.0,16840.0,
170,471.0,2140.0,461.0,16928.0,
171,526.0,1967.0,428.0,17079.0,
172,515.0,2017.0,486.0,16982.0,
173,515.0,1994.0,355.0,17136.0,
174,510.0,1949.0,337.0,17204.0,
175,514.0,1876.0,386.0,17224.0,
176,514.0,1750.0,404.0,17332.0,
177,468.0,1728.0,382.0,17422.0,
178,473.0,1751.0,354.0,17422.0,
179,509.0,1722.0,289.0,17480.0,
180,555.0,1492.0,332.0,17621.0,
181,636.0,1388.0,362.0,17614.0,
182,670.0,1216.0,308.0,17806.0,
183,716.0,1138.0,242.0,17904.0,
184,741.0,1025.0,331.0,17903.0,
185,822.0,981.0,387.0,17810.0,
186,1002.0,871.0,376.0,17751.0,
187,1077.0,720.0,436.0,17767.0,
188,1102.0,824.0,424.0,17650.0,
189,1115.0,859.0,361.0,17665.0,
190,1179.0,892.0,307.0,17622.0,
191,1168.0,902.0,412.0,17518.0,
192,1200.0,925.0,408.0,17467.0,
193,1216.0,963.0,331.0,17490.0,
194,1207.0,990.0,298.0,17505.0,
195,1163.0,967.0,310.0,17560.0,
196,1230.0,966.0,362.0,17442.0,
197,1300.0,956.0,414.0,17330.0,
198,1554.0,957.0,471.0,17018.0,
199,1604.0,996.0,437.0,16963.0,
200,1590.0,1053.0,501.0,16856.0,
201,1568.0,1110.0,553.0,16769.0,
202,1561.0,1063.0,758.0,16618.0,
203,1544.0,1189.0,749.0,16518.0,
204,1320.0,1215.0,867.0,16598.0,
205,1213.0,1387.0,819.0,16581.0,
206,1105.0,1586.0,691.0,16618.0,
207,949.0,1576.0,815.0,16660.0,
208,871.0,1661.0,699.0,16769.0,
209,786.0,1583.0,674.0,16957.0,
210,737.0,1514.0,690.0,17059.0,
211,720.0,1564.0,644.0,17072.0,
212,726.0,1474.0,607.0,17193.0,
213,700.0,1388.0,609.0,17303.0,
214,763.0,1303.0,553.0,17381.0,
215,758.0,1320.0,552.0,17370.0,
216,850.0,1230.0,568.0,17352.0,
217,832.0,1178.0,537.0,17453.0,
218,867.0,1247.0,563.0,17323.0,
219,917.0,1210.0,604.0,17269.0,
220,916.0,1127.0,691.0,17266.0,
221,1069.0,1138.0,704.0,17089.0,
222,1124.0,1074.0,776.0,17026.0,
223,1166.0,1215.0,704.0,16915.0,
224,1285.0,1226.0,590.0,16899.0,
225,1304.0,1244.0,571.0,16881.0,
226,1351.0,1197.0,659.0,16793.0,
227,1466.0,1208.0,671.0,16655.0,
228,1500.0,1309.0,784.0,16407.0,
229,1400.0,1277.0,994.0,16329.0,
230,1483.0,1341.0,1016.0,16160.0,
231,1430.0,1488.0,948.0,16134.0,
232,1372.0,1449.0,1025.0,16154.0,
233,1292.0,1573.0,973.0,16162.0,
234,1366.0,1693.0,960.0,15981.0,
235,1255.0,1689.0,1075.0,15981.0,
236,1076.0,1775.0,1179.0,15970.0,
237,957.0,1885.0,1170.0,15988.0,
238,843.0,2054.0,1017.0,16086.0,
239,850.0,2182.0,1036.0,15932.0,
240,782.0,2233.0,925.0,16060.0,
241,713.0,2256.0,954.0,16077.0,
242,590.0,2326.0,859.0,16225.0,
243,522.0,2227.0,754.0,16497.0,
244,522.0,2040.0,742.0,16696.0,
245,440.0,2042.0,669.0,16849.0,
246,431.0,1866.0,612.0,17091.0,
247,465.0,1723.0,580.0,17232.0,
248,488.0,1697.0,498.0,17317.0,
249,535.0,1654.0,469.0,17342.0,
250,562.0,1658.0,406.0,17374.0,
251,578.0,1628.0,394.0,17400.0,
252,580.0,1450.0,406.0,17564.0,
253,628.0,1375.0,401.0,17596.0,
254,676.0,1254.0,466.0,17604.0,
255,755.0,1138.0,494.0,17613.0,
256,787.0,1099.0,494.0,17620.0,
257,791.0,1071.0,549.0,17589.0,
258,910.0,1057.0,512.0,17521.0,
259,901.0,1055.0,508.0,17536.0,
260,983.0,1061.0,560.0,17396.0,
261,1020.0,1100.0,582.0,17298.0,
262,1092.0,1144.0,563.0,17201.0,
263,1112.0,1174.0,474.0,17240.0,
264,1129.0,1214.0,473.0,17184.0,
265,1185.0,1151.0,526.0,17138.0,
266,1160.0,1157.0,606.0,17077.0,
267,1197.0,1183.0,606.0,17014.0,
268,1157.0,1227.0,737.0,16879.0,
269,1191.0,1281.0,813.0,16715.0,
270,1153.0,1383.0,839.0,16625.0,
271,1072.0,1610.0,726.0,16592.0,
272,1014.0,1514.0,809.0,16663.0,
273,996.0,1652.0,708.0,16644.0,
274,900.0,1763.0,673.0,16664.0,
275,888.0,1634.0,728.0,16750.0,
276,839.0,1567.0,705.0,16889.0,
277,867.0,1454.0,676.0,17003.0,
278,877.0,1438.0,637.0,17048.0,
279,915.0,1358.0,612.0,17115.0,
280,944.0,1332.0,555.0,17169.0,
281,955.0,1301.0,571.0,17173.0,
282,1018.0,1224.0,631.0,17127.0,
283,1040.0,1308.0,611.0,17041.0,
284,1043.0,1329.0,617.0,17011.0,
285,1026.0,1375.0,631.0,16968.0,
286,973.0,1363.0,657.0,17007.0,
287,961.0,1394.0,659.0,16986.0,
288,932.0,1451.0,587.0,17030.0,
289,940.0,1433.0,565.0,17062.0,
290,933.0,1403.0,509.0,17155.0,
291,903.0,1342.0,578.0,17177.0,
292,922.0,1346.0,607.0,17125.0,
293,953.0,1354.0,623.0,17070.0,
294,922.0,1369.0,639.0,17070.0,
295,896.0,1416.0,595.0,17093.0,
296,902.0,1429.0,593.0,17076.0,
297,898.0,1467.0,592.0,17043.0,
298,903.0,1497.0,596.0,17004.0,
299,1102.0,1443.0,673.0,16782.0,
300,1085.0,1415.0,811.0,16689.0,
301,1110.0,1544.0,882.0,16464.0,
302,1162.0,1623.0,852.0,16363.0,
303,1138.0,1693.0,879.0,16290.0,
304,1115.0,1742.0,885.0,16258.0,
305,1122.0,1669.0,1005.0,16204.0,
306,1137.0,1660.0,1051.0,16152.0,
307,1021.0,1691.0,1169.0,16119.0,
308,891.0,1805.0,1068.0,16236.0,
309,868.0,1938.0,985.0,16209.0,
310,815.0,1817.0,984.0,16384.0,
311,731.0,1827.0,992.0,16450.0,
312,741.0,1892.0,846.0,16521.0,
313,656.0,1886.0,955.0,16503.0,
314,664.0,1916.0,827.0,16593.0,
315,602.0,1983.0,748.0,16667.0,
316,562.0,2097.0,640.0,16701.0,
317,530.0,2106.0,616.0,16748.0,
318,505.0,2118.0,533.0,16844.0,
319,526.0,2066.0,474.0,16934.0,
320,512.0,1871.0,518.0,17099.0,
321,593.0,1689.0,470.0,17248.0,
322,623.0,1700.0,380.0,17297.0,
323,638.0,1564.0,416.0,17382.0,
324,693.0,1508.0,397.0,17402.0,
325,828.0,1444.0,440.0,17288.0,
326,858.0,1456.0,424.0,17262.0,
327,978.0,1387.0,526.0,17109.0,
328,943.0,1383.0,482.0,17192.0,
329,971.0,1382.0,447.0,17200.0,
330,992.0,1424.0,428.0,17156.0,
331,994.0,1356.0,440.0,17210.0,
332,1092.0,1359.0,467.0,17082.0,
333,1085.0,1359.0,613.0,16943.0,
334,1092.0,1447.0,577.0,16884.0,
335,1136.0,1378.0,668.0,16818.0,
336,1120.0,1406.0,630.0,16844.0,
337,1112.0,1411.0,574.0,16903.0,
338,1175.0,1427.0,643.0,16755.0,
339,1132.0,1478.0,725.0,16665.0,
340,1129.0,1550.0,660.0,16661.0,
341,1101.0,1628.0,638.0,16633.0,
342,1048.0,1646.0,720.0,16586.0,
343,1048.0,1671.0,664.0,16617.0,
344,1052.0,1640.0,750.0,16558.0,
345,1150.0,1581.0,779.0,16490.0,
346,1140.0,1558.0,766.0,16536.0,
347,1156.0,1471.0,732.0,16641.0,
348,1166.0,1514.0,794.0,16526.0,
349,1142.0,1533.0,809.0,16516.0,
350,1066.0,1520.0,897.0,16517.0,
351,986.0,1499.0,926.0,16589.0,
352,913.0,1541.0,986.0,16560.0,
353,882.0,1566.0,973.0,16579.0,
354,823.0,1711.0,869.0,16597.0,
355,843.0,1722.0,772.0,16663.0,
356,754.0,1679.0,763.0,16804.0,
357,732.0,1674.0,758.0,16836.0,
358,682.0,1687.0,697.0,16934.0,
359,690.0,1674.0,624.0,17012.0,
360,681.0,1667.0,641.0,17011.0,
361,667.0,1625.0,556.0,17152.0,
362,657.0,1555.0,501.0,17287.0,
363,669.0,1601.0,495.0,17235.0,
364,721.0,1573.0,542.0,17164.0,
365,749.0,1521.0,532.0,17198.0,
366,757.0,1494.0,540.0,17209.0,
367,747.0,1553.0,572.0,17128.0,
368,739.0,1547.0,554.0,17160.0,
369,717.0,1613.0,487.0,17183.0,
370,716.0,1509.0,464.0,17311.0,
371,744.0,1480.0,517.0,17259.0,
372,739.0,1447.0,537.0,17277.0,
373,769.0,1386.0,524.0,17321.0,
374,732.0,1475.0,452.0,17341.0,
375,741.0,1338.0,525.0,17396.0,
376,737.0,1325.0,530.0,17408.0,
377,772.0,1217.0,484.0,17527.0,
378,796.0,1166.0,512.0,17526.0,
379,829.0,1133.0,497.0,17541.0,
380,866.0,1014.0,554.0,17566.0,
381,880.0,1070.0,496.0,17554.0,
382,921.0,1080.0,466.0,17533.0,
383,921.0,1130.0,395.0,17554.0,
384,920.0,1136.0,393.0,17551.0,
385,911.0,1207.0,416.0,17466.0,
386,900.0,1247.0,438.0,17415.0,
387,888.0,1249.0,409.0,17454.0,
388,900.0,1273.0,387.0,17440.0,
389,888.0,1300.0,416.0,17396.0,
390,966.0,1284.0,486.0,17264.0,
391,978.0,1324.0,486.0,17212.0,
392,998.0,1337.0,456.0,17209.0,
393,996.0,1332.0,562.0,17110.0,
394,1042.0,1433.0,587.0,16938.0,
395,1029.0,1505.0,624.0,16842.0,
396,1049.0,1585.0,466.0,16900.0,
397,1062.0,1459.0,594.0,16885.0,
398,1047.0,1496.0,608.0,16849.0,
399,1027.0,1519.0,614.0,16840.0,
400,994.0,1453.0,576.0,16977.0,
401,950.0,1431.0,712.0,16907.0,
402,931.0,1337.0,670.0,17062.0,
403,930.0,1368.0,566.0,17136.0,
404,932.0,1317.0,608.0,17143.0,
405,937.0,1349.0,604.0,17110.0,
406,964.0,1324.0,643.0,17069.0,
407,950.0,1318.0,663.0,17069.0,
408,1032.0,1323.0,603.0,17042.0,
409,1035.0,1359.0,604.0,17002.0,
410,985.0,1286.0,639.0,17090.0,
411,959.0,1293.0,633.0,17115.0,
412,932.0,1307.0,592.0,17169.0,
413,998.0,1253.0,574.0,17175.0,
414,1006.0,1245.0,559.0,17190.0,
415,1127.0,1251.0,571.0,17051.0,
416,1132.0,1303.0,592.0,16973.0,
417,1273.0,1297.0,607.0,16823.0,
418,1307.0,1312.0,691.0,16690.0,
419,1343.0,1432.0,668.0,16557.0,
420,1242.0,1467.0,789.0,16502.0,
421,1112.0,1557.0,821.0,16510.0,
422,1049.0,1779.0,638.0,16534.0,
423,1043.0,1684.0,738.0,16535.0,
424,991.0,1730.0,707.0,16572.0,
425,952.0,1743.0,716.0,16589.0,
426,858.0,1698.0,763.0,16681.0,
427,858.0,1692.0,756.0,16694.0,
428,828.0,1720.0,785.0,16667.0,
429,815.0,1710.0,776.0,16699.0,
430,797.0,1802.0,692.0,16709.0,
431,758.0,1807.0,723.0,16712.0,
432,777.0,1858.0,669.0,16696.0,
433,775.0,1901.0,505.0,16819.0,
434,795.0,1921.0,519.0,16765.0,
435,864.0,1899.0,563.0,16674.0,
436,797.0,1826.0,683.0,16694.0,
437,809.0,1897.0,589.0,16705.0,
438,788.0,1974.0,603.0,16635.0,
439,755.0,1924.0,650.0,16671.0,
440,760.0,1936.0,554.0,16750.0,
441,829.0,1898.0,563.0,16710.0,
442,836.0,1832.0,670.0,16662.0,
443,965.0,1684.0,681.0,16670.0,
444,1053.0,1643.0,668.0,16636.0,
445,1245.0,1453.0,821.0,16481.0,
446,1265.0,1438.0,839.0,16458.0,
447,1199.0,1635.0,758.0,16408.0,
448,1155.0,1584.0,821.0,16440.0,
449,1216.0,1600.0,751.0,16433.0,
450,1240.0,1547.0,779.0,16434.0,
451,1317.0,1547.0,819.0,16317.0,
452,1404.0,1493.0,858.0,16245.0,
453,1377.0,1706.0,767.0,16150.0,
454,1323.0,1664.0,827.0,16186.0,
455,1386.0,1751.0,874.0,15989.0,
456,1324.0,1790.0,974.0,15912.0,
457,1259.0,1777.0,1141.0,15823.0,
458,1200.0,1819.0,1249.0,15732.0,
459,1113.0,1970.0,1223.0,15694.0,
460,1049.0,2060.0,1178.0,15713.0,
461,953.0,2169.0,1139.0,15739.0,
462,865.0,2340.0,1124.0,15671.0,
463,802.0,2266.0,1109.0,15823.0,
464,674.0,2371.0,1095.0,15860.0,
465,666.0,2248.0,983.0,16103.0,
466,643.0,2176.0,901.0,16280.0,
467,658.0,2070.0,781.0,16491.0,
468,673.0,2027.0,675.0,16625.0,
469,685.0,1975.0,665.0,16675.0,
470,733.0,1810.0,710.0,16747.0,
471,758.0,1762.0,635.0,16845.0,
472,760.0,1713.0,612.0,16915.0,
473,726.0,1631.0,613.0,17030.0,
474,737.0,1530.0,544.0,17189.0,
475,733.0,1486.0,515.0,17266.0,
476,729.0,1421.0,499.0,17351.0,
477,754.0,1373.0,464.0,17409.0,
478,747.0,1311.0,504.0,17438.0,
479,770.0,1323.0,464.0,17443.0,
480,780.0,1279.0,410.0,17531.0,
481,884.0,1256.0,430.0,17430.0,
482,933.0,1272.0,414.0,17381.0,
483,925.0,1207.0,466.0,17402.0,
484,1098.0,1172.0,523.0,17207.0,
485,1194.0,1164.0,487.0,17155.0,
486,1247.0,1128.0,572.0,17053.0,
487,1175.0,1066.0,632.0,17127.0,
488,1179.0,1145.0,538.0,17138.0,
489,1106.0,1264.0,542.0,17088.0,
490,1135.0,1374.0,437.0,17054.0,
491,1023.0,1388.0,594.0,16995.0,
492,946.0,1275.0,629.0,17150.0,
493,949.0,1382.0,490.0,17179.0,
494,966.0,1323.0,504.0,17207.0,
495,951.0,1306.0,508.0,17235.0,
496,961.0,1276.0,440.0,17323.0,
497,950.0,1138.0,536.0,17376.0,
498,918.0,1080.0,570.0,17432.0,
499,965.0,1063.0,581.0,17391.0,
500,1036.0,1171.0,520.0,17273.0,
501,1038.0,1244.0,547.0,17171.0,
502,1043.0,1142.0,596.0,17219.0,
503,1037.0,1152.0,617.0,17194.0,
504,1010.0,1222.0,586.0,17182.0,
505,1016.0,1163.0,624.0,17197.0,
506,997.0,1205.0,613.0,17185.0,
507,982.0,1208.0,609.0,17201.0,
508,958.0,1220.0,647.0,17175.0,
509,948.0,1208.0,622.0,17222.0,
510,895.0,1309.0,614.0,17182.0,
511,889.0,1338.0,615.0,17158.0,
512,859.0,1409.0,580.0,17152.0,
513,852.0,1443.0,516.0,17189.0,
514,903.0,1488.0,542.0,17067.0,
515,922.0,1478.0,527.0,17073.0,
516,980.0,1478.0,611.0,16931.0,
517,1071.0,1420.0,736.0,16773.0,
518,1111.0,1406.0,700.0,16783.0,
519,1206.0,1431.0,729.0,16634.0,
520,1233.0,1468.0,742.0,16557.0,
521,1295.0,1466.0,915.0,16324.0,
522,1330.0,1442.0,969.0,16259.0,
523,1296.0,1578.0,924.0,16202.0,
524,1333.0,1588.0,892.0,16187.0,
525,1369.0,1613.0,896.0,16122.0,
526,1245.0,1621.0,1143.0,15991.0,
527,1131.0,1739.0,1169.0,15961.0,
528,1039.0,1709.0,1295.0,15957.0,
529,975.0,1755.0,1254.0,16016.0,
530,883.0,1796.0,1259.0,16062.0,
531,869.0,1752.0,1223.0,16156.0,
532,852.0,1805.0,1103.0,16240.0,
533,856.0,1688.0,1005.0,16451.0,
534,841.0,1843.0,889.0,16427.0,
535,810.0,1865.0,804.0,16521.0,
536,777.0,1726.0,734.0,16763.0,
537,776.0,1736.0,564.0,16924.0,
538,826.0,1617.0,582.0,16975.0,
539,846.0,1569.0,558.0,17027.0,
540,921.0,1454.0,569.0,17056.0,
541,1043.0,1366.0,649.0,16942.0,
542,1109.0,1271.0,643.0,16977.0,
543,1180.0,1328.0,604.0,16888.0,
544,1129.0,1353.0,701.0,16817.0,
545,1134.0,1371.0,753.0,16742.0,
546,1056.0,1413.0,806.0,16725.0,
547,1062.0,1457.0,822.0,16659.0,
548,1090.0,1447.0,911.0,16552.0,
549,1075.0,1512.0,855.0,16558.0,
550,1041.0,1544.0,864.0,16551.0,
551,1092.0,1635.0,870.0,16403.0,
552,1067.0,1752.0,844.0,16337.0,
553,963.0,1835.0,933.0,16269.0,
554,920.0,1854.0,954.0,16272.0,
555,926.0,1840.0,929.0,16305.0,
556,957.0,1851.0,967.0,16225.0,
557,900.0,1904.0,1041.0,16155.0,
558,852.0,1967.0,955.0,16226.0,
559,826.0,1964.0,896.0,16314.0,
560,831.0,1968.0,962.0,16239.0,
561,838.0,1973.0,913.0,16276.0,
562,847.0,2097.0,858.0,16198.0,
563,826.0,2219.0,808.0,16147.0,
564,779.0,2183.0,922.0,16116.0,
565,743.0,2218.0,930.0,16109.0,
566,696.0,2274.0,939.0,16091.0,
567,706.0,2372.0,900.0,16022.0,
568,684.0,2408.0,862.0,16046.0,
569,680.0,2584.0,671.0,16065.0,
570,687.0,2566.0,584.0,16163.0,
571,672.0,2440.0,637.0,16251.0,
572,637.0,2390.0,596.0,16377.0,
573,634.0,2301.0,605.0,16460.0,
574,608.0,2160.0,750.0,16482.0,
575,674.0,2093.0,733.0,16500.0,
576,676.0,2063.0,695.0,16566.0,
577,741.0,2073.0,653.0,16533.0,
578,760.0,2097.0,624.0,16519.0,
579,756.0,2137.0,647.0,16460.0,
580,700.0,2201.0,684.0,16415.0,
581,743.0,2219.0,599.0,16439.0,
582,741.0,2258.0,606.0,16395.0,
583,721.0,2191.0,657.0,16431.0,
584,744.0,2081.0,666.0,16509.0,
585,748.0,1994.0,673.0,16585.0,
586,761.0,1850.0,703.0,16686.0,
587,822.0,1616.0,702.0,16860.0,
588,833.0,1503.0,663.0,17001.0,
589,942.0,1494.0,639.0,16925.0,
590,997.0,1441.0,681.0,16881.0,
591,1018.0,1464.0,688.0,16830.0,
592,1049.0,1373.0,717.0,16861.0,
593,1097.0,1501.0,647.0,16755.0,
594,1125.0,1484.0,567.0,16824.0,
595,1158.0,1403.0,589.0,16850.0,
596,1186.0,1327.0,643.0,16844.0,
597,1229.0,1219.0,652.0,16900.0,
598,1250.0,1254.0,670.0,16826.0,
599,1251.0,1229.0,693.0,16827.0,
600,1286.0,1174.0,667.0,16873.0,
601,1286.0,1168.0,694.0,16852.0,
602,1277.0,1194.0,701.0,16828.0,
603,1282.0,1207.0,753.0,16758.0,
604,1305.0,1246.0,790.0,16659.0,
605,1276.0,1333.0,834.0,16557.0,
606,1262.0,1326.0,880.0,16532.0,
607,1240.0,1433.0,836.0,16491.0,
608,1339.0,1475.0,830.0,16356.0,
609,1231.0,1506.0,987.0,16276.0,
610,1173.0,1557.0,992.0,16278.0,
611,1083.0,1620.0,1022.0,16275.0,
612,962.0,1736.0,1029.0,16273.0,
613,905.0,1885.0,900.0,16310.0,
614,825.0,1976.0,835.0,16364.0,
615,756.0,1976.0,859.0,16409.0,
616,658.0,2088.0,807.0,16447.0,
617,611.0,1948.0,759.0,16682.0,
618,575.0,2027.0,620.0,16778.0,
619,572.0,1968.0,590.0,16870.0,
620,575.0,1937.0,546.0,16942.0,
621,568.0,1847.0,518.0,17067.0,
622,551.0,1648.0,521.0,17280.0,
623,568.0,1527.0,495.0,17410.0,
624,592.0,1501.0,451.0,17456.0,
625,626.0,1460.0,454.0,17460.0,
626,652.0,1459.0,449.0,17440.0,
627,712.0,1394.0,460.0,17434.0,
628,716.0,1347.0,452.0,17485.0,
629,787.0,1313.0,403.0,17497.0,
630,824.0,1305.0,425.0,17446.0,
631,837.0,1263.0,417.0,17483.0,
632,847.0,1187.0,455.0,17511.0,
633,873.0,1162.0,506.0,17459.0,
634,901.0,1083.0,488.0,17528.0,
635,933.0,1117.0,466.0,17484.0,
636,942.0,1089.0,482.0,17487.0,
637,963.0,1114.0,463.0,17460.0,
638,971.0,1046.0,506.0,17477.0,
639,982.0,1034.0,454.0,17530.0,
640,1023.0,947.0,474.0,17556.0,
641,1133.0,984.0,422.0,17461.0,
642,1218.0,956.0,445.0,17381.0,
643,1231.0,949.0,508.0,17312.0,
644,1255.0,986.0,498.0,17261.0,
645,1262.0,996.0,556.0,17186.0,
646,1282.0,1003.0,609.0,17106.0,
647,1339.0,1034.0,638.0,16989.0,
648,1329.0,1080.0,636.0,16955.0,
649,1338.0,1095.0,688.0,16879.0,
650,1272.0,1119.0,759.0,16850.0,
651,1243.0,1302.0,718.0,16737.0,
652,1173.0,1349.0,777.0,16701.0,
653,1134.0,1430.0,782.0,16654.0,
654,1134.0,1441.0,736.0,16689.0,
655,1130.0,1467.0,746.0,16657.0,
656,1083.0,1582.0,742.0,16593.0,
657,1035.0,1742.0,696.0,16527.0,
658,1030.0,1622.0,714.0,16634.0,
659,1075.0,1721.0,641.0,16563.0,
660,1083.0,1673.0,660.0,16584.0,
661,1189.0,1636.0,783.0,16392.0,
662,1071.0,1651.0,800.0,16478.0,
663,1079.0,1652.0,750.0,16519.0,
664,1036.0,1713.0,735.0,16516.0,
665,958.0,1665.0,759.0,16618.0,
666,902.0,1684.0,801.0,16613.0,
667,923.0,1685.0,769.0,16623.0,
668,891.0,1715.0,830.0,16564.0,
669,891.0,1764.0,790.0,16555.0,
670,883.0,1751.0,789.0,16577.0,
671,843.0,1713.0,755.0,16689.0,
672,816.0,1723.0,719.0,16742.0,
673,813.0,1775.0,641.0,16771.0,
674,865.0,1723.0,606.0,16806.0,
675,826.0,1746.0,657.0,16771.0,
676,837.0,1746.0,610.0,16807.0,
677,807.0,1724.0,691.0,16778.0,
678,810.0,1758.0,657.0,16775.0,
679,824.0,1646.0,743.0,16787.0,
680,819.0,1673.0,738.0,16770.0,
681,851.0,1579.0,697.0,16873.0,
682,894.0,1519.0,711.0,16876.0,
683,877.0,1520.0,721.0,16882.0,
684,901.0,1504.0,711.0,16884.0,
685,936.0,1478.0,705.0,16881.0,
686,1013.0,1460.0,717.0,16810.0,
687,1050.0,1455.0,777.0,16718.0,
688,1040.0,1478.0,749.0,16733.0,
689,971.0,1498.0,704.0,16827.0,
690,899.0,1564.0,757.0,16780.0,
691,859.0,1541.0,757.0,16843.0,
692,813.0,1558.0,726.0,16903.0,
693,808.0,1585.0,678.0,16929.0,
694,819.0,1593.0,629.0,16959.0,
695,800.0,1642.0,591.0,16967.0,
696,809.0,1637.0,551.0,17003.0,
697,819.0,1572.0,580.0,17029.0,
698,860.0,1549.0,575.0,17016.0,
699,919.0,1496.0,595.0,16990.0,
700,944.0,1538.0,683.0,16835.0,
701,986.0,1573.0,737.0,16704.0,
702,1017.0,1583.0,733.0,16667.0,
703,988.0,1544.0,742.0,16726.0,
704,983.0,1553.0,699.0,16765.0,
705,954.0,1520.0,694.0,16832.0,
706,963.0,1552.0,592.0,16893.0,
707,939.0,1588.0,544.0,16929.0,
708,927.0,1590.0,572.0,16911.0,
709,914.0,1539.0,621.0,16926.0,
710,908.0,1595.0,676.0,16821.0,
711,914.0,1629.0,721.0,16736.0,
712,893.0,1587.0,743.0,16777.0,
713,896.0,1613.0,709.0,16782.0,
714,875.0,1646.0,734.0,16745.0,
715,809.0,1668.0,715.0,16808.0,
716,850.0,1685.0,643.0,16822.0,
717,843.0,1701.0,581.0,16875.0,
718,831.0,1704.0,615.0,16850.0,
719,828.0,1644.0,649.0,16879.0,
720,821.0,1523.0,655.0,17001.0,
721,842.0,1483.0,623.0,17052.0,
722,868.0,1455.0,586.0,17091.0,
723,879.0,1506.0,603.0,17012.0,
724,930.0,1519.0,544.0,17007.0,
725,924.0,1511.0,595.0,16970.0,
726,902.0,1519.0,717.0,16862.0,
727,876.0,1597.0,757.0,16770.0,
728,875.0,1595.0,718.0,16812.0,
729,827.0,1608.0,723.0,16842.0,
730,788.0,1622.0,647.0,16943.0,
