jour,S,I,E,R,
0,19980.0,20.0,0.0,0.0,
1,19964.0,20.0,16.0,0.0,
2,19900.0,23.0,77.0,0.0,
3,19783.0,52.0,165.0,0.0,
4,19566.0,112.0,318.0,4.0,
5,19052.0,202.0,713.0,33.0,
6,18282.0,460.0,1212.0,46.0,
7,16418.0,868.0,2602.0,112.0,
8,13522.0,1600.0,4685.0,193.0,
9,9857.0,2887.0,6844.0,412.0,
10,5432.0,5246.0,8545.0,777.0,
11,1912.0,7951.0,9004.0,1133.0,
12,263.0,10413.0,7345.0,1979.0,
13,50.0,11545.0,5282.0,3123.0,
14,19.0,11743.0,3524.0,4714.0,
15,21.0,11300.0,2365.0,6314.0,
16,56.0,10459.0,1491.0,7994.0,
17,144.0,9317.0,1020.0,9519.0,
18,32.0,8324.0,533.0,11111.0,
19,16.0,7472.0,79.0,12433.0,
20,5.0,6281.0,16.0,13698.0,
21,9.0,5410.0,2.0,14579.0,
22,28.0,4478.0,8.0,15486.0,
23,44.0,3758.0,15.0,16183.0,
24,76.0,3251.0,27.0,16646.0,
25,175.0,2951.0,51.0,16823.0,
26,279.0,2589.0,18.0,17114.0,
27,191.0,2249.0,178.0,17382.0,
28,168.0,2102.0,72.0,17658.0,
29,222.0,1888.0,61.0,17829.0,
30,227.0,1648.0,7.0,18118.0,
31,293.0,1496.0,85.0,18126.0,
32,292.0,1504.0,150.0,18054.0,
33,287.0,1453.0,97.0,18163.0,
34,331.0,1250.0,66.0,18353.0,
35,265.0,1237.0,84.0,18414.0,
36,275.0,1125.0,118.0,18482.0,
37,328.0,1111.0,14.0,18547.0,
38,327.0,998.0,13.0,18662.0,
39,459.0,858.0,107.0,18576.0,
40,400.0,737.0,126.0,18737.0,
41,416.0,648.0,183.0,18753.0,
42,508.0,606.0,228.0,18658.0,
43,503.0,603.0,217.0,18677.0,
44,492.0,553.0,157.0,18798.0,
45,542.0,457.0,141.0,18860.0,
46,675.0,392.0,150.0,18783.0,
47,668.0,387.0,117.0,18828.0,
48,677.0,398.0,83.0,18842.0,
49,751.0,369.0,113.0,18767.0,
50,800.0,414.0,87.0,18699.0,
51,813.0,385.0,62.0,18740.0,
52,864.0,358.0,91.0,18687.0,
53,874.0,389.0,150.0,18587.0,
54,889.0,319.0,73.0,18719.0,
55,999.0,247.0,36.0,18718.0,
56,1135.0,197.0,71.0,18597.0,
57,1228.0,159.0,54.0,18559.0,
58,1302.0,156.0,42.0,18500.0,
59,1304.0,151.0,51.0,18494.0,
60,1398.0,132.0,49.0,18421.0,
61,1412.0,108.0,46.0,18434.0,
62,1435.0,112.0,40.0,18413.0,
63,1518.0,81.0,34.0,18367.0,
64,1549.0,61.0,58.0,18332.0,
65,1540.0,71.0,45.0,18344.0,
66,1548.0,73.0,36.0,18343.0,
67,1582.0,74.0,34.0,18310.0,
68,1655.0,69.0,20.0,18256.0,
69,1779.0,67.0,27.0,18127.0,
70,1815.0,47.0,43.0,18095.0,
71,1968.0,52.0,42.0,17938.0,
72,1974.0,74.0,36.0,17916.0,
73,1975.0,61.0,50.0,17914.0,
74,1999.0,65.0,43.0,17893.0,
75,1986.0,55.0,53.0,17906.0,
76,2017.0,50.0,56.0,17877.0,
77,2087.0,55.0,51.0,17807.0,
78,2069.0,69.0,64.0,17798.0,
79,2095.0,82.0,55.0,17768.0,
80,2057.0,87.0,82.0,17774.0,
81,2142.0,114.0,79.0,17665.0,
82,2232.0,139.0,75.0,17554.0,
83,2218.0,163.0,69.0,17550.0,
84,2161.0,174.0,121.0,17544.0,
85,2126.0,176.0,163.0,17535.0,
86,2087.0,263.0,105.0,17545.0,
87,2003.0,260.0,157.0,17580.0,
88,2008.0,291.0,181.0,17520.0,
89,1999.0,333.0,178.0,17490.0,
90,2118.0,313.0,264.0,17305.0,
91,2161.0,386.0,218.0,17235.0,
92,2118.0,390.0,319.0,17173.0,
93,2047.0,439.0,322.0,17192.0,
94,1974.0,549.0,235.0,17242.0,
95,1847.0,533.0,372.0,17248.0,
96,1854.0,590.0,293.0,17263.0,
97,1872.0,614.0,297.0,17217.0,
98,1790.0,589.0,391.0,17230.0,
99,1795.0,583.0,444.0,17178.0,
100,1752.0,608.0,411.0,17229.0,
101,1691.0,616.0,322.0,17371.0,
102,1548.0,673.0,349.0,17430.0,
103,1445.0,735.0,283.0,17537.0,
104,1513.0,669.0,225.0,17593.0,
105,1492.0,529.0,271.0,17708.0,
106,1432.0,518.0,348.0,17702.0,
107,1426.0,611.0,219.0,17744.0,
108,1415.0,546.0,191.0,17848.0,
109,1460.0,578.0,188.0,17774.0,
110,1373.0,596.0,246.0,17785.0,
111,1388.0,492.0,245.0,17875.0,
112,1381.0,503.0,190.0,17926.0,
113,1342.0,490.0,210.0,17958.0,
114,1281.0,472.0,224.0,18023.0,
115,1309.0,449.0,241.0,18001.0,
116,1291.0,473.0,190.0,18046.0,
117,1344.0,500.0,183.0,17973.0,
118,1285.0,445.0,241.0,18029.0,
119,1306.0,367.0,239.0,18088.0,
120,1379.0,371.0,214.0,18036.0,
121,1415.0,403.0,209.0,17973.0,
122,1493.0,325.0,233.0,17949.0,
123,1576.0,306.0,246.0,17872.0,
124,1627.0,328.0,185.0,17860.0,
125,1655.0,319.0,187.0,17839.0,
126,1695.0,334.0,190.0,17781.0,
127,1761.0,316.0,176.0,17747.0,
128,1894.0,344.0,181.0,17581.0,
129,1869.0,328.0,192.0,17611.0,
130,1810.0,342.0,244.0,17604.0,
131,1735.0,408.0,291.0,17566.0,
132,1705.0,485.0,231.0,17579.0,
133,1606.0,500.0,290.0,17604.0,
134,1560.0,528.0,234.0,17678.0,
135,1555.0,485.0,193.0,17767.0,
136,1555.0,437.0,226.0,17782.0,
137,1519.0,422.0,219.0,17840.0,
138,1433.0,376.0,271.0,17920.0,
139,1395.0,454.0,229.0,17922.0,
140,1335.0,489.0,228.0,17948.0,
141,1296.0,513.0,240.0,17951.0,
142,1310.0,555.0,145.0,17990.0,
143,1273.0,459.0,166.0,18102.0,
144,1313.0,429.0,166.0,18092.0,
145,1378.0,360.0,191.0,18071.0,
146,1404.0,388.0,175.0,18033.0,
147,1438.0,358.0,202.0,18002.0,
148,1452.0,379.0,206.0,17963.0,
149,1430.0,391.0,156.0,18023.0,
150,1424.0,372.0,179.0,18025.0,
151,1410.0,382.0,167.0,18041.0,
152,1556.0,352.0,182.0,17910.0,
153,1606.0,393.0,211.0,17790.0,
154,1626.0,433.0,205.0,17736.0,
155,1589.0,449.0,233.0,17729.0,
156,1534.0,508.0,207.0,17751.0,
157,1487.0,553.0,180.0,17780.0,
158,1439.0,595.0,197.0,17769.0,
159,1377.0,524.0,300.0,17799.0,
160,1397.0,593.0,233.0,17777.0,
161,1340.0,606.0,241.0,17813.0,
162,1311.0,617.0,275.0,17797.0,
163,1281.0,603.0,256.0,17860.0,
164,1362.0,630.0,234.0,17774.0,
165,1321.0,649.0,229.0,17801.0,
166,1266.0,559.0,298.0,17877.0,
167,1297.0,558.0,329.0,17816.0,
168,1248.0,652.0,282.0,17818.0,
169,1262.0,653.0,325.0,17760.0,
170,1257.0,714.0,245.0,17784.0,
171,1226.0,729.0,234.0,17811.0,
172,1211.0,766.0,270.0,17753.0,
173,1319.0,823.0,268.0,17590.0,
174,1326.0,795.0,306.0,17573.0,
175,1276.0,799.0,358.0,17567.0,
176,1266.0,851.0,418.0,17465.0,
177,1253.0,883.0,277.0,17587.0,
178,1279.0,754.0,330.0,17637.0,
179,1331.0,789.0,220.0,17660.0,
180,1352.0,666.0,225.0,17757.0,
181,1271.0,614.0,270.0,17845.0,
182,1270.0,549.0,292.0,17889.0,
183,1249.0,568.0,271.0,17912.0,
184,1221.0,607.0,258.0,17914.0,
185,1204.0,555.0,222.0,18019.0,
186,1276.0,522.0,182.0,18020.0,
187,1263.0,466.0,165.0,18106.0,
188,1263.0,368.0,182.0,18187.0,
189,1264.0,354.0,144.0,18238.0,
190,1303.0,323.0,167.0,18207.0,
191,1321.0,356.0,137.0,18186.0,
192,1329.0,294.0,128.0,18249.0,
193,1376.0,296.0,137.0,18191.0,
194,1487.0,208.0,165.0,18140.0,
195,1551.0,241.0,125.0,18083.0,
196,1669.0,281.0,122.0,17928.0,
197,1707.0,297.0,128.0,17868.0,
198,1791.0,297.0,94.0,17818.0,
199,1805.0,259.0,105.0,17831.0,
200,1815.0,246.0,136.0,17803.0,
201,1854.0,226.0,186.0,17734.0,
202,1895.0,269.0,156.0,17680.0,
203,1906.0,300.0,114.0,17680.0,
204,1901.0,282.0,197.0,17620.0,
205,1885.0,289.0,215.0,17611.0,
206,1937.0,331.0,227.0,17505.0,
207,1946.0,350.0,183.0,17521.0,
208,1926.0,345.0,207.0,17522.0,
209,1949.0,334.0,233.0,17484.0,
210,1961.0,360.0,203.0,17476.0,
211,1919.0,391.0,225.0,17465.0,
212,1928.0,427.0,250.0,17395.0,
213,1911.0,426.0,260.0,17403.0,
214,1907.0,473.0,310.0,17310.0,
215,1956.0,462.0,339.0,17243.0,
216,2002.0,512.0,378.0,17108.0,
217,1929.0,438.0,436.0,17197.0,
218,1885.0,552.0,396.0,17167.0,
219,1861.0,594.0,409.0,17136.0,
220,1832.0,589.0,411.0,17168.0,
221,1804.0,591.0,369.0,17236.0,
222,1758.0,629.0,385.0,17228.0,
223,1683.0,622.0,439.0,17256.0,
224,1694.0,666.0,416.0,17224.0,
225,1677.0,655.0,397.0,17271.0,
226,1600.0,708.0,367.0,17325.0,
227,1579.0,764.0,329.0,17328.0,
228,1444.0,727.0,418.0,17411.0,
229,1346.0,827.0,443.0,17384.0,
230,1290.0,902.0,363.0,17445.0,
231,1238.0,923.0,299.0,17540.0,
232,1184.0,872.0,317.0,17627.0,
233,1130.0,841.0,321.0,17708.0,
234,1059.0,738.0,370.0,17833.0,
235,1065.0,734.0,293.0,17908.0,
236,1189.0,679.0,306.0,17826.0,
237,1243.0,621.0,328.0,17808.0,
238,1217.0,673.0,347.0,17763.0,
239,1193.0,664.0,335.0,17808.0,
240,1182.0,705.0,212.0,17901.0,
241,1174.0,597.0,207.0,18022.0,
242,1240.0,501.0,205.0,18054.0,
243,1279.0,520.0,204.0,17997.0,
244,1343.0,473.0,181.0,18003.0,
245,1380.0,499.0,172.0,17949.0,
246,1554.0,440.0,275.0,17731.0,
247,1623.0,519.0,223.0,17635.0,
248,1622.0,544.0,192.0,17642.0,
249,1677.0,564.0,238.0,17521.0,
250,1670.0,589.0,247.0,17494.0,
251,1797.0,621.0,245.0,17337.0,
252,1857.0,652.0,255.0,17236.0,
253,1866.0,624.0,369.0,17141.0,
254,1794.0,638.0,467.0,17101.0,
255,1732.0,697.0,507.0,17064.0,
256,1577.0,749.0,600.0,17074.0,
257,1441.0,888.0,680.0,16991.0,
258,1334.0,1034.0,647.0,16985.0,
259,1220.0,1142.0,544.0,17094.0,
260,1060.0,1165.0,655.0,17120.0,
261,967.0,1115.0,586.0,17332.0,
262,887.0,1084.0,567.0,17462.0,
263,821.0,1047.0,496.0,17636.0,
264,790.0,999.0,452.0,17759.0,
265,813.0,977.0,336.0,17874.0,
266,810.0,903.0,280.0,18007.0,
267,797.0,829.0,265.0,18109.0,
268,840.0,756.0,201.0,18203.0,
269,859.0,725.0,149.0,18267.0,
270,837.0,619.0,185.0,18359.0,
271,942.0,516.0,252.0,18290.0,
272,986.0,486.0,231.0,18297.0,
273,1295.0,455.0,206.0,18044.0,
274,1514.0,414.0,246.0,17826.0,
275,1544.0,439.0,281.0,17736.0,
276,1531.0,510.0,262.0,17697.0,
277,1478.0,527.0,280.0,17715.0,
278,1433.0,537.0,330.0,17700.0,
279,1447.0,601.0,236.0,17716.0,
280,1499.0,605.0,221.0,17675.0,
281,1442.0,607.0,265.0,17686.0,
282,1526.0,648.0,270.0,17556.0,
283,1440.0,676.0,337.0,17547.0,
284,1448.0,673.0,408.0,17471.0,
285,1443.0,697.0,446.0,17414.0,
286,1446.0,866.0,437.0,17251.0,
287,1358.0,994.0,467.0,17181.0,
288,1268.0,1025.0,550.0,17157.0,
289,1211.0,1113.0,525.0,17151.0,
290,1101.0,1159.0,515.0,17225.0,
291,1006.0,1191.0,529.0,17274.0,
292,942.0,1182.0,522.0,17354.0,
293,879.0,1159.0,420.0,17542.0,
294,834.0,1103.0,364.0,17699.0,
295,854.0,1039.0,311.0,17796.0,
296,835.0,980.0,267.0,17918.0,
297,848.0,938.0,251.0,17963.0,
298,874.0,865.0,222.0,18039.0,
299,913.0,819.0,204.0,18064.0,
300,898.0,706.0,225.0,18171.0,
301,933.0,684.0,204.0,18179.0,
302,944.0,632.0,193.0,18231.0,
303,972.0,601.0,185.0,18242.0,
304,980.0,601.0,212.0,18207.0,
305,1018.0,613.0,176.0,18193.0,
306,1070.0,576.0,223.0,18131.0,
307,1077.0,520.0,183.0,18220.0,
308,1164.0,484.0,144.0,18208.0,
309,1254.0,419.0,172.0,18155.0,
310,1317.0,405.0,191.0,18087.0,
311,1374.0,402.0,141.0,18083.0,
312,1413.0,396.0,106.0,18085.0,
313,1465.0,380.0,169.0,17986.0,
314,1497.0,380.0,141.0,17982.0,
315,1515.0,393.0,136.0,17956.0,
316,1543.0,404.0,164.0,17889.0,
317,1670.0,412.0,156.0,17762.0,
318,1751.0,441.0,200.0,17608.0,
319,1925.0,434.0,261.0,17380.0,
320,2002.0,439.0,279.0,17280.0,
321,2039.0,519.0,293.0,17149.0,
322,2114.0,597.0,312.0,16977.0,
323,2019.0,657.0,389.0,16935.0,
324,1944.0,643.0,521.0,16892.0,
325,1895.0,808.0,468.0,16829.0,
326,1769.0,880.0,470.0,16881.0,
327,1660.0,1060.0,464.0,16816.0,
328,1551.0,1125.0,436.0,16888.0,
329,1429.0,1170.0,494.0,16907.0,
330,1307.0,1245.0,520.0,16928.0,
331,1260.0,1264.0,501.0,16975.0,
332,1133.0,1267.0,648.0,16952.0,
333,1008.0,1425.0,519.0,17048.0,
334,948.0,1499.0,460.0,17093.0,
335,953.0,1554.0,444.0,17049.0,
336,913.0,1630.0,372.0,17085.0,
337,918.0,1559.0,371.0,17152.0,
338,913.0,1447.0,355.0,17285.0,
339,894.0,1420.0,344.0,17342.0,
340,914.0,1300.0,277.0,17509.0,
341,975.0,1107.0,292.0,17626.0,
342,1049.0,1096.0,306.0,17549.0,
343,1054.0,938.0,314.0,17694.0,
344,1092.0,914.0,285.0,17709.0,
345,1069.0,886.0,313.0,17732.0,
346,998.0,932.0,325.0,17745.0,
347,991.0,901.0,295.0,17813.0,
348,1015.0,866.0,244.0,17875.0,
349,1042.0,804.0,256.0,17898.0,
350,1085.0,807.0,208.0,17900.0,
351,1103.0,769.0,271.0,17857.0,
352,1098.0,805.0,225.0,17872.0,
353,1079.0,834.0,210.0,17877.0,
354,1078.0,856.0,198.0,17868.0,
355,1067.0,808.0,271.0,17854.0,
356,1085.0,790.0,279.0,17846.0,
357,1087.0,874.0,270.0,17769.0,
358,1049.0,844.0,314.0,17793.0,
359,1030.0,880.0,333.0,17757.0,
360,992.0,923.0,328.0,17757.0,
361,990.0,981.0,305.0,17724.0,
362,919.0,897.0,383.0,17801.0,
363,941.0,941.0,308.0,17810.0,
364,918.0,939.0,269.0,17874.0,
365,934.0,912.0,269.0,17885.0,
366,975.0,865.0,249.0,17911.0,
367,1009.0,838.0,260.0,17893.0,
368,1048.0,772.0,292.0,17888.0,
369,1120.0,685.0,338.0,17857.0,
370,1158.0,682.0,267.0,17893.0,
371,1343.0,721.0,259.0,17677.0,
372,1406.0,661.0,329.0,17604.0,
373,1530.0,665.0,337.0,17468.0,
374,1516.0,709.0,370.0,17405.0,
375,1504.0,715.0,386.0,17395.0,
376,1436.0,640.0,449.0,17475.0,
377,1451.0,652.0,432.0,17465.0,
378,1400.0,706.0,400.0,17494.0,
379,1378.0,643.0,435.0,17544.0,
380,1337.0,622.0,504.0,17537.0,
381,1318.0,671.0,465.0,17546.0,
382,1290.0,669.0,414.0,17627.0,
383,1292.0,654.0,377.0,17677.0,
384,1268.0,635.0,401.0,17696.0,
385,1278.0,678.0,335.0,17709.0,
386,1278.0,682.0,315.0,17725.0,
387,1309.0,708.0,263.0,17720.0,
388,1291.0,663.0,306.0,17740.0,
389,1251.0,619.0,317.0,17813.0,
390,1268.0,671.0,281.0,17780.0,
391,1231.0,620.0,336.0,17813.0,
392,1264.0,690.0,220.0,17826.0,
393,1327.0,654.0,222.0,17797.0,
394,1330.0,613.0,205.0,17852.0,
395,1424.0,554.0,269.0,17753.0,
396,1682.0,534.0,265.0,17519.0,
397,1671.0,514.0,310.0,17505.0,
398,1942.0,505.0,266.0,17287.0,
399,1955.0,556.0,225.0,17264.0,
400,1925.0,517.0,293.0,17265.0,
401,1966.0,495.0,321.0,17218.0,
402,1916.0,489.0,367.0,17228.0,
403,1904.0,488.0,408.0,17200.0,
404,1874.0,546.0,426.0,17154.0,
405,1880.0,564.0,463.0,17093.0,
406,1886.0,656.0,408.0,17050.0,
407,1803.0,685.0,416.0,17096.0,
408,1743.0,749.0,347.0,17161.0,
409,1661.0,798.0,399.0,17142.0,
410,1618.0,792.0,424.0,17166.0,
411,1616.0,813.0,456.0,17115.0,
412,1580.0,808.0,536.0,17076.0,
413,1536.0,970.0,516.0,16978.0,
414,1432.0,1008.0,522.0,17038.0,
415,1331.0,1014.0,500.0,17155.0,
416,1248.0,1003.0,528.0,17221.0,
417,1188.0,1011.0,472.0,17329.0,
418,1089.0,1067.0,430.0,17414.0,
419,1033.0,1004.0,481.0,17482.0,
420,994.0,1091.0,382.0,17533.0,
421,977.0,1087.0,316.0,17620.0,
422,1088.0,1039.0,289.0,17584.0,
423,1073.0,978.0,330.0,17619.0,
424,1096.0,908.0,273.0,17723.0,
425,1168.0,849.0,284.0,17699.0,
426,1175.0,787.0,321.0,17717.0,
427,1124.0,812.0,332.0,17732.0,
428,1174.0,808.0,318.0,17700.0,
429,1203.0,835.0,307.0,17655.0,
430,1200.0,878.0,286.0,17636.0,
431,1201.0,922.0,234.0,17643.0,
432,1185.0,879.0,275.0,17661.0,
433,1157.0,897.0,277.0,17669.0,
434,1119.0,863.0,314.0,17704.0,
435,1125.0,884.0,325.0,17666.0,
436,1076.0,926.0,277.0,17721.0,
437,1097.0,961.0,211.0,17731.0,
438,1110.0,945.0,297.0,17648.0,
439,1114.0,963.0,306.0,17617.0,
440,1116.0,933.0,303.0,17648.0,
441,1134.0,941.0,283.0,17642.0,
442,1115.0,909.0,246.0,17730.0,
443,1142.0,829.0,237.0,17792.0,
444,1156.0,752.0,262.0,17830.0,
445,1180.0,729.0,251.0,17840.0,
446,1274.0,722.0,242.0,17762.0,
447,1279.0,679.0,235.0,17807.0,
448,1324.0,628.0,244.0,17804.0,
449,1352.0,640.0,237.0,17771.0,
450,1464.0,595.0,212.0,17729.0,
451,1470.0,557.0,286.0,17687.0,
452,1434.0,529.0,360.0,17677.0,
453,1399.0,606.0,346.0,17649.0,
454,1425.0,584.0,289.0,17702.0,
455,1428.0,657.0,271.0,17644.0,
456,1382.0,606.0,300.0,17712.0,
457,1361.0,568.0,290.0,17781.0,
458,1368.0,563.0,286.0,17783.0,
459,1391.0,558.0,274.0,17777.0,
460,1376.0,535.0,242.0,17847.0,
461,1373.0,496.0,188.0,17943.0,
462,1379.0,508.0,142.0,17971.0,
463,1362.0,470.0,174.0,17994.0,
464,1382.0,409.0,187.0,18022.0,
465,1457.0,399.0,167.0,17977.0,
466,1494.0,323.0,241.0,17942.0,
467,1545.0,349.0,218.0,17888.0,
468,1594.0,362.0,202.0,17842.0,
469,1644.0,375.0,204.0,17777.0,
470,1642.0,393.0,168.0,17797.0,
471,1645.0,381.0,194.0,17780.0,
472,1705.0,377.0,201.0,17717.0,
473,1702.0,428.0,208.0,17662.0,
474,1697.0,439.0,230.0,17634.0,
475,1698.0,460.0,239.0,17603.0,
476,1668.0,484.0,300.0,17548.0,
477,1689.0,535.0,311.0,17465.0,
478,1654.0,560.0,282.0,17504.0,
479,1628.0,579.0,268.0,17525.0,
480,1632.0,561.0,325.0,17482.0,
481,1668.0,589.0,305.0,17438.0,
482,1653.0,628.0,341.0,17378.0,
483,1636.0,708.0,310.0,17346.0,
484,1597.0,697.0,308.0,17398.0,
485,1559.0,745.0,331.0,17365.0,
486,1577.0,760.0,347.0,17316.0,
487,1613.0,795.0,405.0,17187.0,
488,1611.0,871.0,410.0,17108.0,
489,1583.0,842.0,546.0,17029.0,
490,1516.0,973.0,500.0,17011.0,
491,1473.0,1108.0,450.0,16969.0,
492,1366.0,1120.0,588.0,16926.0,
493,1312.0,1188.0,552.0,16948.0,
494,1257.0,1266.0,452.0,17025.0,
495,1241.0,1246.0,494.0,17019.0,
496,1152.0,1154.0,532.0,17162.0,
497,1144.0,1121.0,531.0,17204.0,
498,1141.0,1172.0,546.0,17141.0,
499,1123.0,1099.0,544.0,17234.0,
500,1105.0,1121.0,542.0,17232.0,
501,1060.0,1097.0,529.0,17314.0,
502,1041.0,1147.0,500.0,17312.0,
503,1050.0,1088.0,465.0,17397.0,
504,1012.0,1106.0,428.0,17454.0,
505,967.0,1011.0,469.0,17553.0,
506,968.0,969.0,406.0,17657.0,
507,963.0,896.0,334.0,17807.0,
508,976.0,835.0,332.0,17857.0,
509,950.0,830.0,244.0,17976.0,
510,981.0,783.0,218.0,18018.0,
511,1008.0,702.0,255.0,18035.0,
512,1003.0,678.0,237.0,18082.0,
513,1015.0,642.0,221.0,18122.0,
514,1049.0,591.0,195.0,18165.0,
515,1082.0,575.0,219.0,18124.0,
516,1112.0,486.0,205.0,18197.0,
517,1155.0,493.0,207.0,18145.0,
518,1189.0,502.0,214.0,18095.0,
519,1229.0,470.0,219.0,18082.0,
520,1249.0,429.0,184.0,18138.0,
521,1272.0,468.0,167.0,18093.0,
522,1270.0,429.0,217.0,18084.0,
523,1307.0,444.0,233.0,18016.0,
524,1332.0,382.0,225.0,18061.0,
525,1379.0,410.0,208.0,18003.0,
526,1398.0,415.0,178.0,18009.0,
527,1426.0,391.0,172.0,18011.0,
528,1451.0,374.0,170.0,18005.0,
529,1487.0,363.0,190.0,17960.0,
530,1533.0,339.0,226.0,17902.0,
531,1544.0,339.0,196.0,17921.0,
532,1565.0,340.0,161.0,17934.0,
533,1623.0,371.0,136.0,17870.0,
534,1653.0,353.0,161.0,17833.0,
535,1696.0,324.0,172.0,17808.0,
536,1703.0,302.0,187.0,17808.0,
537,1838.0,290.0,209.0,17663.0,
538,1952.0,329.0,178.0,17541.0,
539,2041.0,357.0,209.0,17393.0,
540,2108.0,364.0,188.0,17340.0,
541,2215.0,310.0,211.0,17264.0,
542,2225.0,329.0,232.0,17214.0,
543,2221.0,372.0,247.0,17160.0,
544,2283.0,368.0,274.0,17075.0,
545,2261.0,371.0,269.0,17099.0,
546,2262.0,428.0,259.0,17051.0,
547,2254.0,482.0,251.0,17013.0,
548,2137.0,451.0,389.0,17023.0,
549,2088.0,459.0,444.0,17009.0,
550,2044.0,590.0,420.0,16946.0,
551,1997.0,694.0,349.0,16960.0,
552,2025.0,688.0,389.0,16898.0,
553,2079.0,721.0,403.0,16797.0,
554,1997.0,706.0,527.0,16770.0,
555,1916.0,744.0,609.0,16731.0,
556,1788.0,828.0,654.0,16730.0,
557,1714.0,969.0,716.0,16601.0,
558,1702.0,1100.0,636.0,16562.0,
559,1656.0,1219.0,645.0,16480.0,
560,1490.0,1287.0,716.0,16507.0,
561,1303.0,1342.0,725.0,16630.0,
562,1179.0,1381.0,775.0,16665.0,
563,1051.0,1424.0,853.0,16672.0,
564,996.0,1422.0,818.0,16764.0,
565,955.0,1497.0,726.0,16822.0,
566,864.0,1429.0,758.0,16949.0,
567,917.0,1291.0,767.0,17025.0,
568,910.0,1272.0,644.0,17174.0,
569,924.0,1326.0,600.0,17150.0,
570,801.0,1281.0,673.0,17245.0,
571,773.0,1267.0,629.0,17331.0,
572,784.0,1194.0,586.0,17436.0,
573,740.0,1150.0,528.0,17582.0,
574,719.0,1058.0,504.0,17719.0,
575,717.0,1113.0,360.0,17810.0,
576,706.0,1091.0,307.0,17896.0,
577,727.0,957.0,263.0,18053.0,
578,748.0,885.0,230.0,18137.0,
579,747.0,862.0,206.0,18185.0,
580,740.0,851.0,244.0,18165.0,
581,756.0,827.0,189.0,18228.0,
582,800.0,785.0,177.0,18238.0,
583,825.0,741.0,177.0,18257.0,
584,828.0,737.0,200.0,18235.0,
585,874.0,710.0,188.0,18228.0,
586,863.0,658.0,214.0,18265.0,
587,849.0,627.0,253.0,18271.0,
588,888.0,658.0,235.0,18219.0,
589,935.0,653.0,224.0,18188.0,
590,974.0,698.0,172.0,18156.0,
591,1030.0,684.0,164.0,18122.0,
592,1108.0,673.0,182.0,18037.0,
593,1207.0,592.0,203.0,17998.0,
594,1361.0,576.0,237.0,17826.0,
595,1334.0,478.0,322.0,17866.0,
596,1331.0,488.0,315.0,17866.0,
597,1532.0,496.0,331.0,17641.0,
598,1570.0,483.0,340.0,17607.0,
599,1559.0,468.0,312.0,17661.0,
600,1568.0,483.0,261.0,17688.0,
601,1620.0,489.0,221.0,17670.0,
602,1637.0,457.0,261.0,17645.0,
603,1589.0,490.0,350.0,17571.0,
604,1573.0,568.0,323.0,17536.0,
605,1561.0,593.0,321.0,17525.0,
606,1535.0,558.0,322.0,17585.0,
607,1503.0,580.0,319.0,17598.0,
608,1486.0,590.0,303.0,17621.0,
609,1509.0,587.0,279.0,17625.0,
610,1550.0,623.0,251.0,17576.0,
611,1534.0,575.0,327.0,17564.0,
612,1532.0,615.0,283.0,17570.0,
613,1496.0,651.0,300.0,17553.0,
614,1473.0,640.0,311.0,17576.0,
615,1430.0,646.0,351.0,17573.0,
616,1452.0,715.0,280.0,17553.0,
617,1412.0,715.0,286.0,17587.0,
618,1392.0,681.0,367.0,17560.0,
619,1367.0,687.0,373.0,17573.0,
620,1365.0,674.0,345.0,17616.0,
621,1308.0,670.0,364.0,17658.0,
622,1280.0,754.0,330.0,17636.0,
623,1254.0,762.0,308.0,17676.0,
624,1233.0,768.0,319.0,17680.0,
625,1197.0,794.0,342.0,17667.0,
626,1153.0,804.0,319.0,17724.0,
627,1159.0,787.0,271.0,17783.0,
628,1171.0,683.0,306.0,17840.0,
629,1182.0,701.0,293.0,17824.0,
630,1188.0,741.0,264.0,17807.0,
631,1220.0,721.0,307.0,17752.0,
632,1300.0,675.0,285.0,17740.0,
633,1342.0,652.0,310.0,17696.0,
634,1379.0,650.0,274.0,17697.0,
635,1474.0,619.0,303.0,17604.0,
636,1485.0,666.0,285.0,17564.0,
637,1466.0,663.0,335.0,17536.0,
638,1476.0,734.0,251.0,17539.0,
639,1523.0,728.0,276.0,17473.0,
640,1488.0,737.0,319.0,17456.0,
641,1475.0,759.0,415.0,17351.0,
642,1442.0,778.0,420.0,17360.0,
643,1432.0,797.0,410.0,17361.0,
644,1412.0,903.0,378.0,17307.0,
645,1421.0,958.0,406.0,17215.0,
646,1417.0,1015.0,377.0,17191.0,
647,1489.0,1000.0,413.0,17098.0,
648,1453.0,1045.0,423.0,17079.0,
649,1379.0,1063.0,478.0,17080.0,
650,1305.0,1178.0,505.0,17012.0,
651,1171.0,1169.0,626.0,17034.0,
652,1069.0,1340.0,504.0,17087.0,
653,931.0,1403.0,535.0,17131.0,
654,856.0,1540.0,390.0,17214.0,
655,825.0,1472.0,400.0,17303.0,
656,768.0,1401.0,344.0,17487.0,
657,763.0,1407.0,307.0,17523.0,
658,747.0,1337.0,365.0,17551.0,
659,737.0,1205.0,403.0,17655.0,
660,792.0,1206.0,338.0,17664.0,
661,830.0,1146.0,331.0,17693.0,
662,821.0,1159.0,296.0,17724.0,
663,872.0,1116.0,315.0,17697.0,
664,918.0,1006.0,351.0,17725.0,
665,946.0,949.0,324.0,17781.0,
666,985.0,955.0,263.0,17797.0,
667,1010.0,902.0,286.0,17802.0,
668,1028.0,933.0,336.0,17703.0,
669,1033.0,959.0,309.0,17699.0,
670,1042.0,1010.0,257.0,17691.0,
671,1052.0,880.0,315.0,17753.0,
672,1047.0,907.0,334.0,17712.0,
673,1055.0,962.0,290.0,17693.0,
674,1027.0,943.0,282.0,17748.0,
675,1044.0,912.0,246.0,17798.0,
676,1043.0,863.0,252.0,17842.0,
677,1088.0,813.0,262.0,17837.0,
678,1129.0,781.0,283.0,17807.0,
679,1239.0,778.0,327.0,17656.0,
680,1276.0,735.0,287.0,17702.0,
681,1312.0,703.0,291.0,17694.0,
682,1336.0,693.0,293.0,17678.0,
683,1357.0,677.0,244.0,17722.0,
684,1316.0,644.0,303.0,17737.0,
685,1309.0,666.0,290.0,17735.0,
686,1250.0,669.0,358.0,17723.0,
687,1239.0,671.0,332.0,17758.0,
688,1201.0,715.0,298.0,17786.0,
689,1192.0,716.0,335.0,17757.0,
690,1153.0,707.0,333.0,17807.0,
691,1157.0,663.0,365.0,17815.0,
692,1196.0,636.0,290.0,17878.0,
693,1195.0,672.0,202.0,17931.0,
694,1198.0,706.0,188.0,17908.0,
695,1176.0,662.0,234.0,17928.0,
696,1153.0,566.0,249.0,18032.0,
697,1177.0,525.0,250.0,18048.0,
698,1213.0,497.0,232.0,18058.0,
699,1237.0,481.0,223.0,18059.0,
700,1277.0,470.0,255.0,17998.0,
701,1305.0,496.0,228.0,17971.0,
702,1309.0,454.0,228.0,18009.0,
703,1357.0,492.0,197.0,17954.0,
704,1383.0,499.0,166.0,17952.0,
705,1408.0,503.0,204.0,17885.0,
706,1427.0,523.0,199.0,17851.0,
707,1457.0,485.0,249.0,17809.0,
708,1477.0,472.0,227.0,17824.0,
709,1482.0,522.0,235.0,17761.0,
710,1490.0,524.0,285.0,17701.0,
711,1510.0,583.0,261.0,17646.0,
712,1495.0,576.0,324.0,17605.0,
713,1496.0,654.0,299.0,17551.0,
714,1470.0,651.0,383.0,17496.0,
715,1447.0,717.0,345.0,17491.0,
716,1422.0,726.0,337.0,17515.0,
717,1381.0,770.0,310.0,17539.0,
718,1362.0,802.0,324.0,17512.0,
719,1292.0,810.0,343.0,17555.0,
720,1258.0,863.0,333.0,17546.0,
721,1337.0,791.0,381.0,17491.0,
722,1329.0,832.0,391.0,17448.0,
723,1385.0,818.0,361.0,17436.0,
724,1353.0,883.0,414.0,17350.0,
725,1272.0,974.0,414.0,17340.0,
726,1197.0,1026.0,470.0,17307.0,
727,1184.0,1047.0,419.0,17350.0,
728,1106.0,1005.0,483.0,17406.0,
729,1108.0,1068.0,369.0,17455.0,
730,1045.0,1057.0,426.0,17472.0,
