jour,S,I,E,R,
0,19980.0,20.0,0.0,0.0,
1,19964.0,20.0,16.0,0.0,
2,19879.0,25.0,96.0,0.0,
3,19780.0,43.0,176.0,1.0,
4,19586.0,77.0,315.0,22.0,
5,19289.0,168.0,510.0,33.0,
6,18506.0,337.0,1096.0,61.0,
7,16935.0,690.0,2266.0,109.0,
8,14322.0,1373.0,4122.0,183.0,
9,10423.0,2753.0,6502.0,322.0,
10,5420.0,4357.0,9456.0,767.0,
11,2401.0,6551.0,9650.0,1398.0,
12,520.0,8837.0,8287.0,2356.0,
13,108.0,10203.0,6589.0,3100.0,
14,9.0,10272.0,4949.0,4770.0,
15,0.0,9860.0,3248.0,6892.0,
16,0.0,9177.0,2563.0,8260.0,
17,0.0,8406.0,1837.0,9757.0,
18,0.0,6884.0,1210.0,11906.0,
19,0.0,5988.0,966.0,13046.0,
20,0.0,5815.0,605.0,13580.0,
21,3.0,5530.0,235.0,14232.0,
22,1.0,4801.0,186.0,15012.0,
23,15.0,4428.0,115.0,15442.0,
24,9.0,4273.0,16.0,15702.0,
25,9.0,3715.0,2.0,16274.0,
26,9.0,3353.0,0.0,16638.0,
27,68.0,2765.0,3.0,17164.0,
28,208.0,2409.0,45.0,17338.0,
29,129.0,2324.0,117.0,17430.0,
30,196.0,2292.0,21.0,17491.0,
31,183.0,2092.0,31.0,17694.0,
32,219.0,1963.0,29.0,17789.0,
33,228.0,1813.0,76.0,17883.0,
34,230.0,1533.0,39.0,18198.0,
35,217.0,1266.0,35.0,18482.0,
36,213.0,1198.0,26.0,18563.0,
37,149.0,940.0,72.0,18839.0,
38,248.0,709.0,69.0,18974.0,
39,287.0,725.0,67.0,18921.0,
40,289.0,690.0,76.0,18945.0,
41,325.0,600.0,55.0,19020.0,
42,388.0,518.0,63.0,19031.0,
43,591.0,279.0,70.0,19060.0,
44,669.0,201.0,62.0,19068.0,
45,756.0,236.0,4.0,19004.0,
46,797.0,226.0,14.0,18963.0,
47,927.0,214.0,16.0,18843.0,
48,956.0,221.0,21.0,18802.0,
49,1177.0,125.0,29.0,18669.0,
50,1204.0,126.0,35.0,18635.0,
51,1335.0,114.0,15.0,18536.0,
52,1439.0,66.0,28.0,18467.0,
53,1430.0,79.0,36.0,18455.0,
54,1434.0,91.0,31.0,18444.0,
55,1448.0,103.0,15.0,18434.0,
56,1438.0,109.0,12.0,18441.0,
57,1432.0,110.0,25.0,18433.0,
58,1428.0,84.0,32.0,18456.0,
59,1467.0,104.0,33.0,18396.0,
60,1451.0,106.0,29.0,18414.0,
61,1461.0,84.0,43.0,18412.0,
62,1455.0,93.0,39.0,18413.0,
63,1453.0,99.0,27.0,18421.0,
64,1435.0,95.0,30.0,18440.0,
65,1421.0,94.0,45.0,18440.0,
66,1412.0,92.0,53.0,18443.0,
67,1395.0,121.0,26.0,18458.0,
68,1370.0,110.0,55.0,18465.0,
69,1393.0,117.0,53.0,18437.0,
70,1478.0,139.0,41.0,18342.0,
71,1624.0,142.0,48.0,18186.0,
72,1695.0,118.0,43.0,18144.0,
73,1756.0,128.0,41.0,18075.0,
74,1841.0,120.0,58.0,17981.0,
75,1783.0,152.0,77.0,17988.0,
76,1806.0,178.0,106.0,17910.0,
77,1779.0,188.0,94.0,17939.0,
78,1732.0,229.0,127.0,17912.0,
79,1667.0,254.0,152.0,17927.0,
80,1610.0,273.0,209.0,17908.0,
81,1658.0,296.0,192.0,17854.0,
82,1637.0,362.0,157.0,17844.0,
83,1665.0,391.0,155.0,17789.0,
84,1619.0,354.0,162.0,17865.0,
85,1584.0,354.0,152.0,17910.0,
86,1449.0,405.0,220.0,17926.0,
87,1400.0,449.0,166.0,17985.0,
88,1300.0,446.0,223.0,18031.0,
89,1246.0,538.0,174.0,18042.0,
90,1152.0,465.0,233.0,18150.0,
91,1084.0,459.0,240.0,18217.0,
92,1068.0,481.0,164.0,18287.0,
93,1003.0,451.0,223.0,18323.0,
94,960.0,465.0,219.0,18356.0,
95,945.0,533.0,141.0,18381.0,
96,892.0,571.0,152.0,18385.0,
97,832.0,526.0,166.0,18476.0,
98,812.0,412.0,187.0,18589.0,
99,782.0,434.0,132.0,18652.0,
100,780.0,395.0,118.0,18707.0,
101,788.0,339.0,136.0,18737.0,
102,783.0,344.0,127.0,18746.0,
103,765.0,341.0,108.0,18786.0,
104,752.0,326.0,69.0,18853.0,
105,739.0,324.0,54.0,18883.0,
106,931.0,304.0,43.0,18722.0,
107,1017.0,262.0,54.0,18667.0,
108,1148.0,266.0,68.0,18518.0,
109,1382.0,231.0,67.0,18320.0,
110,1550.0,223.0,86.0,18141.0,
111,1583.0,219.0,106.0,18092.0,
112,1561.0,236.0,136.0,18067.0,
113,1513.0,307.0,186.0,17994.0,
114,1480.0,376.0,200.0,17944.0,
115,1419.0,476.0,149.0,17956.0,
116,1363.0,537.0,174.0,17926.0,
117,1357.0,593.0,138.0,17912.0,
118,1344.0,557.0,207.0,17892.0,
119,1377.0,643.0,167.0,17813.0,
120,1350.0,623.0,207.0,17820.0,
121,1669.0,722.0,176.0,17433.0,
122,1751.0,699.0,300.0,17250.0,
123,1728.0,726.0,356.0,17190.0,
124,1632.0,846.0,404.0,17118.0,
125,1702.0,915.0,523.0,16860.0,
126,1461.0,920.0,792.0,16827.0,
127,1257.0,1071.0,856.0,16816.0,
128,1165.0,1287.0,707.0,16841.0,
129,1153.0,1321.0,599.0,16927.0,
130,997.0,1490.0,577.0,16936.0,
131,918.0,1391.0,749.0,16942.0,
132,921.0,1441.0,685.0,16953.0,
133,859.0,1579.0,536.0,17026.0,
134,820.0,1537.0,511.0,17132.0,
135,565.0,1576.0,650.0,17209.0,
136,455.0,1712.0,541.0,17292.0,
137,389.0,1752.0,492.0,17367.0,
138,356.0,1788.0,433.0,17423.0,
139,277.0,1745.0,408.0,17570.0,
140,252.0,1636.0,354.0,17758.0,
141,213.0,1550.0,362.0,17875.0,
142,190.0,1477.0,311.0,18022.0,
143,219.0,1370.0,204.0,18207.0,
144,234.0,1263.0,180.0,18323.0,
145,314.0,1208.0,153.0,18325.0,
146,387.0,1222.0,125.0,18266.0,
147,424.0,1127.0,104.0,18345.0,
148,470.0,1057.0,144.0,18329.0,
149,499.0,1042.0,164.0,18295.0,
150,538.0,1011.0,133.0,18318.0,
151,525.0,1017.0,102.0,18356.0,
152,607.0,980.0,152.0,18261.0,
153,609.0,928.0,134.0,18329.0,
154,612.0,911.0,192.0,18285.0,
155,636.0,817.0,228.0,18319.0,
156,710.0,858.0,212.0,18220.0,
157,846.0,821.0,175.0,18158.0,
158,893.0,667.0,201.0,18239.0,
159,1009.0,648.0,202.0,18141.0,
160,1086.0,673.0,239.0,18002.0,
161,1088.0,701.0,245.0,17966.0,
162,1066.0,727.0,258.0,17949.0,
163,1036.0,728.0,312.0,17924.0,
164,994.0,595.0,411.0,18000.0,
165,932.0,595.0,412.0,18061.0,
166,934.0,595.0,418.0,18053.0,
167,912.0,592.0,392.0,18104.0,
168,872.0,572.0,379.0,18177.0,
169,891.0,598.0,320.0,18191.0,
170,854.0,592.0,359.0,18195.0,
171,830.0,588.0,354.0,18228.0,
172,854.0,549.0,332.0,18265.0,
173,819.0,523.0,277.0,18381.0,
174,835.0,479.0,263.0,18423.0,
175,859.0,375.0,299.0,18467.0,
176,855.0,429.0,249.0,18467.0,
177,844.0,450.0,212.0,18494.0,
178,855.0,488.0,189.0,18468.0,
179,853.0,488.0,220.0,18439.0,
180,840.0,533.0,221.0,18406.0,
181,797.0,588.0,196.0,18419.0,
182,748.0,589.0,212.0,18451.0,
183,721.0,571.0,208.0,18500.0,
184,706.0,615.0,169.0,18510.0,
185,689.0,688.0,119.0,18504.0,
186,668.0,627.0,149.0,18556.0,
187,676.0,613.0,132.0,18579.0,
188,687.0,498.0,185.0,18630.0,
189,711.0,523.0,119.0,18647.0,
190,784.0,496.0,100.0,18620.0,
191,828.0,475.0,106.0,18591.0,
192,954.0,461.0,145.0,18440.0,
193,935.0,438.0,158.0,18469.0,
194,1030.0,443.0,124.0,18403.0,
195,1144.0,392.0,117.0,18347.0,
196,1208.0,369.0,190.0,18233.0,
197,1145.0,405.0,249.0,18201.0,
198,1141.0,432.0,215.0,18212.0,
199,1145.0,423.0,232.0,18200.0,
200,1277.0,474.0,161.0,18088.0,
201,1273.0,451.0,193.0,18083.0,
202,1309.0,409.0,246.0,18036.0,
203,1300.0,426.0,206.0,18068.0,
204,1267.0,430.0,246.0,18057.0,
205,1337.0,436.0,263.0,17964.0,
206,1283.0,403.0,286.0,18028.0,
207,1234.0,391.0,316.0,18059.0,
208,1174.0,439.0,315.0,18072.0,
209,1148.0,442.0,332.0,18078.0,
210,1164.0,446.0,358.0,18032.0,
211,1180.0,521.0,229.0,18070.0,
212,1125.0,563.0,267.0,18045.0,
213,1103.0,568.0,271.0,18058.0,
214,1068.0,559.0,296.0,18077.0,
215,1022.0,601.0,258.0,18119.0,
216,1025.0,609.0,265.0,18101.0,
217,1024.0,573.0,236.0,18167.0,
218,1011.0,564.0,250.0,18175.0,
219,1005.0,589.0,219.0,18187.0,
220,1022.0,597.0,254.0,18127.0,
221,1039.0,546.0,268.0,18147.0,
222,1085.0,483.0,278.0,18154.0,
223,1127.0,548.0,245.0,18080.0,
224,1159.0,605.0,200.0,18036.0,
225,1164.0,614.0,199.0,18023.0,
226,1138.0,605.0,224.0,18033.0,
227,1094.0,686.0,251.0,17969.0,
228,1071.0,736.0,242.0,17951.0,
229,1038.0,757.0,232.0,17973.0,
230,1022.0,738.0,267.0,17973.0,
231,994.0,760.0,274.0,17972.0,
232,992.0,790.0,341.0,17877.0,
233,976.0,867.0,273.0,17884.0,
234,965.0,864.0,302.0,17869.0,
235,990.0,952.0,257.0,17801.0,
236,912.0,1035.0,298.0,17755.0,
237,952.0,1069.0,347.0,17632.0,
238,932.0,1062.0,391.0,17615.0,
239,963.0,1069.0,452.0,17516.0,
240,968.0,1121.0,498.0,17413.0,
241,920.0,1067.0,534.0,17479.0,
242,944.0,1144.0,536.0,17376.0,
243,870.0,1194.0,534.0,17402.0,
244,811.0,1245.0,518.0,17426.0,
245,779.0,1309.0,434.0,17478.0,
246,743.0,1368.0,331.0,17558.0,
247,707.0,1209.0,363.0,17721.0,
248,788.0,1203.0,378.0,17631.0,
249,804.0,1143.0,465.0,17588.0,
250,823.0,1152.0,442.0,17583.0,
251,779.0,1259.0,408.0,17554.0,
252,760.0,1253.0,412.0,17575.0,
253,764.0,1220.0,428.0,17588.0,
254,687.0,1223.0,535.0,17555.0,
255,695.0,1266.0,383.0,17656.0,
256,784.0,1210.0,392.0,17614.0,
257,821.0,1185.0,437.0,17557.0,
258,845.0,1146.0,470.0,17539.0,
259,760.0,1242.0,450.0,17548.0,
260,716.0,1330.0,454.0,17500.0,
261,690.0,1288.0,529.0,17493.0,
262,680.0,1418.0,478.0,17424.0,
263,735.0,1384.0,386.0,17495.0,
264,699.0,1418.0,351.0,17532.0,
265,570.0,1378.0,390.0,17662.0,
266,498.0,1485.0,293.0,17724.0,
267,452.0,1508.0,215.0,17825.0,
268,435.0,1459.0,201.0,17905.0,
269,412.0,1357.0,177.0,18054.0,
270,406.0,1330.0,138.0,18126.0,
271,400.0,1281.0,142.0,18177.0,
272,402.0,1243.0,108.0,18247.0,
273,382.0,1233.0,110.0,18275.0,
274,382.0,1140.0,123.0,18355.0,
275,391.0,1126.0,138.0,18345.0,
276,402.0,1071.0,143.0,18384.0,
277,400.0,1049.0,118.0,18433.0,
278,383.0,1037.0,103.0,18477.0,
279,389.0,1041.0,105.0,18465.0,
280,390.0,971.0,109.0,18530.0,
281,402.0,953.0,113.0,18532.0,
282,412.0,926.0,90.0,18572.0,
283,413.0,840.0,97.0,18650.0,
284,442.0,785.0,131.0,18642.0,
285,468.0,695.0,93.0,18744.0,
286,491.0,678.0,89.0,18742.0,
287,555.0,544.0,98.0,18803.0,
288,795.0,441.0,97.0,18667.0,
289,870.0,370.0,126.0,18634.0,
290,911.0,320.0,120.0,18649.0,
291,951.0,302.0,99.0,18648.0,
292,1033.0,265.0,131.0,18571.0,
293,1045.0,249.0,160.0,18546.0,
294,1080.0,295.0,122.0,18503.0,
295,1095.0,295.0,102.0,18508.0,
296,1099.0,282.0,176.0,18443.0,
297,1149.0,234.0,177.0,18440.0,
298,1188.0,280.0,138.0,18394.0,
299,1180.0,281.0,162.0,18377.0,
300,1196.0,266.0,149.0,18389.0,
301,1210.0,302.0,121.0,18367.0,
302,1247.0,270.0,172.0,18311.0,
303,1306.0,255.0,167.0,18272.0,
304,1346.0,270.0,163.0,18221.0,
305,1440.0,274.0,132.0,18154.0,
306,1638.0,291.0,152.0,17919.0,
307,1665.0,297.0,130.0,17908.0,
308,1754.0,286.0,138.0,17822.0,
309,1882.0,294.0,193.0,17631.0,
310,1859.0,318.0,213.0,17610.0,
311,1832.0,382.0,204.0,17582.0,
312,2004.0,410.0,239.0,17347.0,
313,1979.0,435.0,343.0,17243.0,
314,1962.0,548.0,348.0,17142.0,
315,2032.0,633.0,344.0,16991.0,
316,1946.0,650.0,441.0,16963.0,
317,1794.0,677.0,602.0,16927.0,
318,1786.0,770.0,518.0,16926.0,
319,1495.0,929.0,674.0,16902.0,
320,1331.0,1103.0,667.0,16899.0,
321,1208.0,1121.0,728.0,16943.0,
322,1091.0,1268.0,692.0,16949.0,
323,947.0,1266.0,727.0,17060.0,
324,861.0,1289.0,661.0,17189.0,
325,785.0,1309.0,696.0,17210.0,
326,739.0,1402.0,579.0,17280.0,
327,682.0,1416.0,500.0,17402.0,
328,616.0,1325.0,466.0,17593.0,
329,602.0,1372.0,383.0,17643.0,
330,599.0,1413.0,283.0,17705.0,
331,557.0,1241.0,432.0,17770.0,
332,537.0,1292.0,322.0,17849.0,
333,584.0,1304.0,264.0,17848.0,
334,572.0,1230.0,259.0,17939.0,
335,689.0,1198.0,237.0,17876.0,
336,710.0,1121.0,234.0,17935.0,
337,710.0,1092.0,242.0,17956.0,
338,766.0,1042.0,225.0,17967.0,
339,811.0,1020.0,188.0,17981.0,
340,755.0,925.0,283.0,18037.0,
341,749.0,954.0,255.0,18042.0,
342,797.0,916.0,343.0,17944.0,
343,744.0,951.0,333.0,17972.0,
344,708.0,1064.0,268.0,17960.0,
345,654.0,1128.0,236.0,17982.0,
346,629.0,1223.0,232.0,17916.0,
347,688.0,1240.0,203.0,17869.0,
348,667.0,1212.0,234.0,17887.0,
349,675.0,1146.0,213.0,17966.0,
350,722.0,1148.0,262.0,17868.0,
351,745.0,1040.0,276.0,17939.0,
352,872.0,1046.0,300.0,17782.0,
353,947.0,1054.0,296.0,17703.0,
354,964.0,945.0,401.0,17690.0,
355,940.0,972.0,398.0,17690.0,
356,945.0,1066.0,320.0,17669.0,
357,967.0,1007.0,429.0,17597.0,
358,964.0,1016.0,419.0,17601.0,
359,972.0,1074.0,385.0,17569.0,
360,954.0,1075.0,321.0,17650.0,
361,983.0,1050.0,419.0,17548.0,
362,995.0,953.0,508.0,17544.0,
363,924.0,969.0,502.0,17605.0,
364,1027.0,1113.0,427.0,17433.0,
365,985.0,1191.0,463.0,17361.0,
366,910.0,1225.0,487.0,17378.0,
367,892.0,1248.0,418.0,17442.0,
368,850.0,1149.0,457.0,17544.0,
369,837.0,1108.0,460.0,17595.0,
370,745.0,1047.0,509.0,17699.0,
371,738.0,1044.0,471.0,17747.0,
372,728.0,1048.0,459.0,17765.0,
373,726.0,1024.0,506.0,17744.0,
374,823.0,965.0,542.0,17670.0,
375,838.0,974.0,496.0,17692.0,
376,842.0,915.0,475.0,17768.0,
377,885.0,880.0,524.0,17711.0,
378,937.0,894.0,472.0,17697.0,
379,923.0,848.0,471.0,17758.0,
380,972.0,922.0,426.0,17680.0,
381,1038.0,865.0,516.0,17581.0,
382,1024.0,917.0,599.0,17460.0,
383,1055.0,909.0,680.0,17356.0,
384,1084.0,1004.0,666.0,17246.0,
385,1049.0,1186.0,575.0,17190.0,
386,974.0,1275.0,571.0,17180.0,
387,1048.0,1380.0,519.0,17053.0,
388,926.0,1477.0,572.0,17025.0,
389,785.0,1710.0,482.0,17023.0,
390,731.0,1743.0,394.0,17132.0,
391,827.0,1639.0,461.0,17073.0,
392,790.0,1487.0,381.0,17342.0,
393,831.0,1362.0,281.0,17526.0,
394,862.0,1271.0,309.0,17558.0,
395,779.0,1225.0,359.0,17637.0,
396,775.0,1147.0,395.0,17683.0,
397,734.0,1095.0,399.0,17772.0,
398,755.0,1004.0,406.0,17835.0,
399,832.0,849.0,415.0,17904.0,
400,871.0,766.0,428.0,17935.0,
401,994.0,850.0,307.0,17849.0,
402,1030.0,850.0,309.0,17811.0,
403,1029.0,889.0,347.0,17735.0,
404,1073.0,886.0,345.0,17696.0,
405,1022.0,857.0,361.0,17760.0,
406,984.0,903.0,338.0,17775.0,
407,981.0,867.0,368.0,17784.0,
408,935.0,708.0,408.0,17949.0,
409,966.0,759.0,353.0,17922.0,
410,966.0,749.0,376.0,17909.0,
411,958.0,659.0,341.0,18042.0,
412,985.0,627.0,316.0,18072.0,
413,1043.0,577.0,299.0,18081.0,
414,1054.0,637.0,237.0,18072.0,
415,1059.0,617.0,241.0,18083.0,
416,1018.0,567.0,276.0,18139.0,
417,960.0,592.0,249.0,18199.0,
418,951.0,637.0,223.0,18189.0,
419,929.0,600.0,254.0,18217.0,
420,911.0,564.0,302.0,18223.0,
421,882.0,564.0,341.0,18213.0,
422,882.0,542.0,331.0,18245.0,
423,880.0,515.0,319.0,18286.0,
424,890.0,504.0,299.0,18307.0,
425,933.0,557.0,236.0,18274.0,
426,984.0,583.0,190.0,18243.0,
427,1033.0,547.0,187.0,18233.0,
428,1114.0,540.0,181.0,18165.0,
429,1087.0,591.0,162.0,18160.0,
430,1059.0,591.0,232.0,18118.0,
431,1163.0,596.0,207.0,18034.0,
432,1173.0,541.0,205.0,18081.0,
433,1185.0,589.0,286.0,17940.0,
434,1192.0,621.0,284.0,17903.0,
435,1226.0,642.0,212.0,17920.0,
436,1218.0,651.0,209.0,17922.0,
437,1206.0,644.0,228.0,17922.0,
438,1201.0,631.0,187.0,17981.0,
439,1145.0,645.0,253.0,17957.0,
440,1118.0,676.0,278.0,17928.0,
441,1085.0,680.0,265.0,17970.0,
442,1050.0,777.0,211.0,17962.0,
443,1054.0,726.0,268.0,17952.0,
444,1039.0,732.0,259.0,17970.0,
445,1056.0,761.0,273.0,17910.0,
446,1007.0,832.0,310.0,17851.0,
447,992.0,836.0,323.0,17849.0,
448,935.0,917.0,272.0,17876.0,
449,915.0,963.0,265.0,17857.0,
450,873.0,987.0,258.0,17882.0,
451,978.0,974.0,251.0,17797.0,
452,994.0,975.0,234.0,17797.0,
453,867.0,961.0,275.0,17897.0,
454,855.0,1014.0,227.0,17904.0,
455,834.0,1019.0,197.0,17950.0,
456,858.0,987.0,222.0,17933.0,
457,959.0,974.0,286.0,17781.0,
458,937.0,996.0,307.0,17760.0,
459,1104.0,1001.0,330.0,17565.0,
460,1059.0,954.0,405.0,17582.0,
461,1008.0,973.0,492.0,17527.0,
462,962.0,996.0,527.0,17515.0,
463,937.0,1095.0,535.0,17433.0,
464,965.0,1061.0,425.0,17549.0,
465,997.0,984.0,420.0,17599.0,
466,1018.0,975.0,498.0,17509.0,
467,1051.0,936.0,556.0,17457.0,
468,1045.0,973.0,595.0,17387.0,
469,1074.0,1055.0,643.0,17228.0,
470,1108.0,1145.0,624.0,17123.0,
471,1125.0,1169.0,580.0,17126.0,
472,1227.0,1144.0,601.0,17028.0,
473,1222.0,1130.0,754.0,16894.0,
474,1153.0,1232.0,798.0,16817.0,
475,1135.0,1337.0,707.0,16821.0,
476,1057.0,1367.0,710.0,16866.0,
477,953.0,1493.0,676.0,16878.0,
478,739.0,1576.0,751.0,16934.0,
479,680.0,1470.0,731.0,17119.0,
480,628.0,1663.0,543.0,17166.0,
481,565.0,1731.0,538.0,17166.0,
482,536.0,1602.0,462.0,17400.0,
483,512.0,1549.0,365.0,17574.0,
484,509.0,1363.0,363.0,17765.0,
485,511.0,1309.0,365.0,17815.0,
486,507.0,1262.0,346.0,17885.0,
487,499.0,1126.0,346.0,18029.0,
488,507.0,1123.0,374.0,17996.0,
489,547.0,1042.0,353.0,18058.0,
490,572.0,1060.0,371.0,17997.0,
491,622.0,1020.0,295.0,18063.0,
492,618.0,972.0,355.0,18055.0,
493,603.0,910.0,379.0,18108.0,
494,595.0,930.0,372.0,18103.0,
495,664.0,970.0,321.0,18045.0,
496,658.0,984.0,314.0,18044.0,
497,655.0,987.0,326.0,18032.0,
498,654.0,941.0,327.0,18078.0,
499,655.0,903.0,312.0,18130.0,
500,669.0,927.0,314.0,18090.0,
501,672.0,926.0,265.0,18137.0,
502,666.0,902.0,298.0,18134.0,
503,679.0,956.0,260.0,18105.0,
504,698.0,929.0,264.0,18109.0,
505,732.0,946.0,243.0,18079.0,
506,704.0,925.0,286.0,18085.0,
507,794.0,922.0,301.0,17983.0,
508,788.0,1002.0,263.0,17947.0,
509,778.0,984.0,237.0,18001.0,
510,947.0,965.0,260.0,17828.0,
511,911.0,949.0,353.0,17787.0,
512,931.0,984.0,348.0,17737.0,
513,922.0,1059.0,230.0,17789.0,
514,936.0,1074.0,201.0,17789.0,
515,975.0,1004.0,176.0,17845.0,
516,986.0,926.0,182.0,17906.0,
517,961.0,889.0,229.0,17921.0,
518,995.0,808.0,296.0,17901.0,
519,979.0,862.0,327.0,17832.0,
520,930.0,933.0,339.0,17798.0,
521,877.0,965.0,308.0,17850.0,
522,814.0,953.0,327.0,17906.0,
523,769.0,1041.0,261.0,17929.0,
524,747.0,949.0,209.0,18095.0,
525,732.0,931.0,212.0,18125.0,
526,684.0,892.0,229.0,18195.0,
527,692.0,911.0,158.0,18239.0,
528,677.0,853.0,150.0,18320.0,
529,661.0,802.0,182.0,18355.0,
530,652.0,767.0,170.0,18411.0,
531,665.0,759.0,174.0,18402.0,
532,686.0,782.0,158.0,18374.0,
533,705.0,803.0,150.0,18342.0,
534,703.0,824.0,197.0,18276.0,
535,678.0,832.0,190.0,18300.0,
536,686.0,798.0,260.0,18256.0,
537,695.0,843.0,182.0,18280.0,
538,678.0,857.0,172.0,18293.0,
539,683.0,829.0,175.0,18313.0,
540,689.0,810.0,224.0,18277.0,
541,693.0,867.0,174.0,18266.0,
542,714.0,824.0,133.0,18329.0,
543,712.0,810.0,119.0,18359.0,
544,742.0,731.0,119.0,18408.0,
545,872.0,692.0,118.0,18318.0,
546,1003.0,663.0,174.0,18160.0,
547,1071.0,649.0,184.0,18096.0,
548,1182.0,639.0,240.0,17939.0,
549,1109.0,698.0,324.0,17869.0,
550,1106.0,773.0,305.0,17816.0,
551,1065.0,783.0,293.0,17859.0,
552,959.0,817.0,359.0,17865.0,
553,931.0,914.0,289.0,17866.0,
554,851.0,969.0,343.0,17837.0,
555,774.0,1060.0,296.0,17870.0,
556,719.0,1013.0,352.0,17916.0,
557,696.0,1037.0,281.0,17986.0,
558,662.0,1019.0,291.0,18028.0,
559,641.0,1000.0,283.0,18076.0,
560,602.0,1065.0,234.0,18099.0,
561,588.0,980.0,221.0,18211.0,
562,564.0,932.0,228.0,18276.0,
563,570.0,892.0,165.0,18373.0,
564,564.0,925.0,104.0,18407.0,
565,602.0,842.0,114.0,18442.0,
566,614.0,799.0,103.0,18484.0,
567,645.0,703.0,124.0,18528.0,
568,663.0,673.0,132.0,18532.0,
569,715.0,620.0,127.0,18538.0,
570,755.0,614.0,155.0,18476.0,
571,791.0,642.0,175.0,18392.0,
572,864.0,654.0,173.0,18309.0,
573,889.0,656.0,209.0,18246.0,
574,922.0,649.0,210.0,18219.0,
575,985.0,633.0,184.0,18198.0,
576,1015.0,618.0,177.0,18190.0,
577,1058.0,590.0,197.0,18155.0,
578,1186.0,608.0,234.0,17972.0,
579,1215.0,606.0,219.0,17960.0,
580,1448.0,566.0,353.0,17633.0,
581,1522.0,597.0,300.0,17581.0,
582,1647.0,611.0,276.0,17466.0,
583,1763.0,564.0,351.0,17322.0,
584,1823.0,612.0,384.0,17181.0,
585,1822.0,658.0,411.0,17109.0,
586,1837.0,659.0,448.0,17056.0,
587,1796.0,707.0,394.0,17103.0,
588,1824.0,666.0,406.0,17104.0,
589,1865.0,603.0,505.0,17027.0,
590,1897.0,651.0,601.0,16851.0,
591,1913.0,770.0,528.0,16789.0,
592,1987.0,769.0,586.0,16658.0,
593,1846.0,849.0,680.0,16625.0,
594,1676.0,899.0,740.0,16685.0,
595,1585.0,1081.0,698.0,16636.0,
596,1504.0,1206.0,646.0,16644.0,
597,1433.0,1244.0,657.0,16666.0,
598,1321.0,1312.0,668.0,16699.0,
599,1211.0,1323.0,668.0,16798.0,
600,1098.0,1322.0,754.0,16826.0,
601,1053.0,1279.0,771.0,16897.0,
602,961.0,1334.0,687.0,17018.0,
603,921.0,1394.0,583.0,17102.0,
604,933.0,1391.0,616.0,17060.0,
605,929.0,1348.0,590.0,17133.0,
606,844.0,1331.0,577.0,17248.0,
607,885.0,1304.0,502.0,17309.0,
608,878.0,1374.0,545.0,17203.0,
609,853.0,1278.0,531.0,17338.0,
610,865.0,1301.0,414.0,17420.0,
611,982.0,1303.0,452.0,17263.0,
612,1030.0,1277.0,464.0,17229.0,
613,1063.0,1215.0,414.0,17308.0,
614,1036.0,1092.0,444.0,17428.0,
615,1085.0,1058.0,555.0,17302.0,
616,1030.0,1069.0,560.0,17341.0,
617,1156.0,1035.0,584.0,17225.0,
618,1204.0,1042.0,533.0,17221.0,
619,1194.0,1074.0,565.0,17167.0,
620,1168.0,1061.0,655.0,17116.0,
621,1062.0,1060.0,772.0,17106.0,
622,1049.0,1050.0,756.0,17145.0,
623,1014.0,1114.0,726.0,17146.0,
624,1045.0,1309.0,612.0,17034.0,
625,1008.0,1352.0,634.0,17006.0,
626,985.0,1350.0,607.0,17058.0,
627,975.0,1429.0,640.0,16956.0,
628,897.0,1501.0,688.0,16914.0,
629,864.0,1523.0,635.0,16978.0,
630,759.0,1530.0,681.0,17030.0,
631,692.0,1656.0,576.0,17076.0,
632,628.0,1630.0,576.0,17166.0,
633,633.0,1582.0,578.0,17207.0,
634,575.0,1684.0,544.0,17197.0,
635,526.0,1686.0,491.0,17297.0,
636,551.0,1573.0,492.0,17384.0,
637,599.0,1596.0,477.0,17328.0,
638,613.0,1542.0,518.0,17327.0,
639,624.0,1478.0,578.0,17320.0,
640,691.0,1471.0,516.0,17322.0,
641,620.0,1489.0,505.0,17386.0,
642,629.0,1306.0,480.0,17585.0,
643,581.0,1318.0,401.0,17700.0,
644,554.0,1341.0,374.0,17731.0,
645,548.0,1198.0,326.0,17928.0,
646,554.0,1201.0,282.0,17963.0,
647,573.0,1150.0,217.0,18060.0,
648,605.0,1085.0,207.0,18103.0,
649,629.0,1052.0,225.0,18094.0,
650,645.0,1039.0,188.0,18128.0,
651,664.0,929.0,185.0,18222.0,
652,659.0,933.0,209.0,18199.0,
653,679.0,871.0,198.0,18252.0,
654,683.0,876.0,162.0,18279.0,
655,703.0,891.0,145.0,18261.0,
656,720.0,855.0,212.0,18213.0,
657,721.0,893.0,199.0,18187.0,
658,741.0,888.0,213.0,18158.0,
659,724.0,877.0,179.0,18220.0,
660,759.0,857.0,164.0,18220.0,
661,764.0,846.0,206.0,18184.0,
662,767.0,845.0,201.0,18187.0,
663,824.0,842.0,215.0,18119.0,
664,835.0,846.0,211.0,18108.0,
665,834.0,866.0,161.0,18139.0,
666,851.0,799.0,213.0,18137.0,
667,819.0,811.0,273.0,18097.0,
668,805.0,805.0,324.0,18066.0,
669,774.0,768.0,337.0,18121.0,
670,776.0,848.0,286.0,18090.0,
671,748.0,892.0,290.0,18070.0,
672,751.0,902.0,327.0,18020.0,
673,778.0,931.0,316.0,17975.0,
674,764.0,937.0,308.0,17991.0,
675,758.0,988.0,253.0,18001.0,
676,709.0,1016.0,207.0,18068.0,
677,686.0,1004.0,205.0,18105.0,
678,646.0,1002.0,247.0,18105.0,
679,625.0,917.0,257.0,18201.0,
680,594.0,897.0,218.0,18291.0,
681,577.0,827.0,213.0,18383.0,
682,581.0,771.0,214.0,18434.0,
683,588.0,813.0,157.0,18442.0,
684,621.0,790.0,184.0,18405.0,
685,672.0,774.0,177.0,18377.0,
686,690.0,721.0,152.0,18437.0,
687,702.0,666.0,164.0,18468.0,
688,786.0,649.0,174.0,18391.0,
689,822.0,649.0,149.0,18380.0,
690,863.0,545.0,231.0,18361.0,
691,902.0,493.0,231.0,18374.0,
692,990.0,507.0,222.0,18281.0,
693,992.0,468.0,234.0,18306.0,
694,1039.0,481.0,211.0,18269.0,
695,1094.0,459.0,165.0,18282.0,
696,1141.0,409.0,184.0,18266.0,
697,1203.0,412.0,179.0,18206.0,
698,1252.0,410.0,168.0,18170.0,
699,1235.0,401.0,228.0,18136.0,
700,1256.0,383.0,202.0,18159.0,
701,1267.0,408.0,182.0,18143.0,
702,1295.0,406.0,153.0,18146.0,
703,1354.0,393.0,201.0,18052.0,
704,1367.0,414.0,175.0,18044.0,
705,1440.0,449.0,183.0,17928.0,
706,1454.0,465.0,159.0,17922.0,
707,1468.0,450.0,220.0,17862.0,
708,1482.0,437.0,217.0,17864.0,
709,1563.0,461.0,216.0,17760.0,
710,1567.0,491.0,156.0,17786.0,
711,1607.0,426.0,197.0,17770.0,
712,1596.0,406.0,284.0,17714.0,
713,1580.0,474.0,302.0,17644.0,
714,1578.0,520.0,325.0,17577.0,
715,1531.0,534.0,364.0,17571.0,
716,1544.0,531.0,361.0,17564.0,
717,1582.0,617.0,326.0,17475.0,
718,1592.0,663.0,319.0,17426.0,
719,1533.0,663.0,322.0,17482.0,
720,1481.0,694.0,381.0,17444.0,
721,1513.0,771.0,371.0,17345.0,
722,1496.0,908.0,389.0,17207.0,
723,1463.0,1020.0,407.0,17110.0,
724,1334.0,1024.0,561.0,17081.0,
725,1203.0,1133.0,587.0,17077.0,
726,1159.0,1176.0,615.0,17050.0,
727,956.0,1287.0,677.0,17080.0,
728,907.0,1313.0,551.0,17229.0,
729,870.0,1251.0,554.0,17325.0,
730,797.0,1299.0,487.0,17417.0,
