jour,S,I,E,R,
0,19980.0,20.0,0.0,0.0,
1,19960.0,20.0,20.0,0.0,
2,19871.0,33.0,96.0,0.0,
3,19734.0,55.0,206.0,5.0,
4,19417.0,148.0,427.0,8.0,
5,18780.0,287.0,895.0,38.0,
6,17439.0,637.0,1828.0,96.0,
7,15271.0,1057.0,3493.0,179.0,
8,11740.0,2259.0,5636.0,365.0,
9,6657.0,3930.0,8740.0,673.0,
10,3382.0,7437.0,8089.0,1092.0,
11,581.0,8532.0,8395.0,2492.0,
12,126.0,10863.0,5740.0,3271.0,
13,102.0,11084.0,3942.0,4872.0,
14,34.0,10737.0,2970.0,6259.0,
15,90.0,9888.0,2183.0,7839.0,
16,6.0,8582.0,1615.0,9797.0,
17,32.0,7674.0,1121.0,11173.0,
18,18.0,6915.0,855.0,12212.0,
19,97.0,6474.0,499.0,12930.0,
20,37.0,6030.0,382.0,13551.0,
21,90.0,5360.0,298.0,14252.0,
22,92.0,5121.0,106.0,14681.0,
23,106.0,4336.0,79.0,15479.0,
24,52.0,3624.0,87.0,16237.0,
25,232.0,3251.0,41.0,16476.0,
26,227.0,2846.0,171.0,16756.0,
27,262.0,2447.0,109.0,17182.0,
28,244.0,2222.0,145.0,17389.0,
29,249.0,1911.0,228.0,17612.0,
30,304.0,1965.0,206.0,17525.0,
31,367.0,1853.0,147.0,17633.0,
32,417.0,1834.0,106.0,17643.0,
33,450.0,1661.0,119.0,17770.0,
34,443.0,1517.0,232.0,17808.0,
35,491.0,1590.0,232.0,17687.0,
36,447.0,1598.0,149.0,17806.0,
37,440.0,1473.0,73.0,18014.0,
38,363.0,1247.0,137.0,18253.0,
39,348.0,1139.0,194.0,18319.0,
40,317.0,1084.0,177.0,18422.0,
41,281.0,1066.0,221.0,18432.0,
42,264.0,1060.0,159.0,18517.0,
43,322.0,998.0,81.0,18599.0,
44,330.0,860.0,50.0,18760.0,
45,439.0,627.0,64.0,18870.0,
46,470.0,451.0,118.0,18961.0,
47,617.0,392.0,94.0,18897.0,
48,664.0,358.0,35.0,18943.0,
49,698.0,347.0,69.0,18886.0,
50,693.0,304.0,76.0,18927.0,
51,850.0,284.0,48.0,18818.0,
52,924.0,273.0,44.0,18759.0,
53,957.0,217.0,45.0,18781.0,
54,1081.0,234.0,41.0,18644.0,
55,1108.0,233.0,54.0,18605.0,
56,1160.0,221.0,42.0,18577.0,
57,1297.0,214.0,67.0,18422.0,
58,1416.0,230.0,97.0,18257.0,
59,1447.0,253.0,82.0,18218.0,
60,1380.0,273.0,93.0,18254.0,
61,1432.0,301.0,26.0,18241.0,
62,1445.0,255.0,76.0,18224.0,
63,1477.0,269.0,82.0,18172.0,
64,1468.0,262.0,128.0,18142.0,
65,1453.0,279.0,101.0,18167.0,
66,1472.0,281.0,92.0,18155.0,
67,1470.0,306.0,119.0,18105.0,
68,1436.0,313.0,110.0,18141.0,
69,1368.0,375.0,166.0,18091.0,
70,1362.0,353.0,172.0,18113.0,
71,1290.0,431.0,153.0,18126.0,
72,1253.0,450.0,123.0,18174.0,
73,1362.0,453.0,127.0,18058.0,
74,1330.0,482.0,139.0,18049.0,
75,1221.0,524.0,192.0,18063.0,
76,1157.0,509.0,220.0,18114.0,
77,1056.0,524.0,266.0,18154.0,
78,978.0,527.0,298.0,18197.0,
79,931.0,578.0,229.0,18262.0,
80,880.0,546.0,219.0,18355.0,
81,859.0,524.0,185.0,18432.0,
82,845.0,529.0,164.0,18462.0,
83,841.0,543.0,120.0,18496.0,
84,805.0,485.0,113.0,18597.0,
85,830.0,480.0,87.0,18603.0,
86,863.0,492.0,94.0,18551.0,
87,914.0,457.0,109.0,18520.0,
88,897.0,471.0,102.0,18530.0,
89,878.0,475.0,119.0,18528.0,
90,874.0,433.0,113.0,18580.0,
91,875.0,428.0,114.0,18583.0,
92,887.0,383.0,97.0,18633.0,
93,893.0,366.0,137.0,18604.0,
94,941.0,388.0,139.0,18532.0,
95,956.0,346.0,133.0,18565.0,
96,1035.0,360.0,88.0,18517.0,
97,1146.0,318.0,77.0,18459.0,
98,1176.0,350.0,73.0,18401.0,
99,1149.0,352.0,114.0,18385.0,
100,1171.0,328.0,139.0,18362.0,
101,1182.0,378.0,172.0,18268.0,
102,1191.0,396.0,183.0,18230.0,
103,1152.0,460.0,173.0,18215.0,
104,1129.0,461.0,156.0,18254.0,
105,1097.0,454.0,172.0,18277.0,
106,1144.0,497.0,155.0,18204.0,
107,1076.0,527.0,193.0,18204.0,
108,1047.0,535.0,212.0,18206.0,
109,1020.0,611.0,172.0,18197.0,
110,967.0,643.0,153.0,18237.0,
111,967.0,681.0,167.0,18185.0,
112,929.0,687.0,199.0,18185.0,
113,886.0,731.0,189.0,18194.0,
114,848.0,709.0,162.0,18281.0,
115,800.0,700.0,206.0,18294.0,
116,806.0,707.0,179.0,18308.0,
117,800.0,712.0,137.0,18351.0,
118,816.0,658.0,156.0,18370.0,
119,823.0,640.0,107.0,18430.0,
120,896.0,631.0,95.0,18378.0,
121,1014.0,566.0,106.0,18314.0,
122,1068.0,507.0,133.0,18292.0,
123,1081.0,519.0,102.0,18298.0,
124,1097.0,471.0,175.0,18257.0,
125,1128.0,441.0,203.0,18228.0,
126,1177.0,507.0,160.0,18156.0,
127,1164.0,560.0,156.0,18120.0,
128,1094.0,490.0,229.0,18187.0,
129,1094.0,448.0,258.0,18200.0,
130,1086.0,420.0,244.0,18250.0,
131,1050.0,446.0,285.0,18219.0,
132,1033.0,456.0,256.0,18255.0,
133,1037.0,504.0,219.0,18240.0,
134,1016.0,464.0,286.0,18234.0,
135,1058.0,494.0,255.0,18193.0,
136,1066.0,518.0,253.0,18163.0,
137,1037.0,520.0,263.0,18180.0,
138,1059.0,502.0,261.0,18178.0,
139,1202.0,500.0,262.0,18036.0,
140,1237.0,475.0,278.0,18010.0,
141,1250.0,528.0,289.0,17933.0,
142,1243.0,538.0,305.0,17914.0,
143,1323.0,560.0,301.0,17816.0,
144,1268.0,588.0,261.0,17883.0,
145,1251.0,578.0,305.0,17866.0,
146,1411.0,603.0,305.0,17681.0,
147,1340.0,712.0,350.0,17598.0,
148,1292.0,733.0,317.0,17658.0,
149,1203.0,717.0,371.0,17709.0,
150,1203.0,688.0,349.0,17760.0,
151,1177.0,645.0,391.0,17787.0,
152,1199.0,665.0,389.0,17747.0,
153,1162.0,731.0,406.0,17701.0,
154,1233.0,674.0,429.0,17664.0,
155,1259.0,755.0,415.0,17571.0,
156,1345.0,731.0,400.0,17524.0,
157,1269.0,798.0,510.0,17423.0,
158,1186.0,914.0,522.0,17378.0,
159,1125.0,1008.0,441.0,17426.0,
160,1098.0,1039.0,423.0,17440.0,
161,1085.0,1027.0,460.0,17428.0,
162,1098.0,998.0,417.0,17487.0,
163,1085.0,1030.0,407.0,17478.0,
164,1070.0,1001.0,484.0,17445.0,
165,1216.0,1039.0,449.0,17296.0,
166,1289.0,1137.0,321.0,17253.0,
167,1316.0,1137.0,349.0,17198.0,
168,1329.0,1086.0,379.0,17206.0,
169,1217.0,1175.0,422.0,17186.0,
170,1005.0,1371.0,387.0,17237.0,
171,964.0,1399.0,330.0,17307.0,
172,882.0,1387.0,300.0,17431.0,
173,885.0,1424.0,255.0,17436.0,
174,746.0,1439.0,326.0,17489.0,
175,841.0,1432.0,235.0,17492.0,
176,851.0,1308.0,224.0,17617.0,
177,931.0,1145.0,244.0,17680.0,
178,942.0,1090.0,335.0,17633.0,
179,938.0,1030.0,308.0,17724.0,
180,811.0,1135.0,313.0,17741.0,
181,777.0,1100.0,342.0,17781.0,
182,758.0,1089.0,273.0,17880.0,
183,692.0,1147.0,249.0,17912.0,
184,657.0,1121.0,297.0,17925.0,
185,682.0,1092.0,172.0,18054.0,
186,701.0,1022.0,200.0,18077.0,
187,677.0,984.0,266.0,18073.0,
188,676.0,894.0,210.0,18220.0,
189,715.0,949.0,181.0,18155.0,
190,843.0,953.0,215.0,17989.0,
191,846.0,922.0,285.0,17947.0,
192,862.0,895.0,263.0,17980.0,
193,824.0,906.0,319.0,17951.0,
194,880.0,927.0,345.0,17848.0,
195,839.0,998.0,315.0,17848.0,
196,832.0,986.0,372.0,17810.0,
197,823.0,909.0,413.0,17855.0,
198,765.0,923.0,501.0,17811.0,
199,722.0,950.0,494.0,17834.0,
200,731.0,1036.0,400.0,17833.0,
201,800.0,1039.0,342.0,17819.0,
202,780.0,945.0,374.0,17901.0,
203,752.0,959.0,334.0,17955.0,
204,746.0,930.0,336.0,17988.0,
205,753.0,964.0,220.0,18063.0,
206,698.0,941.0,271.0,18090.0,
207,686.0,939.0,254.0,18121.0,
208,681.0,929.0,246.0,18144.0,
209,667.0,843.0,203.0,18287.0,
210,622.0,858.0,216.0,18304.0,
211,644.0,843.0,156.0,18357.0,
212,656.0,811.0,195.0,18338.0,
213,677.0,722.0,184.0,18417.0,
214,777.0,736.0,164.0,18323.0,
215,828.0,718.0,130.0,18324.0,
216,844.0,693.0,134.0,18329.0,
217,931.0,658.0,125.0,18286.0,
218,973.0,611.0,136.0,18280.0,
219,1019.0,617.0,158.0,18206.0,
220,1031.0,608.0,150.0,18211.0,
221,983.0,602.0,210.0,18205.0,
222,1068.0,548.0,216.0,18168.0,
223,1115.0,535.0,247.0,18103.0,
224,1339.0,477.0,265.0,17919.0,
225,1492.0,567.0,235.0,17706.0,
226,1493.0,610.0,334.0,17563.0,
227,1458.0,694.0,318.0,17530.0,
228,1584.0,710.0,361.0,17345.0,
229,1570.0,726.0,394.0,17310.0,
230,1454.0,726.0,436.0,17384.0,
231,1415.0,803.0,381.0,17401.0,
232,1385.0,866.0,291.0,17458.0,
233,1286.0,872.0,324.0,17518.0,
234,1286.0,926.0,267.0,17521.0,
235,1182.0,983.0,312.0,17523.0,
236,1050.0,938.0,404.0,17608.0,
237,1022.0,896.0,353.0,17729.0,
238,943.0,924.0,400.0,17733.0,
239,1076.0,929.0,372.0,17623.0,
240,1064.0,1008.0,256.0,17672.0,
241,982.0,997.0,364.0,17657.0,
242,886.0,1061.0,285.0,17768.0,
243,837.0,1029.0,322.0,17812.0,
244,827.0,1004.0,283.0,17886.0,
245,825.0,914.0,283.0,17978.0,
246,826.0,964.0,325.0,17885.0,
247,850.0,1021.0,278.0,17851.0,
248,886.0,960.0,274.0,17880.0,
249,889.0,929.0,308.0,17874.0,
250,886.0,894.0,293.0,17927.0,
251,929.0,962.0,289.0,17820.0,
252,941.0,937.0,306.0,17816.0,
253,952.0,927.0,325.0,17796.0,
254,953.0,929.0,357.0,17761.0,
255,924.0,951.0,329.0,17796.0,
256,934.0,866.0,350.0,17850.0,
257,923.0,914.0,262.0,17901.0,
258,939.0,928.0,276.0,17857.0,
259,944.0,923.0,233.0,17900.0,
260,866.0,908.0,296.0,17930.0,
261,841.0,963.0,319.0,17877.0,
262,827.0,984.0,282.0,17907.0,
263,823.0,937.0,296.0,17944.0,
264,805.0,894.0,362.0,17939.0,
265,824.0,931.0,309.0,17936.0,
266,872.0,924.0,355.0,17849.0,
267,985.0,1032.0,317.0,17666.0,
268,1011.0,991.0,361.0,17637.0,
269,1035.0,1036.0,306.0,17623.0,
270,1049.0,1056.0,347.0,17548.0,
271,1078.0,1094.0,343.0,17485.0,
272,1060.0,1112.0,325.0,17503.0,
273,1011.0,1105.0,359.0,17525.0,
274,1004.0,1045.0,357.0,17594.0,
275,924.0,1027.0,384.0,17665.0,
276,959.0,1037.0,365.0,17639.0,
277,994.0,1001.0,279.0,17726.0,
278,1015.0,976.0,273.0,17736.0,
279,1115.0,966.0,233.0,17686.0,
280,1172.0,933.0,267.0,17628.0,
281,1114.0,935.0,339.0,17612.0,
282,1094.0,990.0,318.0,17598.0,
283,1049.0,947.0,376.0,17628.0,
284,1008.0,1010.0,409.0,17573.0,
285,986.0,1011.0,451.0,17552.0,
286,929.0,984.0,499.0,17588.0,
287,907.0,1001.0,519.0,17573.0,
288,887.0,1081.0,427.0,17605.0,
289,855.0,1238.0,388.0,17519.0,
290,841.0,1278.0,412.0,17469.0,
291,825.0,1273.0,431.0,17471.0,
292,766.0,1285.0,451.0,17498.0,
293,749.0,1337.0,383.0,17531.0,
294,752.0,1335.0,415.0,17498.0,
295,792.0,1285.0,455.0,17468.0,
296,823.0,1288.0,485.0,17404.0,
297,803.0,1107.0,509.0,17581.0,
298,956.0,1019.0,524.0,17501.0,
299,974.0,1073.0,442.0,17511.0,
300,906.0,1116.0,383.0,17595.0,
301,818.0,1090.0,428.0,17664.0,
302,797.0,1030.0,459.0,17714.0,
303,841.0,1073.0,394.0,17692.0,
304,837.0,1003.0,451.0,17709.0,
305,847.0,1112.0,310.0,17731.0,
306,812.0,1117.0,334.0,17737.0,
307,801.0,1117.0,343.0,17739.0,
308,783.0,1032.0,388.0,17797.0,
309,813.0,1087.0,329.0,17771.0,
310,813.0,1086.0,301.0,17800.0,
311,771.0,1039.0,304.0,17886.0,
312,776.0,908.0,279.0,18037.0,
313,808.0,920.0,248.0,18024.0,
314,796.0,919.0,277.0,18008.0,
315,802.0,915.0,195.0,18088.0,
316,785.0,825.0,199.0,18191.0,
317,781.0,756.0,230.0,18233.0,
318,785.0,749.0,196.0,18270.0,
319,883.0,719.0,245.0,18153.0,
320,897.0,749.0,240.0,18114.0,
321,975.0,724.0,186.0,18115.0,
322,1112.0,656.0,192.0,18040.0,
323,1157.0,593.0,198.0,18052.0,
324,1189.0,595.0,183.0,18033.0,
325,1329.0,625.0,164.0,17882.0,
326,1387.0,635.0,248.0,17730.0,
327,1400.0,672.0,226.0,17702.0,
328,1400.0,691.0,242.0,17667.0,
329,1503.0,773.0,198.0,17526.0,
330,1437.0,806.0,285.0,17472.0,
331,1411.0,884.0,340.0,17365.0,
332,1378.0,959.0,160.0,17503.0,
333,1346.0,953.0,211.0,17490.0,
334,1361.0,977.0,251.0,17411.0,
335,1300.0,972.0,284.0,17444.0,
336,1243.0,1091.0,239.0,17427.0,
337,1120.0,1068.0,273.0,17539.0,
338,1030.0,1075.0,300.0,17595.0,
339,902.0,1183.0,315.0,17600.0,
340,792.0,1299.0,306.0,17603.0,
341,731.0,1384.0,269.0,17616.0,
342,687.0,1445.0,264.0,17604.0,
343,657.0,1355.0,266.0,17722.0,
344,628.0,1326.0,270.0,17776.0,
345,641.0,1358.0,229.0,17772.0,
346,667.0,1310.0,244.0,17779.0,
347,710.0,1249.0,243.0,17798.0,
348,715.0,1209.0,248.0,17828.0,
349,718.0,1182.0,173.0,17927.0,
350,739.0,1098.0,234.0,17929.0,
351,763.0,1070.0,206.0,17961.0,
352,759.0,994.0,230.0,18017.0,
353,777.0,990.0,214.0,18019.0,
354,754.0,905.0,251.0,18090.0,
355,773.0,915.0,221.0,18091.0,
356,805.0,947.0,170.0,18078.0,
357,786.0,930.0,201.0,18083.0,
358,779.0,904.0,216.0,18101.0,
359,855.0,887.0,201.0,18057.0,
360,885.0,871.0,227.0,18017.0,
361,883.0,835.0,259.0,18023.0,
362,1079.0,852.0,228.0,17841.0,
363,1178.0,810.0,253.0,17759.0,
364,1215.0,841.0,252.0,17692.0,
365,1166.0,870.0,270.0,17694.0,
366,1077.0,908.0,370.0,17645.0,
367,1051.0,911.0,351.0,17687.0,
368,1006.0,959.0,387.0,17648.0,
369,952.0,1003.0,329.0,17716.0,
370,927.0,1034.0,283.0,17756.0,
371,907.0,1049.0,276.0,17768.0,
372,924.0,1015.0,272.0,17789.0,
373,919.0,1012.0,289.0,17780.0,
374,888.0,934.0,372.0,17806.0,
375,915.0,963.0,300.0,17822.0,
376,937.0,974.0,258.0,17831.0,
377,911.0,872.0,354.0,17863.0,
378,952.0,853.0,362.0,17833.0,
379,957.0,850.0,383.0,17810.0,
380,961.0,783.0,358.0,17898.0,
381,1130.0,742.0,372.0,17756.0,
382,1203.0,740.0,419.0,17638.0,
383,1247.0,742.0,366.0,17645.0,
384,1345.0,768.0,455.0,17432.0,
385,1294.0,759.0,571.0,17376.0,
386,1299.0,868.0,455.0,17378.0,
387,1180.0,887.0,460.0,17473.0,
388,1159.0,915.0,432.0,17494.0,
389,1093.0,968.0,454.0,17485.0,
390,1048.0,935.0,487.0,17530.0,
391,1012.0,915.0,463.0,17610.0,
392,1006.0,904.0,471.0,17619.0,
393,940.0,990.0,459.0,17611.0,
394,1095.0,893.0,453.0,17559.0,
395,1139.0,901.0,366.0,17594.0,
396,1075.0,829.0,424.0,17672.0,
397,1060.0,839.0,387.0,17714.0,
398,1043.0,834.0,393.0,17730.0,
399,1004.0,842.0,373.0,17781.0,
400,1016.0,730.0,381.0,17873.0,
401,1070.0,725.0,405.0,17800.0,
402,1070.0,750.0,437.0,17743.0,
403,1139.0,784.0,433.0,17644.0,
404,1133.0,882.0,321.0,17664.0,
405,1052.0,825.0,378.0,17745.0,
406,981.0,801.0,377.0,17841.0,
407,938.0,858.0,292.0,17912.0,
408,920.0,836.0,238.0,18006.0,
409,908.0,698.0,262.0,18132.0,
410,905.0,689.0,240.0,18166.0,
411,902.0,655.0,209.0,18234.0,
412,898.0,625.0,221.0,18256.0,
413,915.0,587.0,207.0,18291.0,
414,959.0,571.0,204.0,18266.0,
415,998.0,594.0,158.0,18250.0,
416,1030.0,553.0,158.0,18259.0,
417,1047.0,510.0,206.0,18237.0,
418,1070.0,545.0,198.0,18187.0,
419,1127.0,541.0,220.0,18112.0,
420,1152.0,532.0,223.0,18093.0,
421,1171.0,579.0,193.0,18057.0,
422,1263.0,592.0,218.0,17927.0,
423,1261.0,592.0,262.0,17885.0,
424,1220.0,562.0,301.0,17917.0,
425,1207.0,643.0,251.0,17899.0,
426,1206.0,629.0,274.0,17891.0,
427,1263.0,633.0,314.0,17790.0,
428,1266.0,640.0,345.0,17749.0,
429,1249.0,662.0,345.0,17744.0,
430,1209.0,677.0,367.0,17747.0,
431,1207.0,745.0,342.0,17706.0,
432,1198.0,781.0,329.0,17692.0,
433,1164.0,790.0,316.0,17730.0,
434,1162.0,782.0,361.0,17695.0,
435,1147.0,822.0,394.0,17637.0,
436,1132.0,833.0,418.0,17617.0,
437,1089.0,850.0,429.0,17632.0,
438,1046.0,887.0,442.0,17625.0,
439,1038.0,927.0,452.0,17583.0,
440,989.0,1047.0,395.0,17569.0,
441,1029.0,1043.0,352.0,17576.0,
442,1010.0,1025.0,431.0,17534.0,
443,960.0,1114.0,332.0,17594.0,
444,927.0,1112.0,366.0,17595.0,
445,949.0,1119.0,429.0,17503.0,
446,934.0,1039.0,446.0,17581.0,
447,947.0,1044.0,459.0,17550.0,
448,988.0,1102.0,463.0,17447.0,
449,1005.0,1124.0,363.0,17508.0,
450,969.0,1228.0,331.0,17472.0,
451,912.0,1229.0,318.0,17541.0,
452,933.0,1227.0,271.0,17569.0,
453,916.0,1210.0,277.0,17597.0,
454,1020.0,1150.0,341.0,17489.0,
455,1062.0,1095.0,413.0,17430.0,
456,1071.0,1094.0,500.0,17335.0,
457,1236.0,1117.0,471.0,17176.0,
458,1259.0,1113.0,489.0,17139.0,
459,1200.0,1064.0,535.0,17201.0,
460,1166.0,1143.0,518.0,17173.0,
461,1125.0,1196.0,510.0,17169.0,
462,1042.0,1238.0,524.0,17196.0,
463,966.0,1278.0,522.0,17234.0,
464,874.0,1332.0,511.0,17283.0,
465,812.0,1297.0,513.0,17378.0,
466,765.0,1316.0,471.0,17448.0,
467,736.0,1322.0,439.0,17503.0,
468,732.0,1339.0,342.0,17587.0,
469,694.0,1393.0,275.0,17638.0,
470,667.0,1279.0,370.0,17684.0,
471,714.0,1210.0,352.0,17724.0,
472,821.0,1265.0,335.0,17579.0,
473,878.0,1276.0,279.0,17567.0,
474,927.0,1214.0,271.0,17588.0,
475,1100.0,1178.0,256.0,17466.0,
476,1114.0,1176.0,264.0,17446.0,
477,1231.0,1206.0,257.0,17306.0,
478,1246.0,1218.0,341.0,17195.0,
479,1250.0,1248.0,317.0,17185.0,
480,1043.0,1310.0,486.0,17161.0,
481,964.0,1317.0,454.0,17265.0,
482,1001.0,1324.0,439.0,17236.0,
483,925.0,1376.0,353.0,17346.0,
484,917.0,1282.0,331.0,17470.0,
485,930.0,1264.0,314.0,17492.0,
486,946.0,1301.0,302.0,17451.0,
487,938.0,1295.0,327.0,17440.0,
488,927.0,1290.0,266.0,17517.0,
489,940.0,1266.0,283.0,17511.0,
490,916.0,1277.0,299.0,17508.0,
491,889.0,1208.0,270.0,17633.0,
492,910.0,1136.0,306.0,17648.0,
493,907.0,1160.0,271.0,17662.0,
494,951.0,1147.0,213.0,17689.0,
495,950.0,1044.0,269.0,17737.0,
496,1034.0,1033.0,278.0,17655.0,
497,1032.0,926.0,319.0,17723.0,
498,1083.0,944.0,348.0,17625.0,
499,1063.0,976.0,416.0,17545.0,
500,1063.0,1077.0,340.0,17520.0,
501,1086.0,1149.0,284.0,17481.0,
502,1029.0,1077.0,368.0,17526.0,
503,973.0,1186.0,330.0,17511.0,
504,1025.0,1198.0,320.0,17457.0,
505,1042.0,1200.0,370.0,17388.0,
506,1079.0,1210.0,474.0,17237.0,
507,1070.0,1255.0,374.0,17301.0,
508,970.0,1250.0,447.0,17333.0,
509,908.0,1190.0,481.0,17421.0,
510,833.0,1150.0,539.0,17478.0,
511,985.0,1161.0,544.0,17310.0,
512,1017.0,1166.0,544.0,17273.0,
513,1081.0,1158.0,602.0,17159.0,
514,1103.0,1137.0,596.0,17164.0,
515,1134.0,1115.0,616.0,17135.0,
516,1215.0,1210.0,528.0,17047.0,
517,1166.0,1213.0,560.0,17061.0,
518,1127.0,1226.0,669.0,16978.0,
519,993.0,1340.0,648.0,17019.0,
520,891.0,1405.0,677.0,17027.0,
521,896.0,1555.0,565.0,16984.0,
522,873.0,1666.0,497.0,16964.0,
523,761.0,1739.0,514.0,16986.0,
524,714.0,1738.0,531.0,17017.0,
525,678.0,1841.0,488.0,16993.0,
526,670.0,1762.0,429.0,17139.0,
527,708.0,1825.0,350.0,17117.0,
528,669.0,1710.0,412.0,17209.0,
529,631.0,1659.0,414.0,17296.0,
530,602.0,1705.0,342.0,17351.0,
531,598.0,1726.0,330.0,17346.0,
532,591.0,1693.0,336.0,17380.0,
533,592.0,1610.0,227.0,17571.0,
534,584.0,1535.0,284.0,17597.0,
535,572.0,1520.0,287.0,17621.0,
536,648.0,1510.0,270.0,17572.0,
537,730.0,1493.0,243.0,17534.0,
538,751.0,1366.0,205.0,17678.0,
539,769.0,1283.0,192.0,17756.0,
540,835.0,1189.0,249.0,17727.0,
541,844.0,1229.0,163.0,17764.0,
542,807.0,1151.0,278.0,17764.0,
543,804.0,1153.0,202.0,17841.0,
544,836.0,968.0,198.0,17998.0,
545,847.0,994.0,210.0,17949.0,
546,864.0,931.0,164.0,18041.0,
547,867.0,889.0,183.0,18061.0,
548,876.0,903.0,178.0,18043.0,
549,874.0,874.0,194.0,18058.0,
550,921.0,858.0,194.0,18027.0,
551,914.0,854.0,206.0,18026.0,
552,999.0,843.0,210.0,17948.0,
553,1013.0,828.0,276.0,17883.0,
554,993.0,847.0,311.0,17849.0,
555,975.0,862.0,288.0,17875.0,
556,957.0,785.0,353.0,17905.0,
557,967.0,738.0,336.0,17959.0,
558,963.0,746.0,343.0,17948.0,
559,974.0,759.0,313.0,17954.0,
560,947.0,754.0,381.0,17918.0,
561,931.0,824.0,347.0,17898.0,
562,934.0,887.0,311.0,17868.0,
563,910.0,898.0,328.0,17864.0,
564,904.0,957.0,288.0,17851.0,
565,880.0,982.0,270.0,17868.0,
566,878.0,953.0,292.0,17877.0,
567,869.0,948.0,268.0,17915.0,
568,856.0,900.0,308.0,17936.0,
569,879.0,849.0,315.0,17957.0,
570,887.0,799.0,334.0,17980.0,
571,923.0,779.0,369.0,17929.0,
572,932.0,779.0,332.0,17957.0,
573,933.0,784.0,292.0,17991.0,
574,932.0,762.0,294.0,18012.0,
575,990.0,733.0,340.0,17937.0,
576,1028.0,716.0,383.0,17873.0,
577,1023.0,761.0,392.0,17824.0,
578,1048.0,742.0,375.0,17835.0,
579,1063.0,803.0,325.0,17809.0,
580,1073.0,832.0,357.0,17738.0,
581,1041.0,856.0,381.0,17722.0,
582,1018.0,877.0,395.0,17710.0,
583,1056.0,888.0,368.0,17688.0,
584,1054.0,905.0,350.0,17691.0,
585,1078.0,827.0,348.0,17747.0,
586,1053.0,838.0,363.0,17746.0,
587,1055.0,802.0,323.0,17820.0,
588,1092.0,787.0,322.0,17799.0,
589,1142.0,815.0,317.0,17726.0,
590,1165.0,737.0,294.0,17804.0,
591,1192.0,705.0,284.0,17819.0,
592,1194.0,735.0,278.0,17793.0,
593,1195.0,750.0,364.0,17691.0,
594,1215.0,823.0,397.0,17565.0,
595,1181.0,784.0,432.0,17603.0,
596,1156.0,762.0,452.0,17630.0,
597,1319.0,865.0,384.0,17432.0,
598,1289.0,864.0,392.0,17455.0,
599,1275.0,945.0,355.0,17425.0,
600,1167.0,899.0,438.0,17496.0,
601,1170.0,941.0,365.0,17524.0,
602,1177.0,950.0,303.0,17570.0,
603,1224.0,962.0,307.0,17507.0,
604,1226.0,906.0,342.0,17526.0,
605,1348.0,891.0,265.0,17496.0,
606,1391.0,914.0,390.0,17305.0,
607,1332.0,1003.0,371.0,17294.0,
608,1262.0,1011.0,470.0,17257.0,
609,1229.0,1092.0,402.0,17277.0,
610,1179.0,1148.0,334.0,17339.0,
611,1157.0,1070.0,408.0,17365.0,
612,1038.0,1058.0,482.0,17422.0,
613,1005.0,1074.0,413.0,17508.0,
614,927.0,999.0,388.0,17686.0,
615,1003.0,1022.0,364.0,17611.0,
616,951.0,1019.0,371.0,17659.0,
617,1004.0,1112.0,334.0,17550.0,
618,997.0,1070.0,334.0,17599.0,
619,974.0,1066.0,349.0,17611.0,
620,894.0,996.0,411.0,17699.0,
621,893.0,912.0,451.0,17744.0,
622,899.0,863.0,387.0,17851.0,
623,893.0,822.0,357.0,17928.0,
624,876.0,791.0,409.0,17924.0,
625,839.0,738.0,400.0,18023.0,
626,872.0,766.0,344.0,18018.0,
627,915.0,751.0,370.0,17964.0,
628,955.0,714.0,394.0,17937.0,
629,964.0,716.0,369.0,17951.0,
630,1010.0,712.0,283.0,17995.0,
631,1054.0,694.0,323.0,17929.0,
632,1021.0,691.0,365.0,17923.0,
633,1083.0,710.0,350.0,17857.0,
634,1078.0,715.0,379.0,17828.0,
635,1092.0,639.0,335.0,17934.0,
636,1200.0,602.0,341.0,17857.0,
637,1231.0,619.0,369.0,17781.0,
638,1222.0,637.0,379.0,17762.0,
639,1186.0,691.0,361.0,17762.0,
640,1184.0,695.0,359.0,17762.0,
641,1166.0,704.0,346.0,17784.0,
642,1330.0,700.0,360.0,17610.0,
643,1379.0,713.0,399.0,17509.0,
644,1511.0,753.0,382.0,17354.0,
645,1604.0,794.0,374.0,17228.0,
646,1584.0,808.0,481.0,17127.0,
647,1554.0,942.0,401.0,17103.0,
648,1454.0,937.0,483.0,17126.0,
649,1296.0,1012.0,540.0,17152.0,
650,1214.0,1140.0,453.0,17193.0,
651,1116.0,1220.0,496.0,17168.0,
652,1062.0,1240.0,417.0,17281.0,
653,1112.0,1292.0,327.0,17269.0,
654,1066.0,1255.0,382.0,17297.0,
655,1055.0,1241.0,417.0,17287.0,
656,1021.0,1190.0,331.0,17458.0,
657,1047.0,1177.0,285.0,17491.0,
658,1126.0,1173.0,253.0,17448.0,
659,1216.0,1190.0,323.0,17271.0,
660,1259.0,1215.0,376.0,17150.0,
661,1208.0,1226.0,355.0,17211.0,
662,1167.0,1195.0,544.0,17094.0,
663,1122.0,1219.0,656.0,17003.0,
664,1092.0,1380.0,561.0,16967.0,
665,1082.0,1388.0,547.0,16983.0,
666,1063.0,1423.0,503.0,17011.0,
667,1043.0,1501.0,359.0,17097.0,
668,984.0,1511.0,317.0,17188.0,
669,893.0,1457.0,411.0,17239.0,
670,889.0,1453.0,336.0,17322.0,
671,905.0,1449.0,285.0,17361.0,
672,918.0,1368.0,314.0,17400.0,
673,888.0,1349.0,352.0,17411.0,
674,851.0,1340.0,367.0,17442.0,
675,853.0,1279.0,396.0,17472.0,
676,827.0,1231.0,408.0,17534.0,
677,849.0,1164.0,325.0,17662.0,
678,888.0,1183.0,241.0,17688.0,
679,854.0,1144.0,294.0,17708.0,
680,832.0,1128.0,277.0,17763.0,
681,837.0,1154.0,232.0,17777.0,
682,840.0,1115.0,268.0,17777.0,
683,808.0,1086.0,267.0,17839.0,
684,817.0,1099.0,315.0,17769.0,
685,797.0,1084.0,388.0,17731.0,
686,787.0,1129.0,353.0,17731.0,
687,803.0,1100.0,333.0,17764.0,
688,767.0,1133.0,337.0,17763.0,
689,758.0,1151.0,318.0,17773.0,
690,752.0,1095.0,334.0,17819.0,
691,752.0,1186.0,290.0,17772.0,
692,738.0,1198.0,319.0,17745.0,
693,728.0,1151.0,313.0,17808.0,
694,752.0,1213.0,270.0,17765.0,
695,777.0,1182.0,319.0,17722.0,
696,765.0,1179.0,312.0,17744.0,
697,724.0,1187.0,301.0,17788.0,
698,693.0,1233.0,241.0,17833.0,
699,679.0,1163.0,265.0,17893.0,
700,669.0,1085.0,259.0,17987.0,
701,660.0,1094.0,211.0,18035.0,
702,727.0,1078.0,186.0,18009.0,
703,782.0,1024.0,209.0,17985.0,
704,773.0,991.0,188.0,18048.0,
705,782.0,926.0,213.0,18079.0,
706,818.0,827.0,237.0,18118.0,
707,842.0,861.0,224.0,18073.0,
708,868.0,862.0,217.0,18053.0,
709,865.0,819.0,230.0,18086.0,
710,906.0,816.0,208.0,18070.0,
711,951.0,794.0,277.0,17978.0,
712,1005.0,828.0,292.0,17875.0,
713,1027.0,840.0,234.0,17899.0,
714,1079.0,859.0,265.0,17797.0,
715,1092.0,857.0,251.0,17800.0,
716,1163.0,808.0,325.0,17704.0,
717,1175.0,807.0,385.0,17633.0,
718,1222.0,885.0,359.0,17534.0,
719,1238.0,851.0,376.0,17535.0,
720,1275.0,875.0,476.0,17374.0,
721,1190.0,851.0,521.0,17438.0,
722,1126.0,866.0,607.0,17401.0,
723,1121.0,948.0,529.0,17402.0,
724,1079.0,1022.0,476.0,17423.0,
725,1036.0,1045.0,410.0,17509.0,
726,1020.0,1047.0,432.0,17501.0,
727,981.0,1066.0,432.0,17521.0,
728,990.0,976.0,441.0,17593.0,
729,980.0,979.0,407.0,17634.0,
730,943.0,1005.0,391.0,17661.0,
