jour,S,I,E,R,
0,19980.0,20.0,0.0,0.0,
1,19971.0,20.0,9.0,0.0,
2,19897.0,22.0,81.0,0.0,
3,19797.0,41.0,162.0,0.0,
4,19605.0,103.0,286.0,6.0,
5,19180.0,149.0,651.0,20.0,
6,18417.0,328.0,1222.0,33.0,
7,17197.0,646.0,2065.0,92.0,
8,15023.0,957.0,3827.0,193.0,
9,12038.0,2185.0,5456.0,321.0,
10,7782.0,2933.0,8686.0,599.0,
11,3626.0,5269.0,10189.0,916.0,
12,1490.0,8379.0,8875.0,1256.0,
13,200.0,10013.0,7570.0,2217.0,
14,37.0,10402.0,5999.0,3562.0,
15,16.0,10980.0,4313.0,4691.0,
16,1.0,10538.0,3296.0,6165.0,
17,0.0,10169.0,2449.0,7382.0,
18,0.0,9378.0,1992.0,8630.0,
19,0.0,8307.0,1465.0,10228.0,
20,0.0,7270.0,925.0,11805.0,
21,0.0,6180.0,672.0,13148.0,
22,3.0,5412.0,518.0,14067.0,
23,4.0,4639.0,377.0,14980.0,
24,12.0,3979.0,265.0,15744.0,
25,45.0,3343.0,127.0,16485.0,
26,73.0,2695.0,137.0,17095.0,
27,65.0,2376.0,32.0,17527.0,
28,84.0,1807.0,31.0,18078.0,
29,229.0,1520.0,34.0,18217.0,
30,260.0,1515.0,36.0,18189.0,
31,457.0,1276.0,43.0,18224.0,
32,555.0,1236.0,128.0,18081.0,
33,600.0,1175.0,146.0,18079.0,
34,744.0,1165.0,159.0,17932.0,
35,660.0,1040.0,234.0,18066.0,
36,669.0,1048.0,119.0,18164.0,
37,687.0,1043.0,131.0,18139.0,
38,642.0,1007.0,173.0,18178.0,
39,689.0,760.0,86.0,18465.0,
40,622.0,678.0,153.0,18547.0,
41,594.0,485.0,56.0,18865.0,
42,616.0,348.0,46.0,18990.0,
43,621.0,213.0,48.0,19118.0,
44,644.0,162.0,16.0,19178.0,
45,690.0,100.0,18.0,19192.0,
46,693.0,73.0,25.0,19209.0,
47,754.0,49.0,42.0,19155.0,
48,809.0,57.0,26.0,19108.0,
49,824.0,28.0,26.0,19122.0,
50,834.0,15.0,26.0,19125.0,
51,869.0,17.0,19.0,19095.0,
52,968.0,5.0,18.0,19009.0,
53,1018.0,4.0,16.0,18962.0,
54,1066.0,8.0,12.0,18914.0,
55,1210.0,9.0,11.0,18770.0,
56,1320.0,12.0,10.0,18658.0,
57,1320.0,16.0,6.0,18658.0,
58,1434.0,14.0,6.0,18546.0,
59,1489.0,16.0,13.0,18482.0,
60,1525.0,18.0,12.0,18445.0,
61,1558.0,18.0,7.0,18417.0,
62,1591.0,16.0,12.0,18381.0,
63,1611.0,18.0,12.0,18359.0,
64,1639.0,23.0,16.0,18322.0,
65,1683.0,27.0,20.0,18270.0,
66,1705.0,33.0,16.0,18246.0,
67,1736.0,33.0,15.0,18216.0,
68,1794.0,29.0,18.0,18159.0,
69,1803.0,22.0,24.0,18151.0,
70,1828.0,20.0,18.0,18134.0,
71,2017.0,15.0,20.0,17948.0,
72,2053.0,11.0,14.0,17922.0,
73,2148.0,11.0,15.0,17826.0,
74,2321.0,9.0,10.0,17660.0,
75,2454.0,7.0,13.0,17526.0,
76,2458.0,9.0,11.0,17522.0,
77,2550.0,11.0,10.0,17429.0,
78,2578.0,12.0,10.0,17400.0,
79,2586.0,11.0,7.0,17396.0,
80,2588.0,10.0,15.0,17387.0,
81,2602.0,12.0,15.0,17371.0,
82,2608.0,9.0,21.0,17362.0,
83,2712.0,11.0,20.0,17257.0,
84,2769.0,15.0,18.0,17198.0,
85,2940.0,17.0,22.0,17021.0,
86,3005.0,25.0,18.0,16952.0,
87,3050.0,27.0,28.0,16895.0,
88,3069.0,32.0,23.0,16876.0,
89,3091.0,28.0,44.0,16837.0,
90,3087.0,43.0,39.0,16831.0,
91,3070.0,53.0,46.0,16831.0,
92,3047.0,56.0,60.0,16837.0,
93,3030.0,71.0,56.0,16843.0,
94,2972.0,75.0,103.0,16850.0,
95,2964.0,116.0,86.0,16834.0,
96,2927.0,117.0,141.0,16815.0,
97,2905.0,155.0,140.0,16800.0,
98,2877.0,161.0,197.0,16765.0,
99,2819.0,201.0,164.0,16816.0,
100,2849.0,230.0,174.0,16747.0,
101,2755.0,234.0,222.0,16789.0,
102,2923.0,274.0,220.0,16583.0,
103,2851.0,248.0,290.0,16611.0,
104,2858.0,347.0,271.0,16524.0,
105,2708.0,367.0,304.0,16621.0,
106,2739.0,484.0,213.0,16564.0,
107,2582.0,460.0,283.0,16675.0,
108,2499.0,502.0,236.0,16763.0,
109,2343.0,458.0,310.0,16889.0,
110,2252.0,494.0,266.0,16988.0,
111,2095.0,450.0,465.0,16990.0,
112,1975.0,546.0,421.0,17058.0,
113,1899.0,544.0,501.0,17056.0,
114,1845.0,614.0,452.0,17089.0,
115,1952.0,603.0,429.0,17016.0,
116,1871.0,548.0,489.0,17092.0,
117,1865.0,567.0,529.0,17039.0,
118,1809.0,640.0,530.0,17021.0,
119,1646.0,728.0,587.0,17039.0,
120,1500.0,846.0,590.0,17064.0,
121,1421.0,852.0,583.0,17144.0,
122,1329.0,737.0,673.0,17261.0,
123,1336.0,796.0,775.0,17093.0,
124,1276.0,843.0,764.0,17117.0,
125,1315.0,872.0,791.0,17022.0,
126,1278.0,1006.0,650.0,17066.0,
127,1258.0,1032.0,685.0,17025.0,
128,1187.0,1030.0,735.0,17048.0,
129,1097.0,1016.0,776.0,17111.0,
130,1042.0,1072.0,629.0,17257.0,
131,1043.0,1175.0,598.0,17184.0,
132,915.0,1219.0,652.0,17214.0,
133,804.0,1201.0,758.0,17237.0,
134,905.0,1311.0,633.0,17151.0,
135,796.0,1419.0,608.0,17177.0,
136,775.0,1457.0,519.0,17249.0,
137,722.0,1484.0,466.0,17328.0,
138,582.0,1464.0,538.0,17416.0,
139,677.0,1557.0,369.0,17397.0,
140,649.0,1538.0,346.0,17467.0,
141,634.0,1428.0,355.0,17583.0,
142,725.0,1296.0,303.0,17676.0,
143,776.0,1243.0,239.0,17742.0,
144,855.0,1108.0,244.0,17793.0,
145,881.0,926.0,219.0,17974.0,
146,925.0,873.0,289.0,17913.0,
147,942.0,774.0,279.0,18005.0,
148,1035.0,647.0,287.0,18031.0,
149,1031.0,564.0,307.0,18098.0,
150,1028.0,503.0,272.0,18197.0,
151,1067.0,519.0,203.0,18211.0,
152,1053.0,453.0,168.0,18326.0,
153,1070.0,491.0,150.0,18289.0,
154,1075.0,536.0,114.0,18275.0,
155,1059.0,422.0,171.0,18348.0,
156,1090.0,415.0,226.0,18269.0,
157,1095.0,379.0,262.0,18264.0,
158,1104.0,431.0,224.0,18241.0,
159,1223.0,394.0,233.0,18150.0,
160,1242.0,411.0,196.0,18151.0,
161,1376.0,415.0,209.0,18000.0,
162,1396.0,440.0,158.0,18006.0,
163,1424.0,404.0,152.0,18020.0,
164,1407.0,410.0,186.0,17997.0,
165,1411.0,432.0,177.0,17980.0,
166,1399.0,411.0,251.0,17939.0,
167,1436.0,457.0,214.0,17893.0,
168,1411.0,498.0,261.0,17830.0,
169,1417.0,526.0,326.0,17731.0,
170,1375.0,543.0,309.0,17773.0,
171,1383.0,539.0,296.0,17782.0,
172,1438.0,557.0,288.0,17717.0,
173,1454.0,548.0,256.0,17742.0,
174,1504.0,543.0,261.0,17692.0,
175,1442.0,547.0,300.0,17711.0,
176,1473.0,540.0,273.0,17714.0,
177,1436.0,556.0,275.0,17733.0,
178,1420.0,585.0,270.0,17725.0,
179,1354.0,497.0,340.0,17809.0,
180,1314.0,544.0,345.0,17797.0,
181,1381.0,543.0,335.0,17741.0,
182,1497.0,505.0,334.0,17664.0,
183,1493.0,546.0,350.0,17611.0,
184,1573.0,617.0,271.0,17539.0,
185,1490.0,640.0,329.0,17541.0,
186,1459.0,676.0,386.0,17479.0,
187,1416.0,732.0,343.0,17509.0,
188,1325.0,689.0,403.0,17583.0,
189,1302.0,705.0,410.0,17583.0,
190,1327.0,722.0,359.0,17592.0,
191,1394.0,632.0,438.0,17536.0,
192,1418.0,634.0,533.0,17415.0,
193,1387.0,716.0,514.0,17383.0,
194,1469.0,767.0,540.0,17224.0,
195,1430.0,848.0,527.0,17195.0,
196,1476.0,885.0,479.0,17160.0,
197,1484.0,925.0,436.0,17155.0,
198,1390.0,973.0,531.0,17106.0,
199,1344.0,1009.0,521.0,17126.0,
200,1213.0,1112.0,507.0,17168.0,
201,1053.0,1136.0,585.0,17226.0,
202,920.0,1233.0,535.0,17312.0,
203,879.0,1327.0,406.0,17388.0,
204,841.0,1309.0,369.0,17481.0,
205,747.0,1321.0,356.0,17576.0,
206,714.0,1303.0,329.0,17654.0,
207,822.0,1271.0,285.0,17622.0,
208,808.0,1209.0,290.0,17693.0,
209,835.0,1164.0,269.0,17732.0,
210,817.0,1065.0,275.0,17843.0,
211,829.0,961.0,306.0,17904.0,
212,837.0,929.0,328.0,17906.0,
213,808.0,913.0,327.0,17952.0,
214,880.0,850.0,308.0,17962.0,
215,872.0,769.0,357.0,18002.0,
216,826.0,749.0,368.0,18057.0,
217,929.0,737.0,354.0,17980.0,
218,921.0,605.0,420.0,18054.0,
219,1027.0,570.0,402.0,18001.0,
220,1216.0,608.0,394.0,17782.0,
221,1268.0,612.0,384.0,17736.0,
222,1333.0,690.0,403.0,17574.0,
223,1266.0,711.0,508.0,17515.0,
224,1205.0,700.0,604.0,17491.0,
225,1316.0,749.0,627.0,17308.0,
226,1340.0,939.0,606.0,17115.0,
227,1245.0,904.0,670.0,17181.0,
228,1163.0,890.0,709.0,17238.0,
229,1162.0,922.0,618.0,17298.0,
230,1165.0,986.0,544.0,17305.0,
231,1111.0,1074.0,530.0,17285.0,
232,1112.0,1076.0,528.0,17284.0,
233,1088.0,1047.0,527.0,17338.0,
234,1002.0,1200.0,397.0,17401.0,
235,947.0,1150.0,404.0,17499.0,
236,858.0,991.0,466.0,17685.0,
237,827.0,1032.0,468.0,17673.0,
238,780.0,1031.0,372.0,17817.0,
239,919.0,1068.0,345.0,17668.0,
240,992.0,996.0,336.0,17676.0,
241,1118.0,970.0,363.0,17549.0,
242,1092.0,960.0,484.0,17464.0,
243,1294.0,1011.0,531.0,17164.0,
244,1383.0,1083.0,484.0,17050.0,
245,1241.0,1105.0,731.0,16923.0,
246,1217.0,1135.0,749.0,16899.0,
247,1194.0,1202.0,705.0,16899.0,
248,1161.0,1194.0,732.0,16913.0,
249,1167.0,1272.0,758.0,16803.0,
250,1155.0,1310.0,702.0,16833.0,
251,1156.0,1360.0,672.0,16812.0,
252,1251.0,1376.0,679.0,16694.0,
253,1125.0,1370.0,736.0,16769.0,
254,1052.0,1426.0,651.0,16871.0,
255,996.0,1548.0,542.0,16914.0,
256,933.0,1596.0,499.0,16972.0,
257,930.0,1665.0,456.0,16949.0,
258,830.0,1653.0,483.0,17034.0,
259,699.0,1562.0,546.0,17193.0,
260,650.0,1548.0,502.0,17300.0,
261,603.0,1584.0,412.0,17401.0,
262,583.0,1519.0,356.0,17542.0,
263,548.0,1390.0,333.0,17729.0,
264,533.0,1236.0,316.0,17915.0,
265,532.0,1126.0,242.0,18100.0,
266,545.0,1043.0,187.0,18225.0,
267,545.0,831.0,226.0,18398.0,
268,579.0,758.0,137.0,18526.0,
269,640.0,689.0,134.0,18537.0,
270,711.0,580.0,139.0,18570.0,
271,788.0,446.0,155.0,18611.0,
272,830.0,374.0,124.0,18672.0,
273,964.0,355.0,132.0,18549.0,
274,1015.0,299.0,108.0,18578.0,
275,1157.0,297.0,101.0,18445.0,
276,1207.0,267.0,107.0,18419.0,
277,1265.0,223.0,113.0,18399.0,
278,1360.0,216.0,99.0,18325.0,
279,1501.0,202.0,122.0,18175.0,
280,1605.0,210.0,87.0,18098.0,
281,1814.0,186.0,113.0,17887.0,
282,1884.0,170.0,124.0,17822.0,
283,1937.0,213.0,125.0,17725.0,
284,2001.0,226.0,121.0,17652.0,
285,2029.0,214.0,157.0,17600.0,
286,2069.0,249.0,162.0,17520.0,
287,2109.0,231.0,169.0,17491.0,
288,2188.0,263.0,175.0,17374.0,
289,2221.0,265.0,248.0,17266.0,
290,2228.0,283.0,255.0,17234.0,
291,2216.0,294.0,264.0,17226.0,
292,2182.0,264.0,335.0,17219.0,
293,2224.0,321.0,318.0,17137.0,
294,2217.0,335.0,326.0,17122.0,
295,2247.0,366.0,305.0,17082.0,
296,2202.0,388.0,337.0,17073.0,
297,2137.0,442.0,397.0,17024.0,
298,2081.0,542.0,409.0,16968.0,
299,2141.0,591.0,462.0,16806.0,
300,2068.0,637.0,417.0,16878.0,
301,1899.0,735.0,508.0,16858.0,
302,1762.0,774.0,613.0,16851.0,
303,1656.0,896.0,552.0,16896.0,
304,1442.0,886.0,712.0,16960.0,
305,1330.0,994.0,612.0,17064.0,
306,1196.0,1069.0,586.0,17149.0,
307,1100.0,977.0,607.0,17316.0,
308,1019.0,1079.0,470.0,17432.0,
309,990.0,1033.0,441.0,17536.0,
310,914.0,1014.0,458.0,17614.0,
311,810.0,1003.0,494.0,17693.0,
312,783.0,1054.0,451.0,17712.0,
313,737.0,994.0,428.0,17841.0,
314,744.0,867.0,362.0,18027.0,
315,767.0,796.0,392.0,18045.0,
316,759.0,743.0,403.0,18095.0,
317,768.0,748.0,370.0,18114.0,
318,785.0,710.0,368.0,18137.0,
319,844.0,643.0,372.0,18141.0,
320,880.0,588.0,338.0,18194.0,
321,905.0,575.0,337.0,18183.0,
322,953.0,539.0,373.0,18135.0,
323,1013.0,578.0,332.0,18077.0,
324,1069.0,525.0,370.0,18036.0,
325,1131.0,536.0,367.0,17966.0,
326,1207.0,571.0,342.0,17880.0,
327,1316.0,589.0,365.0,17730.0,
328,1337.0,583.0,373.0,17707.0,
329,1373.0,605.0,382.0,17640.0,
330,1407.0,597.0,417.0,17579.0,
331,1364.0,637.0,418.0,17581.0,
332,1336.0,631.0,414.0,17619.0,
333,1391.0,584.0,406.0,17619.0,
334,1396.0,601.0,424.0,17579.0,
335,1372.0,607.0,390.0,17631.0,
336,1360.0,607.0,431.0,17602.0,
337,1362.0,676.0,417.0,17545.0,
338,1301.0,692.0,444.0,17563.0,
339,1255.0,733.0,476.0,17536.0,
340,1244.0,799.0,469.0,17488.0,
341,1225.0,797.0,435.0,17543.0,
342,1189.0,876.0,434.0,17501.0,
343,1104.0,908.0,440.0,17548.0,
344,1009.0,995.0,454.0,17542.0,
345,971.0,1045.0,433.0,17551.0,
346,900.0,1082.0,424.0,17594.0,
347,836.0,1126.0,441.0,17597.0,
348,855.0,1169.0,361.0,17615.0,
349,837.0,1056.0,451.0,17656.0,
350,823.0,1052.0,391.0,17734.0,
351,850.0,998.0,374.0,17778.0,
352,811.0,1024.0,376.0,17789.0,
353,795.0,932.0,378.0,17895.0,
354,798.0,946.0,327.0,17929.0,
355,803.0,968.0,386.0,17843.0,
356,818.0,902.0,367.0,17913.0,
357,866.0,970.0,295.0,17869.0,
358,876.0,961.0,301.0,17862.0,
359,926.0,1011.0,323.0,17740.0,
360,890.0,1002.0,431.0,17677.0,
361,899.0,968.0,474.0,17659.0,
362,892.0,994.0,435.0,17679.0,
363,908.0,1001.0,461.0,17630.0,
364,950.0,946.0,500.0,17604.0,
365,961.0,1020.0,491.0,17528.0,
366,951.0,980.0,498.0,17571.0,
367,1013.0,954.0,540.0,17493.0,
368,1029.0,1022.0,501.0,17448.0,
369,1042.0,1111.0,457.0,17390.0,
370,1007.0,1205.0,473.0,17315.0,
371,948.0,1201.0,463.0,17388.0,
372,938.0,1127.0,504.0,17431.0,
373,929.0,1096.0,544.0,17431.0,
374,962.0,1069.0,548.0,17421.0,
375,955.0,1068.0,591.0,17386.0,
376,920.0,1124.0,592.0,17364.0,
377,837.0,1221.0,507.0,17435.0,
378,753.0,1247.0,458.0,17542.0,
379,791.0,1168.0,465.0,17576.0,
380,783.0,1128.0,463.0,17626.0,
381,801.0,1115.0,452.0,17632.0,
382,836.0,1162.0,536.0,17466.0,
383,879.0,1178.0,504.0,17439.0,
384,841.0,1084.0,558.0,17517.0,
385,940.0,1078.0,541.0,17441.0,
386,1054.0,1124.0,437.0,17385.0,
387,1076.0,1127.0,462.0,17335.0,
388,1228.0,1169.0,419.0,17184.0,
389,1257.0,1127.0,442.0,17174.0,
390,1401.0,1204.0,405.0,16990.0,
391,1415.0,1192.0,452.0,16941.0,
392,1270.0,1239.0,521.0,16970.0,
393,1149.0,1202.0,676.0,16973.0,
394,1009.0,1256.0,669.0,17066.0,
395,1006.0,1270.0,681.0,17043.0,
396,1076.0,1268.0,704.0,16952.0,
397,1017.0,1292.0,755.0,16936.0,
398,986.0,1278.0,719.0,17017.0,
399,810.0,1361.0,755.0,17074.0,
400,742.0,1293.0,707.0,17258.0,
401,717.0,1211.0,653.0,17419.0,
402,723.0,1256.0,617.0,17404.0,
403,667.0,1170.0,653.0,17510.0,
404,649.0,1111.0,644.0,17596.0,
405,639.0,1091.0,559.0,17711.0,
406,648.0,1039.0,550.0,17763.0,
407,678.0,1054.0,491.0,17777.0,
408,726.0,955.0,407.0,17912.0,
409,733.0,804.0,336.0,18127.0,
410,755.0,791.0,269.0,18185.0,
411,788.0,791.0,301.0,18120.0,
412,813.0,737.0,303.0,18147.0,
413,836.0,708.0,275.0,18181.0,
414,860.0,635.0,324.0,18181.0,
415,890.0,608.0,321.0,18181.0,
416,897.0,542.0,387.0,18174.0,
417,948.0,498.0,329.0,18225.0,
418,1030.0,524.0,297.0,18149.0,
419,1064.0,472.0,289.0,18175.0,
420,1116.0,482.0,270.0,18132.0,
421,1156.0,472.0,256.0,18116.0,
422,1240.0,448.0,269.0,18043.0,
423,1392.0,482.0,262.0,17864.0,
424,1396.0,483.0,311.0,17810.0,
425,1448.0,518.0,287.0,17747.0,
426,1464.0,522.0,309.0,17705.0,
427,1464.0,493.0,365.0,17678.0,
428,1486.0,531.0,374.0,17609.0,
429,1522.0,512.0,407.0,17559.0,
430,1600.0,553.0,364.0,17483.0,
431,1748.0,592.0,392.0,17268.0,
432,1782.0,570.0,519.0,17129.0,
433,1844.0,600.0,575.0,16981.0,
434,1821.0,616.0,570.0,16993.0,
435,1786.0,631.0,634.0,16949.0,
436,1814.0,650.0,619.0,16917.0,
437,1744.0,751.0,649.0,16856.0,
438,1680.0,851.0,595.0,16874.0,
439,1704.0,961.0,603.0,16732.0,
440,1655.0,949.0,710.0,16686.0,
441,1589.0,1031.0,716.0,16664.0,
442,1563.0,977.0,758.0,16702.0,
443,1593.0,985.0,786.0,16636.0,
444,1633.0,1045.0,762.0,16560.0,
445,1453.0,1123.0,818.0,16606.0,
446,1272.0,1109.0,949.0,16670.0,
447,1269.0,1123.0,895.0,16713.0,
448,1185.0,1116.0,947.0,16752.0,
449,1098.0,1171.0,872.0,16859.0,
450,1051.0,1209.0,883.0,16857.0,
451,969.0,1290.0,877.0,16864.0,
452,909.0,1438.0,736.0,16917.0,
453,823.0,1403.0,760.0,17014.0,
454,826.0,1364.0,768.0,17042.0,
455,827.0,1420.0,628.0,17125.0,
456,804.0,1365.0,652.0,17179.0,
457,867.0,1385.0,557.0,17191.0,
458,818.0,1382.0,438.0,17362.0,
459,808.0,1367.0,419.0,17406.0,
460,793.0,1365.0,338.0,17504.0,
461,761.0,1235.0,369.0,17635.0,
462,851.0,1127.0,288.0,17734.0,
463,849.0,996.0,250.0,17905.0,
464,896.0,932.0,274.0,17898.0,
465,955.0,874.0,255.0,17916.0,
466,998.0,794.0,273.0,17935.0,
467,1005.0,824.0,262.0,17909.0,
468,1123.0,791.0,309.0,17777.0,
469,1133.0,764.0,334.0,17769.0,
470,1150.0,837.0,228.0,17785.0,
471,1130.0,797.0,294.0,17779.0,
472,1223.0,801.0,341.0,17635.0,
473,1239.0,901.0,280.0,17580.0,
474,1239.0,905.0,249.0,17607.0,
475,1286.0,832.0,334.0,17548.0,
476,1267.0,865.0,367.0,17501.0,
477,1276.0,840.0,384.0,17500.0,
478,1374.0,809.0,414.0,17403.0,
479,1504.0,848.0,432.0,17216.0,
480,1457.0,831.0,517.0,17195.0,
481,1444.0,850.0,571.0,17135.0,
482,1460.0,939.0,534.0,17067.0,
483,1426.0,1095.0,414.0,17065.0,
484,1351.0,1115.0,462.0,17072.0,
485,1361.0,1144.0,457.0,17038.0,
486,1321.0,1226.0,497.0,16956.0,
487,1379.0,1314.0,580.0,16727.0,
488,1219.0,1353.0,823.0,16605.0,
489,1091.0,1416.0,826.0,16667.0,
490,939.0,1405.0,920.0,16736.0,
491,914.0,1509.0,763.0,16814.0,
492,850.0,1657.0,626.0,16867.0,
493,813.0,1762.0,582.0,16843.0,
494,857.0,1745.0,476.0,16922.0,
495,859.0,1685.0,508.0,16948.0,
496,865.0,1650.0,442.0,17043.0,
497,838.0,1645.0,333.0,17184.0,
498,830.0,1465.0,397.0,17308.0,
499,833.0,1294.0,283.0,17590.0,
500,830.0,1149.0,386.0,17635.0,
501,812.0,1107.0,393.0,17688.0,
502,863.0,1060.0,307.0,17770.0,
503,863.0,1033.0,342.0,17762.0,
504,889.0,1050.0,276.0,17785.0,
505,882.0,1058.0,290.0,17770.0,
506,868.0,1024.0,258.0,17850.0,
507,865.0,966.0,257.0,17912.0,
508,906.0,955.0,320.0,17819.0,
509,898.0,911.0,292.0,17899.0,
510,888.0,883.0,271.0,17958.0,
511,884.0,888.0,310.0,17918.0,
512,874.0,811.0,297.0,18018.0,
513,883.0,737.0,250.0,18130.0,
514,905.0,660.0,287.0,18148.0,
515,929.0,599.0,310.0,18162.0,
516,943.0,606.0,336.0,18115.0,
517,960.0,621.0,265.0,18154.0,
518,973.0,555.0,277.0,18195.0,
519,998.0,503.0,295.0,18204.0,
520,1027.0,547.0,267.0,18159.0,
521,1026.0,525.0,270.0,18179.0,
522,1055.0,523.0,262.0,18160.0,
523,1059.0,510.0,297.0,18134.0,
524,1119.0,534.0,284.0,18063.0,
525,1140.0,491.0,280.0,18089.0,
526,1170.0,470.0,269.0,18091.0,
527,1208.0,445.0,283.0,18064.0,
528,1379.0,409.0,263.0,17949.0,
529,1442.0,407.0,287.0,17864.0,
530,1433.0,388.0,289.0,17890.0,
531,1441.0,412.0,278.0,17869.0,
532,1481.0,439.0,290.0,17790.0,
533,1493.0,438.0,298.0,17771.0,
534,1515.0,464.0,259.0,17762.0,
535,1541.0,508.0,259.0,17692.0,
536,1551.0,532.0,289.0,17628.0,
537,1549.0,531.0,271.0,17649.0,
538,1553.0,509.0,316.0,17622.0,
539,1541.0,524.0,275.0,17660.0,
540,1507.0,510.0,345.0,17638.0,
541,1497.0,542.0,291.0,17670.0,
542,1478.0,535.0,297.0,17690.0,
543,1483.0,566.0,300.0,17651.0,
544,1457.0,601.0,277.0,17665.0,
545,1421.0,572.0,270.0,17737.0,
546,1401.0,573.0,238.0,17788.0,
547,1369.0,494.0,276.0,17861.0,
548,1363.0,494.0,290.0,17853.0,
549,1352.0,506.0,297.0,17845.0,
550,1357.0,480.0,296.0,17867.0,
551,1401.0,518.0,305.0,17776.0,
552,1382.0,491.0,347.0,17780.0,
553,1404.0,554.0,352.0,17690.0,
554,1402.0,578.0,375.0,17645.0,
555,1409.0,562.0,389.0,17640.0,
556,1418.0,543.0,445.0,17594.0,
557,1421.0,594.0,432.0,17553.0,
558,1417.0,608.0,391.0,17584.0,
559,1456.0,623.0,441.0,17480.0,
560,1422.0,679.0,486.0,17413.0,
561,1435.0,697.0,487.0,17381.0,
562,1436.0,667.0,478.0,17419.0,
563,1455.0,710.0,538.0,17297.0,
564,1436.0,799.0,509.0,17256.0,
565,1415.0,860.0,537.0,17188.0,
566,1443.0,948.0,556.0,17053.0,
567,1438.0,984.0,583.0,16995.0,
568,1392.0,956.0,629.0,17023.0,
569,1484.0,958.0,631.0,16927.0,
570,1507.0,949.0,579.0,16965.0,
571,1525.0,1040.0,625.0,16810.0,
572,1444.0,1171.0,658.0,16727.0,
573,1407.0,1165.0,739.0,16689.0,
574,1428.0,1282.0,765.0,16525.0,
575,1269.0,1397.0,840.0,16494.0,
576,1143.0,1613.0,742.0,16502.0,
577,1003.0,1792.0,692.0,16513.0,
578,904.0,1804.0,664.0,16628.0,
579,825.0,1829.0,676.0,16670.0,
580,758.0,1962.0,749.0,16531.0,
581,712.0,2013.0,597.0,16678.0,
582,662.0,1930.0,611.0,16797.0,
583,629.0,1804.0,543.0,17024.0,
584,666.0,1727.0,541.0,17066.0,
585,659.0,1735.0,549.0,17057.0,
586,647.0,1765.0,536.0,17052.0,
587,658.0,1674.0,520.0,17148.0,
588,619.0,1540.0,561.0,17280.0,
589,624.0,1457.0,538.0,17381.0,
590,652.0,1385.0,430.0,17533.0,
591,720.0,1304.0,372.0,17604.0,
592,803.0,1272.0,378.0,17547.0,
593,813.0,1204.0,380.0,17603.0,
594,874.0,1186.0,396.0,17544.0,
595,909.0,1122.0,350.0,17619.0,
596,946.0,1098.0,297.0,17659.0,
597,1004.0,974.0,253.0,17769.0,
598,1037.0,929.0,312.0,17722.0,
599,1008.0,894.0,432.0,17666.0,
600,990.0,874.0,467.0,17669.0,
601,1053.0,884.0,348.0,17715.0,
602,1050.0,851.0,299.0,17800.0,
603,1080.0,796.0,340.0,17784.0,
604,1111.0,779.0,400.0,17710.0,
605,1126.0,712.0,407.0,17755.0,
606,1160.0,702.0,369.0,17769.0,
607,1198.0,671.0,372.0,17759.0,
608,1209.0,696.0,372.0,17723.0,
609,1234.0,624.0,340.0,17802.0,
610,1239.0,621.0,277.0,17863.0,
611,1237.0,593.0,291.0,17879.0,
612,1254.0,577.0,309.0,17860.0,
613,1294.0,587.0,290.0,17829.0,
614,1316.0,545.0,297.0,17842.0,
615,1336.0,494.0,353.0,17817.0,
616,1323.0,482.0,382.0,17813.0,
617,1310.0,536.0,315.0,17839.0,
618,1332.0,540.0,273.0,17855.0,
619,1311.0,517.0,328.0,17844.0,
620,1315.0,560.0,329.0,17796.0,
621,1298.0,538.0,334.0,17830.0,
622,1283.0,488.0,367.0,17862.0,
623,1299.0,517.0,332.0,17852.0,
624,1304.0,507.0,370.0,17819.0,
625,1324.0,507.0,382.0,17787.0,
626,1326.0,481.0,414.0,17779.0,
627,1308.0,508.0,434.0,17750.0,
628,1308.0,557.0,369.0,17766.0,
629,1300.0,542.0,402.0,17756.0,
630,1282.0,549.0,424.0,17745.0,
631,1270.0,611.0,337.0,17782.0,
632,1257.0,625.0,365.0,17753.0,
633,1267.0,625.0,312.0,17796.0,
634,1248.0,574.0,324.0,17854.0,
635,1233.0,584.0,368.0,17815.0,
636,1231.0,587.0,379.0,17803.0,
637,1250.0,581.0,403.0,17766.0,
638,1273.0,584.0,409.0,17734.0,
639,1306.0,621.0,377.0,17696.0,
640,1356.0,647.0,398.0,17599.0,
641,1362.0,676.0,409.0,17553.0,
642,1348.0,729.0,385.0,17538.0,
643,1333.0,682.0,476.0,17509.0,
644,1326.0,728.0,406.0,17540.0,
645,1288.0,747.0,424.0,17541.0,
646,1239.0,889.0,325.0,17547.0,
647,1209.0,888.0,389.0,17514.0,
648,1219.0,894.0,374.0,17513.0,
649,1194.0,882.0,315.0,17609.0,
650,1168.0,792.0,376.0,17664.0,
651,1165.0,789.0,337.0,17709.0,
652,1147.0,728.0,437.0,17688.0,
653,1150.0,706.0,419.0,17725.0,
654,1144.0,720.0,366.0,17770.0,
655,1159.0,686.0,398.0,17757.0,
656,1163.0,700.0,331.0,17806.0,
657,1136.0,653.0,397.0,17814.0,
658,1145.0,639.0,348.0,17868.0,
659,1142.0,622.0,379.0,17857.0,
660,1138.0,655.0,384.0,17823.0,
661,1122.0,696.0,368.0,17814.0,
662,1089.0,708.0,410.0,17793.0,
663,1097.0,733.0,341.0,17829.0,
664,1095.0,719.0,342.0,17844.0,
665,1064.0,731.0,338.0,17867.0,
666,1100.0,755.0,324.0,17821.0,
667,1099.0,799.0,309.0,17793.0,
668,1141.0,807.0,345.0,17707.0,
669,1165.0,798.0,358.0,17679.0,
670,1141.0,796.0,414.0,17649.0,
671,1149.0,788.0,503.0,17560.0,
672,1083.0,870.0,475.0,17572.0,
673,1038.0,856.0,508.0,17598.0,
674,1018.0,851.0,465.0,17666.0,
675,988.0,911.0,428.0,17673.0,
676,937.0,958.0,420.0,17685.0,
677,912.0,945.0,409.0,17734.0,
678,888.0,947.0,402.0,17763.0,
679,877.0,981.0,324.0,17818.0,
680,868.0,1008.0,264.0,17860.0,
681,847.0,934.0,268.0,17951.0,
682,846.0,879.0,283.0,17992.0,
683,830.0,849.0,276.0,18045.0,
684,827.0,803.0,284.0,18086.0,
685,856.0,823.0,233.0,18088.0,
686,843.0,753.0,266.0,18138.0,
687,870.0,739.0,272.0,18119.0,
688,921.0,742.0,225.0,18112.0,
689,964.0,699.0,228.0,18109.0,
690,984.0,679.0,192.0,18145.0,
691,1050.0,681.0,225.0,18044.0,
692,1099.0,659.0,211.0,18031.0,
693,1124.0,627.0,253.0,17996.0,
694,1180.0,641.0,269.0,17910.0,
695,1173.0,673.0,278.0,17876.0,
696,1168.0,654.0,282.0,17896.0,
697,1206.0,652.0,288.0,17854.0,
698,1180.0,711.0,353.0,17756.0,
699,1176.0,785.0,343.0,17696.0,
700,1154.0,825.0,313.0,17708.0,
701,1141.0,887.0,312.0,17660.0,
702,1110.0,918.0,317.0,17655.0,
703,1110.0,935.0,299.0,17656.0,
704,1067.0,878.0,404.0,17651.0,
705,1087.0,998.0,339.0,17576.0,
706,1107.0,953.0,358.0,17582.0,
707,1169.0,944.0,352.0,17535.0,
708,1177.0,804.0,411.0,17608.0,
709,1172.0,792.0,367.0,17669.0,
710,1243.0,774.0,375.0,17608.0,
711,1300.0,760.0,413.0,17527.0,
712,1316.0,730.0,388.0,17566.0,
713,1365.0,762.0,377.0,17496.0,
714,1366.0,724.0,416.0,17494.0,
715,1391.0,673.0,464.0,17472.0,
716,1409.0,706.0,457.0,17428.0,
717,1414.0,687.0,467.0,17432.0,
718,1463.0,692.0,425.0,17420.0,
719,1494.0,708.0,378.0,17420.0,
720,1567.0,732.0,383.0,17318.0,
721,1643.0,698.0,473.0,17186.0,
722,1619.0,676.0,545.0,17160.0,
723,1646.0,754.0,458.0,17142.0,
724,1683.0,744.0,466.0,17107.0,
725,1684.0,765.0,572.0,16979.0,
726,1676.0,846.0,601.0,16877.0,
727,1639.0,888.0,606.0,16867.0,
728,1596.0,968.0,604.0,16832.0,
729,1551.0,1013.0,553.0,16883.0,
730,1474.0,997.0,614.0,16915.0,
