jour,S,I,E,R,
0,19980.0,20.0,0.0,0.0,
1,19968.0,20.0,12.0,0.0,
2,19914.0,23.0,63.0,0.0,
3,19812.0,46.0,142.0,0.0,
4,19618.0,77.0,298.0,7.0,
5,19214.0,126.0,646.0,14.0,
6,18528.0,337.0,1112.0,23.0,
7,17270.0,649.0,2031.0,50.0,
8,14947.0,1228.0,3682.0,143.0,
9,11788.0,1888.0,6047.0,277.0,
10,7898.0,3601.0,8056.0,445.0,
11,3835.0,5056.0,10265.0,844.0,
12,1632.0,7366.0,9596.0,1406.0,
13,389.0,9249.0,8040.0,2322.0,
14,69.0,10079.0,6109.0,3743.0,
15,6.0,10411.0,4471.0,5112.0,
16,0.0,10828.0,3319.0,5853.0,
17,0.0,10603.0,2586.0,6811.0,
18,0.0,9030.0,2100.0,8870.0,
19,6.0,8813.0,1366.0,9815.0,
20,13.0,8275.0,883.0,10829.0,
21,26.0,7678.0,696.0,11600.0,
22,62.0,6733.0,676.0,12529.0,
23,80.0,6471.0,456.0,12993.0,
24,71.0,6081.0,367.0,13481.0,
25,84.0,5495.0,350.0,14071.0,
26,200.0,4893.0,304.0,14603.0,
27,332.0,4444.0,299.0,14925.0,
28,256.0,3693.0,497.0,15554.0,
29,268.0,3107.0,529.0,16096.0,
30,424.0,2772.0,454.0,16350.0,
31,411.0,2375.0,396.0,16818.0,
32,346.0,2263.0,468.0,16923.0,
33,394.0,2194.0,471.0,16941.0,
34,447.0,1949.0,352.0,17252.0,
35,480.0,1810.0,381.0,17329.0,
36,455.0,1633.0,290.0,17622.0,
37,306.0,1545.0,316.0,17833.0,
38,248.0,1439.0,225.0,18088.0,
39,259.0,1430.0,119.0,18192.0,
40,238.0,1212.0,80.0,18470.0,
41,212.0,1001.0,93.0,18694.0,
42,215.0,949.0,94.0,18742.0,
43,286.0,853.0,90.0,18771.0,
44,447.0,694.0,92.0,18767.0,
45,558.0,594.0,158.0,18690.0,
46,650.0,471.0,118.0,18761.0,
47,694.0,463.0,104.0,18739.0,
48,707.0,412.0,147.0,18734.0,
49,728.0,294.0,163.0,18815.0,
50,782.0,306.0,163.0,18749.0,
51,815.0,339.0,153.0,18693.0,
52,925.0,309.0,159.0,18607.0,
53,961.0,261.0,139.0,18639.0,
54,1164.0,329.0,88.0,18419.0,
55,1212.0,305.0,77.0,18406.0,
56,1267.0,315.0,70.0,18348.0,
57,1316.0,301.0,114.0,18269.0,
58,1299.0,286.0,161.0,18254.0,
59,1397.0,309.0,143.0,18151.0,
60,1461.0,323.0,122.0,18094.0,
61,1481.0,314.0,172.0,18033.0,
62,1488.0,293.0,220.0,17999.0,
63,1515.0,339.0,129.0,18017.0,
64,1542.0,289.0,131.0,18038.0,
65,1522.0,320.0,135.0,18023.0,
66,1520.0,340.0,135.0,18005.0,
67,1591.0,330.0,159.0,17920.0,
68,1558.0,348.0,190.0,17904.0,
69,1511.0,347.0,205.0,17937.0,
70,1509.0,371.0,176.0,17944.0,
71,1467.0,375.0,180.0,17978.0,
72,1416.0,412.0,185.0,17987.0,
73,1384.0,469.0,150.0,17997.0,
74,1426.0,451.0,173.0,17950.0,
75,1363.0,471.0,234.0,17932.0,
76,1309.0,511.0,270.0,17910.0,
77,1353.0,589.0,175.0,17883.0,
78,1269.0,534.0,248.0,17949.0,
79,1257.0,551.0,240.0,17952.0,
80,1227.0,500.0,217.0,18056.0,
81,1190.0,479.0,269.0,18062.0,
82,1196.0,600.0,137.0,18067.0,
83,1184.0,477.0,199.0,18140.0,
84,1181.0,534.0,167.0,18118.0,
85,1221.0,513.0,191.0,18075.0,
86,1187.0,543.0,180.0,18090.0,
87,1269.0,512.0,210.0,18009.0,
88,1329.0,449.0,222.0,18000.0,
89,1376.0,465.0,212.0,17947.0,
90,1452.0,432.0,241.0,17875.0,
91,1441.0,442.0,234.0,17883.0,
92,1434.0,411.0,205.0,17950.0,
93,1598.0,451.0,181.0,17770.0,
94,1572.0,479.0,222.0,17727.0,
95,1581.0,486.0,199.0,17734.0,
96,1587.0,475.0,204.0,17734.0,
97,1558.0,418.0,225.0,17799.0,
98,1496.0,450.0,252.0,17802.0,
99,1501.0,522.0,275.0,17702.0,
100,1475.0,540.0,322.0,17663.0,
101,1428.0,567.0,268.0,17737.0,
102,1358.0,545.0,341.0,17756.0,
103,1348.0,602.0,237.0,17813.0,
104,1342.0,574.0,222.0,17862.0,
105,1298.0,578.0,266.0,17858.0,
106,1272.0,589.0,266.0,17873.0,
107,1203.0,574.0,321.0,17902.0,
108,1222.0,548.0,330.0,17900.0,
109,1248.0,567.0,287.0,17898.0,
110,1210.0,560.0,235.0,17995.0,
111,1218.0,578.0,304.0,17900.0,
112,1238.0,574.0,256.0,17932.0,
113,1216.0,561.0,288.0,17935.0,
114,1198.0,575.0,254.0,17973.0,
115,1190.0,581.0,188.0,18041.0,
116,1208.0,575.0,165.0,18052.0,
117,1197.0,597.0,235.0,17971.0,
118,1189.0,505.0,291.0,18015.0,
119,1146.0,530.0,324.0,18000.0,
120,1157.0,502.0,317.0,18024.0,
121,1160.0,507.0,272.0,18061.0,
122,1136.0,522.0,291.0,18051.0,
123,1200.0,523.0,289.0,17988.0,
124,1251.0,543.0,303.0,17903.0,
125,1256.0,560.0,289.0,17895.0,
126,1232.0,574.0,220.0,17974.0,
127,1536.0,619.0,271.0,17574.0,
128,1642.0,610.0,378.0,17370.0,
129,1691.0,643.0,380.0,17286.0,
130,1860.0,628.0,459.0,17053.0,
131,1862.0,729.0,471.0,16938.0,
132,1902.0,844.0,476.0,16778.0,
133,1783.0,861.0,547.0,16809.0,
134,1753.0,906.0,649.0,16692.0,
135,1579.0,931.0,762.0,16728.0,
136,1442.0,1111.0,750.0,16697.0,
137,1362.0,1078.0,790.0,16770.0,
138,1265.0,1119.0,855.0,16761.0,
139,1209.0,1280.0,798.0,16713.0,
140,1109.0,1429.0,780.0,16682.0,
141,1097.0,1482.0,724.0,16697.0,
142,973.0,1519.0,702.0,16806.0,
143,930.0,1528.0,656.0,16886.0,
144,763.0,1586.0,652.0,16999.0,
145,854.0,1627.0,634.0,16885.0,
146,787.0,1550.0,537.0,17126.0,
147,854.0,1433.0,583.0,17130.0,
148,830.0,1503.0,497.0,17170.0,
149,774.0,1369.0,506.0,17351.0,
150,688.0,1442.0,507.0,17363.0,
151,655.0,1316.0,514.0,17515.0,
152,641.0,1342.0,415.0,17602.0,
153,673.0,1324.0,325.0,17678.0,
154,665.0,1175.0,377.0,17783.0,
155,649.0,1103.0,386.0,17862.0,
156,708.0,991.0,326.0,17975.0,
157,711.0,924.0,281.0,18084.0,
158,696.0,846.0,311.0,18147.0,
159,839.0,843.0,298.0,18020.0,
160,919.0,682.0,274.0,18125.0,
161,971.0,654.0,290.0,18085.0,
162,1039.0,655.0,297.0,18009.0,
163,1287.0,585.0,291.0,17837.0,
164,1370.0,561.0,325.0,17744.0,
165,1331.0,593.0,356.0,17720.0,
166,1345.0,625.0,310.0,17720.0,
167,1427.0,553.0,360.0,17660.0,
168,1412.0,541.0,428.0,17619.0,
169,1460.0,580.0,362.0,17598.0,
170,1472.0,555.0,383.0,17590.0,
171,1422.0,557.0,420.0,17601.0,
172,1451.0,562.0,336.0,17651.0,
173,1469.0,496.0,336.0,17699.0,
174,1597.0,513.0,382.0,17508.0,
175,1581.0,517.0,480.0,17422.0,
176,1575.0,614.0,466.0,17345.0,
177,1534.0,648.0,498.0,17320.0,
178,1545.0,653.0,540.0,17262.0,
179,1603.0,748.0,502.0,17147.0,
180,1553.0,834.0,470.0,17143.0,
181,1439.0,807.0,590.0,17164.0,
182,1408.0,847.0,640.0,17105.0,
183,1328.0,946.0,638.0,17088.0,
184,1367.0,953.0,575.0,17105.0,
185,1289.0,1068.0,494.0,17149.0,
186,1237.0,1040.0,484.0,17239.0,
187,1221.0,986.0,527.0,17266.0,
188,1181.0,965.0,523.0,17331.0,
189,1129.0,938.0,485.0,17448.0,
190,1124.0,936.0,461.0,17479.0,
191,1048.0,996.0,413.0,17543.0,
192,991.0,957.0,428.0,17624.0,
193,982.0,903.0,440.0,17675.0,
194,967.0,857.0,411.0,17765.0,
195,967.0,737.0,459.0,17837.0,
196,955.0,774.0,417.0,17854.0,
197,1031.0,714.0,403.0,17852.0,
198,1021.0,732.0,386.0,17861.0,
199,1184.0,720.0,419.0,17677.0,
200,1282.0,669.0,444.0,17605.0,
201,1338.0,735.0,349.0,17578.0,
202,1345.0,693.0,403.0,17559.0,
203,1426.0,751.0,373.0,17450.0,
204,1407.0,792.0,393.0,17408.0,
205,1407.0,697.0,423.0,17473.0,
206,1383.0,791.0,350.0,17476.0,
207,1426.0,675.0,359.0,17540.0,
208,1477.0,649.0,330.0,17544.0,
209,1504.0,660.0,334.0,17502.0,
210,1439.0,549.0,446.0,17566.0,
211,1393.0,600.0,440.0,17567.0,
212,1379.0,554.0,486.0,17581.0,
213,1383.0,586.0,417.0,17614.0,
214,1395.0,544.0,447.0,17614.0,
215,1352.0,576.0,444.0,17628.0,
216,1356.0,641.0,390.0,17613.0,
217,1324.0,588.0,418.0,17670.0,
218,1357.0,619.0,440.0,17584.0,
219,1328.0,553.0,461.0,17658.0,
220,1286.0,533.0,509.0,17672.0,
221,1259.0,619.0,441.0,17681.0,
222,1230.0,622.0,402.0,17746.0,
223,1227.0,689.0,371.0,17713.0,
224,1212.0,700.0,403.0,17685.0,
225,1177.0,773.0,348.0,17702.0,
226,1116.0,828.0,386.0,17670.0,
227,1095.0,867.0,394.0,17644.0,
228,1058.0,868.0,368.0,17706.0,
229,1012.0,789.0,430.0,17769.0,
230,1020.0,779.0,455.0,17746.0,
231,985.0,788.0,472.0,17755.0,
232,963.0,881.0,395.0,17761.0,
233,1020.0,896.0,373.0,17711.0,
234,1000.0,911.0,359.0,17730.0,
235,1033.0,963.0,399.0,17605.0,
236,1003.0,1000.0,355.0,17642.0,
237,995.0,1003.0,385.0,17617.0,
238,1032.0,1114.0,359.0,17495.0,
239,988.0,1033.0,399.0,17580.0,
240,975.0,1081.0,431.0,17513.0,
241,1043.0,1126.0,464.0,17367.0,
242,1067.0,1225.0,384.0,17324.0,
243,1068.0,1163.0,325.0,17444.0,
244,1074.0,1154.0,400.0,17372.0,
245,1187.0,1098.0,499.0,17216.0,
246,1215.0,1229.0,380.0,17176.0,
247,1110.0,1179.0,528.0,17183.0,
248,1110.0,1217.0,512.0,17161.0,
249,1076.0,1220.0,545.0,17159.0,
250,977.0,1211.0,660.0,17152.0,
251,1068.0,1268.0,688.0,16976.0,
252,1075.0,1332.0,714.0,16879.0,
253,1044.0,1426.0,681.0,16849.0,
254,1121.0,1419.0,652.0,16808.0,
255,1185.0,1288.0,672.0,16855.0,
256,1236.0,1343.0,789.0,16632.0,
257,1301.0,1321.0,926.0,16452.0,
258,1281.0,1284.0,966.0,16469.0,
259,1271.0,1413.0,850.0,16466.0,
260,1178.0,1493.0,902.0,16427.0,
261,1116.0,1543.0,880.0,16461.0,
262,1031.0,1562.0,877.0,16530.0,
263,1114.0,1571.0,795.0,16520.0,
264,1065.0,1628.0,752.0,16555.0,
265,1005.0,1609.0,755.0,16631.0,
266,866.0,1541.0,848.0,16745.0,
267,836.0,1448.0,820.0,16896.0,
268,750.0,1485.0,795.0,16970.0,
269,756.0,1501.0,708.0,17035.0,
270,763.0,1487.0,613.0,17137.0,
271,768.0,1575.0,454.0,17203.0,
272,875.0,1544.0,374.0,17207.0,
273,839.0,1339.0,421.0,17401.0,
274,890.0,1267.0,462.0,17381.0,
275,986.0,1240.0,454.0,17320.0,
276,1015.0,1194.0,384.0,17407.0,
277,993.0,1072.0,401.0,17534.0,
278,910.0,1027.0,480.0,17583.0,
279,875.0,1025.0,460.0,17640.0,
280,892.0,959.0,478.0,17671.0,
281,918.0,845.0,450.0,17787.0,
282,980.0,853.0,476.0,17691.0,
283,1004.0,787.0,483.0,17726.0,
284,1060.0,718.0,503.0,17719.0,
285,1173.0,750.0,395.0,17682.0,
286,1214.0,757.0,373.0,17656.0,
287,1195.0,748.0,355.0,17702.0,
288,1210.0,647.0,329.0,17814.0,
289,1250.0,622.0,291.0,17837.0,
290,1264.0,542.0,339.0,17855.0,
291,1278.0,556.0,382.0,17784.0,
292,1251.0,547.0,400.0,17802.0,
293,1220.0,576.0,430.0,17774.0,
294,1203.0,592.0,412.0,17793.0,
295,1195.0,581.0,360.0,17864.0,
296,1152.0,645.0,316.0,17887.0,
297,1142.0,569.0,326.0,17963.0,
298,1112.0,589.0,266.0,18033.0,
299,1138.0,565.0,267.0,18030.0,
300,1123.0,522.0,308.0,18047.0,
301,1165.0,511.0,243.0,18081.0,
302,1166.0,462.0,261.0,18111.0,
303,1213.0,483.0,220.0,18084.0,
304,1215.0,458.0,265.0,18062.0,
305,1222.0,466.0,261.0,18051.0,
306,1232.0,452.0,272.0,18044.0,
307,1262.0,471.0,239.0,18028.0,
308,1286.0,450.0,259.0,18005.0,
309,1304.0,486.0,226.0,17984.0,
310,1314.0,429.0,264.0,17993.0,
311,1327.0,445.0,270.0,17958.0,
312,1368.0,480.0,247.0,17905.0,
313,1380.0,477.0,236.0,17907.0,
314,1400.0,495.0,229.0,17876.0,
315,1390.0,454.0,267.0,17889.0,
316,1399.0,536.0,231.0,17834.0,
317,1427.0,539.0,267.0,17767.0,
318,1498.0,537.0,269.0,17696.0,
319,1479.0,507.0,357.0,17657.0,
320,1557.0,560.0,331.0,17552.0,
321,1646.0,616.0,341.0,17397.0,
322,1731.0,594.0,381.0,17294.0,
323,1848.0,669.0,368.0,17115.0,
324,1825.0,702.0,344.0,17129.0,
325,1829.0,719.0,335.0,17117.0,
326,1793.0,743.0,396.0,17068.0,
327,1680.0,778.0,451.0,17091.0,
328,1551.0,863.0,520.0,17066.0,
329,1502.0,864.0,616.0,17018.0,
330,1450.0,858.0,613.0,17079.0,
331,1404.0,900.0,641.0,17055.0,
332,1375.0,961.0,607.0,17057.0,
333,1267.0,1017.0,640.0,17076.0,
334,1184.0,989.0,737.0,17090.0,
335,1178.0,979.0,737.0,17106.0,
336,1131.0,1072.0,735.0,17062.0,
337,1146.0,1087.0,752.0,17015.0,
338,1072.0,1156.0,769.0,17003.0,
339,1065.0,1130.0,783.0,17022.0,
340,1116.0,1113.0,813.0,16958.0,
341,1039.0,1205.0,765.0,16991.0,
342,1019.0,1222.0,694.0,17065.0,
343,1005.0,1281.0,672.0,17042.0,
344,907.0,1362.0,636.0,17095.0,
345,811.0,1405.0,631.0,17153.0,
346,805.0,1361.0,558.0,17276.0,
347,795.0,1347.0,629.0,17229.0,
348,832.0,1290.0,639.0,17239.0,
349,838.0,1338.0,587.0,17237.0,
350,800.0,1401.0,564.0,17235.0,
351,768.0,1430.0,489.0,17313.0,
352,746.0,1470.0,496.0,17288.0,
353,715.0,1350.0,549.0,17386.0,
354,694.0,1315.0,561.0,17430.0,
355,687.0,1279.0,518.0,17516.0,
356,686.0,1362.0,414.0,17538.0,
357,683.0,1255.0,467.0,17595.0,
358,693.0,1282.0,365.0,17660.0,
359,707.0,1238.0,360.0,17695.0,
360,702.0,1226.0,335.0,17737.0,
361,700.0,1169.0,284.0,17847.0,
362,693.0,1135.0,276.0,17896.0,
363,705.0,1079.0,287.0,17929.0,
364,725.0,992.0,290.0,17993.0,
365,718.0,922.0,314.0,18046.0,
366,733.0,806.0,285.0,18176.0,
367,842.0,752.0,289.0,18117.0,
368,885.0,738.0,255.0,18122.0,
369,917.0,722.0,299.0,18062.0,
370,997.0,686.0,313.0,18004.0,
371,1068.0,651.0,291.0,17990.0,
372,1155.0,607.0,303.0,17935.0,
373,1231.0,626.0,320.0,17823.0,
374,1294.0,566.0,376.0,17764.0,
375,1376.0,552.0,376.0,17696.0,
376,1561.0,577.0,409.0,17453.0,
377,1640.0,593.0,416.0,17351.0,
378,1693.0,627.0,458.0,17222.0,
379,1850.0,636.0,477.0,17037.0,
380,1897.0,692.0,433.0,16978.0,
381,2043.0,698.0,505.0,16754.0,
382,2069.0,752.0,622.0,16557.0,
383,2125.0,771.0,645.0,16459.0,
384,2120.0,902.0,701.0,16277.0,
385,2117.0,985.0,666.0,16232.0,
386,1961.0,1013.0,855.0,16171.0,
387,1782.0,1082.0,962.0,16174.0,
388,1700.0,1123.0,934.0,16243.0,
389,1463.0,1196.0,1040.0,16301.0,
390,1404.0,1142.0,1081.0,16373.0,
391,1350.0,1273.0,918.0,16459.0,
392,1208.0,1414.0,902.0,16476.0,
393,1051.0,1507.0,908.0,16534.0,
394,979.0,1555.0,974.0,16492.0,
395,978.0,1623.0,851.0,16548.0,
396,935.0,1669.0,723.0,16673.0,
397,893.0,1680.0,757.0,16670.0,
398,828.0,1689.0,714.0,16769.0,
399,739.0,1723.0,717.0,16821.0,
400,695.0,1741.0,660.0,16904.0,
401,630.0,1877.0,547.0,16946.0,
402,697.0,1914.0,509.0,16880.0,
403,669.0,1875.0,536.0,16920.0,
404,648.0,1926.0,432.0,16994.0,
405,688.0,1826.0,445.0,17041.0,
406,676.0,1706.0,433.0,17185.0,
407,709.0,1664.0,409.0,17218.0,
408,688.0,1577.0,395.0,17340.0,
409,832.0,1475.0,438.0,17255.0,
410,817.0,1320.0,462.0,17401.0,
411,878.0,1245.0,457.0,17420.0,
412,921.0,1098.0,503.0,17478.0,
413,869.0,1035.0,555.0,17541.0,
414,873.0,961.0,552.0,17614.0,
415,901.0,856.0,515.0,17728.0,
416,921.0,863.0,373.0,17843.0,
417,950.0,833.0,384.0,17833.0,
418,1011.0,822.0,358.0,17809.0,
419,1023.0,818.0,402.0,17757.0,
420,1046.0,801.0,399.0,17754.0,
421,1098.0,782.0,365.0,17755.0,
422,1073.0,844.0,361.0,17722.0,
423,1091.0,855.0,333.0,17721.0,
424,1106.0,890.0,326.0,17678.0,
425,1108.0,731.0,392.0,17769.0,
426,1116.0,754.0,453.0,17677.0,
427,1125.0,785.0,474.0,17616.0,
428,1164.0,808.0,441.0,17587.0,
429,1174.0,844.0,397.0,17585.0,
430,1194.0,845.0,374.0,17587.0,
431,1176.0,864.0,308.0,17652.0,
432,1164.0,818.0,372.0,17646.0,
433,1158.0,873.0,391.0,17578.0,
434,1134.0,857.0,413.0,17596.0,
435,1142.0,814.0,450.0,17594.0,
436,1112.0,836.0,426.0,17626.0,
437,1085.0,866.0,393.0,17656.0,
438,1078.0,852.0,403.0,17667.0,
439,1042.0,873.0,473.0,17612.0,
440,1006.0,894.0,498.0,17602.0,
441,970.0,862.0,538.0,17630.0,
442,1011.0,900.0,471.0,17618.0,
443,989.0,941.0,443.0,17627.0,
444,976.0,1064.0,426.0,17534.0,
445,970.0,1033.0,398.0,17599.0,
446,997.0,988.0,372.0,17643.0,
447,1006.0,946.0,392.0,17656.0,
448,1114.0,963.0,365.0,17558.0,
449,1100.0,921.0,346.0,17633.0,
450,1133.0,899.0,348.0,17620.0,
451,1090.0,880.0,368.0,17662.0,
452,1085.0,929.0,317.0,17669.0,
453,1088.0,929.0,360.0,17623.0,
454,1179.0,908.0,349.0,17564.0,
455,1187.0,889.0,379.0,17545.0,
456,1166.0,868.0,386.0,17580.0,
457,1172.0,895.0,359.0,17574.0,
458,1087.0,888.0,378.0,17647.0,
459,1146.0,969.0,299.0,17586.0,
460,1086.0,950.0,364.0,17600.0,
461,1090.0,1043.0,348.0,17519.0,
462,1080.0,1061.0,348.0,17511.0,
463,1078.0,1031.0,355.0,17536.0,
464,1058.0,1093.0,341.0,17508.0,
465,1006.0,1055.0,422.0,17517.0,
466,969.0,1100.0,373.0,17558.0,
467,997.0,1041.0,369.0,17593.0,
468,1076.0,1017.0,425.0,17482.0,
469,1130.0,1012.0,478.0,17380.0,
470,1118.0,1097.0,483.0,17302.0,
471,1061.0,1137.0,449.0,17353.0,
472,1034.0,1271.0,388.0,17307.0,
473,1006.0,1292.0,361.0,17341.0,
474,979.0,1304.0,379.0,17338.0,
475,981.0,1294.0,445.0,17280.0,
476,976.0,1348.0,419.0,17257.0,
477,1034.0,1405.0,346.0,17215.0,
478,1048.0,1374.0,361.0,17217.0,
479,999.0,1337.0,419.0,17245.0,
480,1047.0,1399.0,336.0,17218.0,
481,1092.0,1394.0,524.0,16990.0,
482,983.0,1467.0,654.0,16896.0,
483,961.0,1522.0,619.0,16898.0,
484,945.0,1596.0,593.0,16866.0,
485,982.0,1610.0,706.0,16702.0,
486,964.0,1658.0,699.0,16679.0,
487,939.0,1603.0,699.0,16759.0,
488,891.0,1599.0,690.0,16820.0,
489,882.0,1623.0,679.0,16816.0,
490,865.0,1623.0,701.0,16811.0,
491,839.0,1584.0,691.0,16886.0,
492,809.0,1638.0,698.0,16855.0,
493,792.0,1524.0,651.0,17033.0,
494,811.0,1437.0,664.0,17088.0,
495,806.0,1436.0,623.0,17135.0,
496,829.0,1376.0,616.0,17179.0,
497,843.0,1439.0,564.0,17154.0,
498,814.0,1346.0,591.0,17249.0,
499,797.0,1298.0,593.0,17312.0,
500,880.0,1185.0,578.0,17357.0,
501,903.0,1101.0,496.0,17500.0,
502,936.0,1106.0,483.0,17475.0,
503,984.0,1097.0,486.0,17433.0,
504,1043.0,1122.0,457.0,17378.0,
505,1108.0,1058.0,573.0,17261.0,
506,1203.0,999.0,608.0,17190.0,
507,1314.0,978.0,626.0,17082.0,
508,1289.0,1008.0,648.0,17055.0,
509,1346.0,986.0,670.0,16998.0,
510,1514.0,974.0,710.0,16802.0,
511,1516.0,1013.0,705.0,16766.0,
512,1506.0,1138.0,696.0,16660.0,
513,1429.0,1134.0,817.0,16620.0,
514,1363.0,1134.0,832.0,16671.0,
515,1231.0,1054.0,932.0,16783.0,
516,1231.0,1168.0,844.0,16757.0,
517,1175.0,1238.0,823.0,16764.0,
518,1150.0,1231.0,794.0,16825.0,
519,1129.0,1306.0,789.0,16776.0,
520,1024.0,1332.0,792.0,16852.0,
521,1000.0,1341.0,695.0,16964.0,
522,941.0,1420.0,658.0,16981.0,
523,1011.0,1359.0,693.0,16937.0,
524,989.0,1427.0,510.0,17074.0,
525,996.0,1341.0,535.0,17128.0,
526,984.0,1238.0,540.0,17238.0,
527,1013.0,1220.0,541.0,17226.0,
528,945.0,1126.0,605.0,17324.0,
529,941.0,1079.0,670.0,17310.0,
530,880.0,1102.0,641.0,17377.0,
531,843.0,1042.0,696.0,17419.0,
532,894.0,1098.0,623.0,17385.0,
533,903.0,1027.0,628.0,17442.0,
534,896.0,1002.0,559.0,17543.0,
535,944.0,1023.0,488.0,17545.0,
536,928.0,1027.0,477.0,17568.0,
537,1020.0,941.0,464.0,17575.0,
538,1213.0,799.0,494.0,17494.0,
539,1244.0,837.0,477.0,17442.0,
540,1232.0,840.0,543.0,17385.0,
541,1328.0,789.0,558.0,17325.0,
542,1344.0,807.0,545.0,17304.0,
543,1325.0,740.0,541.0,17394.0,
544,1301.0,754.0,507.0,17438.0,
545,1245.0,819.0,480.0,17456.0,
546,1256.0,819.0,448.0,17477.0,
547,1192.0,761.0,494.0,17553.0,
548,1218.0,763.0,440.0,17579.0,
549,1180.0,725.0,425.0,17670.0,
550,1177.0,655.0,446.0,17722.0,
551,1202.0,655.0,425.0,17718.0,
552,1228.0,681.0,377.0,17714.0,
553,1223.0,676.0,379.0,17722.0,
554,1235.0,692.0,406.0,17667.0,
555,1225.0,646.0,405.0,17724.0,
556,1219.0,638.0,411.0,17732.0,
557,1197.0,643.0,448.0,17712.0,
558,1196.0,667.0,431.0,17706.0,
559,1176.0,666.0,447.0,17711.0,
560,1183.0,651.0,429.0,17737.0,
561,1194.0,687.0,371.0,17748.0,
562,1162.0,673.0,458.0,17707.0,
563,1185.0,674.0,478.0,17663.0,
564,1185.0,704.0,413.0,17698.0,
565,1178.0,673.0,449.0,17700.0,
566,1200.0,720.0,410.0,17670.0,
567,1220.0,665.0,407.0,17708.0,
568,1223.0,675.0,414.0,17688.0,
569,1229.0,753.0,360.0,17658.0,
570,1225.0,745.0,385.0,17645.0,
571,1230.0,738.0,373.0,17659.0,
572,1210.0,742.0,336.0,17712.0,
573,1228.0,711.0,364.0,17697.0,
574,1403.0,699.0,422.0,17476.0,
575,1421.0,698.0,431.0,17450.0,
576,1388.0,683.0,479.0,17450.0,
577,1367.0,737.0,435.0,17461.0,
578,1271.0,733.0,491.0,17505.0,
579,1234.0,754.0,508.0,17504.0,
580,1258.0,703.0,538.0,17501.0,
581,1197.0,779.0,467.0,17557.0,
582,1155.0,822.0,480.0,17543.0,
583,1124.0,800.0,488.0,17588.0,
584,1154.0,825.0,464.0,17557.0,
585,1142.0,899.0,440.0,17519.0,
586,1103.0,893.0,409.0,17595.0,
587,1126.0,888.0,396.0,17590.0,
588,1075.0,795.0,432.0,17698.0,
589,1047.0,862.0,387.0,17704.0,
590,1046.0,817.0,418.0,17719.0,
591,1022.0,920.0,398.0,17660.0,
592,1014.0,975.0,311.0,17700.0,
593,989.0,905.0,395.0,17711.0,
594,993.0,925.0,331.0,17751.0,
595,987.0,923.0,338.0,17752.0,
596,982.0,925.0,320.0,17773.0,
597,981.0,884.0,316.0,17819.0,
598,989.0,832.0,304.0,17875.0,
599,1006.0,851.0,322.0,17821.0,
600,1008.0,802.0,339.0,17851.0,
601,1030.0,782.0,268.0,17920.0,
602,1093.0,776.0,312.0,17819.0,
603,1110.0,739.0,355.0,17796.0,
604,1169.0,760.0,348.0,17723.0,
605,1244.0,780.0,326.0,17650.0,
606,1386.0,749.0,347.0,17518.0,
607,1392.0,772.0,391.0,17445.0,
608,1384.0,806.0,411.0,17399.0,
609,1377.0,846.0,417.0,17360.0,
610,1316.0,833.0,486.0,17365.0,
611,1262.0,866.0,487.0,17385.0,
612,1214.0,895.0,511.0,17380.0,
613,1174.0,949.0,478.0,17399.0,
614,1155.0,853.0,466.0,17526.0,
615,1152.0,919.0,449.0,17480.0,
616,1151.0,885.0,469.0,17495.0,
617,1226.0,917.0,501.0,17356.0,
618,1226.0,882.0,449.0,17443.0,
619,1204.0,819.0,493.0,17484.0,
620,1340.0,889.0,452.0,17319.0,
621,1415.0,836.0,564.0,17185.0,
622,1435.0,930.0,580.0,17055.0,
623,1347.0,913.0,695.0,17045.0,
624,1306.0,948.0,712.0,17034.0,
625,1310.0,870.0,708.0,17112.0,
626,1263.0,946.0,664.0,17127.0,
627,1227.0,920.0,748.0,17105.0,
628,1203.0,1015.0,746.0,17036.0,
629,1176.0,1039.0,808.0,16977.0,
630,1224.0,1089.0,858.0,16829.0,
631,1205.0,1183.0,812.0,16800.0,
632,1143.0,1326.0,797.0,16734.0,
633,1083.0,1424.0,810.0,16683.0,
634,1130.0,1396.0,891.0,16583.0,
635,1123.0,1495.0,909.0,16473.0,
636,1072.0,1529.0,931.0,16468.0,
637,973.0,1674.0,923.0,16430.0,
638,959.0,1764.0,904.0,16373.0,
639,933.0,1865.0,924.0,16278.0,
640,923.0,1916.0,881.0,16280.0,
641,879.0,1925.0,809.0,16387.0,
642,813.0,1943.0,770.0,16474.0,
643,784.0,1937.0,740.0,16539.0,
644,765.0,1995.0,600.0,16640.0,
645,786.0,1898.0,595.0,16721.0,
646,746.0,1811.0,655.0,16788.0,
647,735.0,1681.0,697.0,16887.0,
648,821.0,1649.0,757.0,16773.0,
649,852.0,1587.0,754.0,16807.0,
650,893.0,1623.0,757.0,16727.0,
651,875.0,1579.0,809.0,16737.0,
652,862.0,1582.0,723.0,16833.0,
653,805.0,1600.0,829.0,16766.0,
654,764.0,1655.0,793.0,16788.0,
655,781.0,1661.0,784.0,16774.0,
656,778.0,1625.0,683.0,16914.0,
657,796.0,1579.0,711.0,16914.0,
658,756.0,1505.0,762.0,16977.0,
659,777.0,1534.0,784.0,16905.0,
660,754.0,1385.0,804.0,17057.0,
661,706.0,1380.0,795.0,17119.0,
662,693.0,1394.0,661.0,17252.0,
663,685.0,1349.0,618.0,17348.0,
664,689.0,1281.0,591.0,17439.0,
665,676.0,1328.0,531.0,17465.0,
666,685.0,1238.0,480.0,17597.0,
667,710.0,1221.0,458.0,17611.0,
668,743.0,1161.0,392.0,17704.0,
669,789.0,1154.0,355.0,17702.0,
670,813.0,1143.0,390.0,17654.0,
671,818.0,1163.0,344.0,17675.0,
672,819.0,1103.0,367.0,17711.0,
673,934.0,1074.0,373.0,17619.0,
674,999.0,1113.0,386.0,17502.0,
675,972.0,1095.0,427.0,17506.0,
676,963.0,1109.0,386.0,17542.0,
677,976.0,1125.0,398.0,17501.0,
678,972.0,1131.0,389.0,17508.0,
679,954.0,1116.0,411.0,17519.0,
680,918.0,1152.0,430.0,17500.0,
681,904.0,1137.0,399.0,17560.0,
682,864.0,1143.0,405.0,17588.0,
683,866.0,1103.0,397.0,17634.0,
684,829.0,1012.0,401.0,17758.0,
685,865.0,1002.0,333.0,17800.0,
686,852.0,959.0,316.0,17873.0,
687,860.0,946.0,319.0,17875.0,
688,862.0,918.0,259.0,17961.0,
689,900.0,889.0,285.0,17926.0,
690,952.0,884.0,237.0,17927.0,
691,951.0,809.0,287.0,17953.0,
692,983.0,801.0,272.0,17944.0,
693,1007.0,777.0,318.0,17898.0,
694,1006.0,776.0,314.0,17904.0,
695,1030.0,798.0,301.0,17871.0,
696,1058.0,764.0,284.0,17894.0,
697,1091.0,699.0,373.0,17837.0,
698,1110.0,723.0,349.0,17818.0,
699,1082.0,735.0,355.0,17828.0,
700,1088.0,676.0,384.0,17852.0,
701,1134.0,700.0,383.0,17783.0,
702,1139.0,689.0,363.0,17809.0,
703,1169.0,667.0,323.0,17841.0,
704,1205.0,639.0,305.0,17851.0,
705,1273.0,597.0,364.0,17766.0,
706,1301.0,646.0,256.0,17797.0,
707,1298.0,645.0,232.0,17825.0,
708,1326.0,596.0,265.0,17813.0,
709,1323.0,580.0,312.0,17785.0,
710,1359.0,561.0,359.0,17721.0,
711,1372.0,585.0,395.0,17648.0,
712,1405.0,670.0,329.0,17596.0,
713,1466.0,642.0,337.0,17555.0,
714,1450.0,698.0,389.0,17463.0,
715,1465.0,669.0,434.0,17432.0,
716,1508.0,752.0,374.0,17366.0,
717,1496.0,776.0,392.0,17336.0,
718,1468.0,766.0,431.0,17335.0,
719,1433.0,801.0,489.0,17277.0,
720,1392.0,889.0,549.0,17170.0,
721,1459.0,930.0,526.0,17085.0,
722,1474.0,985.0,445.0,17096.0,
723,1438.0,989.0,522.0,17051.0,
724,1359.0,1007.0,564.0,17070.0,
725,1313.0,971.0,563.0,17153.0,
726,1240.0,1008.0,604.0,17148.0,
727,1212.0,1011.0,600.0,17177.0,
728,1133.0,1065.0,543.0,17259.0,
729,1097.0,1048.0,565.0,17290.0,
730,1089.0,1069.0,525.0,17317.0,
