jour,S,I,E,R,
0,19980.0,20.0,0.0,0.0,
1,19968.0,20.0,12.0,0.0,
2,19919.0,23.0,58.0,0.0,
3,19883.0,14.0,81.0,22.0,
4,19790.0,31.0,157.0,22.0,
5,19589.0,76.0,307.0,28.0,
6,19222.0,169.0,570.0,39.0,
7,18483.0,318.0,1134.0,65.0,
8,17181.0,556.0,2144.0,119.0,
9,15254.0,1117.0,3415.0,214.0,
10,11358.0,1801.0,6464.0,377.0,
11,7940.0,2902.0,8476.0,682.0,
12,3906.0,5062.0,9965.0,1067.0,
13,1406.0,6950.0,9957.0,1687.0,
14,446.0,9292.0,7649.0,2613.0,
15,176.0,10196.0,5865.0,3763.0,
16,11.0,10405.0,4503.0,5081.0,
17,0.0,10020.0,3491.0,6489.0,
18,0.0,9777.0,2423.0,7800.0,
19,0.0,8864.0,2078.0,9058.0,
20,0.0,8463.0,1467.0,10070.0,
21,0.0,8051.0,1279.0,10670.0,
22,0.0,7060.0,1048.0,11892.0,
23,0.0,6530.0,818.0,12652.0,
24,0.0,5851.0,618.0,13531.0,
25,0.0,5498.0,413.0,14089.0,
26,0.0,4781.0,286.0,14933.0,
27,0.0,4328.0,250.0,15422.0,
28,0.0,3868.0,173.0,15959.0,
29,0.0,3702.0,173.0,16125.0,
30,0.0,3262.0,165.0,16573.0,
31,0.0,3045.0,33.0,16922.0,
32,0.0,2861.0,0.0,17139.0,
33,0.0,2627.0,0.0,17373.0,
34,1.0,2463.0,0.0,17536.0,
35,1.0,2204.0,0.0,17795.0,
36,7.0,2145.0,1.0,17847.0,
37,7.0,1919.0,1.0,18073.0,
38,7.0,1648.0,0.0,18345.0,
39,9.0,1559.0,1.0,18431.0,
40,11.0,1373.0,0.0,18616.0,
41,110.0,1259.0,4.0,18627.0,
42,165.0,1235.0,46.0,18554.0,
43,165.0,1215.0,0.0,18620.0,
44,151.0,1073.0,55.0,18721.0,
45,105.0,978.0,49.0,18868.0,
46,73.0,846.0,32.0,19049.0,
47,73.0,746.0,0.0,19181.0,
48,75.0,582.0,0.0,19343.0,
49,75.0,481.0,0.0,19444.0,
50,61.0,468.0,14.0,19457.0,
51,47.0,473.0,14.0,19466.0,
52,58.0,211.0,1.0,19730.0,
53,58.0,147.0,0.0,19795.0,
54,57.0,63.0,1.0,19879.0,
55,65.0,35.0,1.0,19899.0,
56,71.0,14.0,0.0,19915.0,
57,249.0,2.0,0.0,19749.0,
58,317.0,1.0,0.0,19682.0,
59,340.0,1.0,0.0,19659.0,
60,348.0,1.0,0.0,19651.0,
61,388.0,1.0,0.0,19611.0,
62,512.0,1.0,0.0,19487.0,
63,601.0,1.0,0.0,19398.0,
64,678.0,0.0,0.0,19322.0,
65,1007.0,0.0,0.0,18993.0,
66,1318.0,0.0,0.0,18682.0,
67,1487.0,0.0,0.0,18513.0,
68,1603.0,0.0,0.0,18397.0,
69,1873.0,0.0,0.0,18127.0,
70,2081.0,0.0,0.0,17919.0,
71,2228.0,0.0,0.0,17772.0,
72,2406.0,0.0,0.0,17594.0,
73,2832.0,0.0,0.0,17168.0,
74,2949.0,0.0,0.0,17051.0,
75,3077.0,0.0,0.0,16923.0,
76,3134.0,0.0,0.0,16866.0,
77,3207.0,0.0,0.0,16793.0,
78,3236.0,0.0,0.0,16764.0,
79,3408.0,0.0,0.0,16592.0,
80,3690.0,0.0,0.0,16310.0,
81,3903.0,0.0,0.0,16097.0,
82,3976.0,0.0,0.0,16024.0,
83,4055.0,0.0,0.0,15945.0,
84,4083.0,0.0,0.0,15917.0,
85,4381.0,0.0,0.0,15619.0,
86,4405.0,0.0,0.0,15595.0,
87,4628.0,0.0,0.0,15372.0,
88,4741.0,0.0,0.0,15259.0,
89,4750.0,0.0,0.0,15250.0,
90,4759.0,0.0,0.0,15241.0,
91,4870.0,0.0,0.0,15130.0,
92,4948.0,0.0,0.0,15052.0,
93,4982.0,0.0,0.0,15018.0,
94,5011.0,0.0,0.0,14989.0,
95,5015.0,0.0,0.0,14985.0,
96,5015.0,0.0,0.0,14985.0,
97,5015.0,0.0,0.0,14985.0,
98,5016.0,0.0,0.0,14984.0,
99,5017.0,0.0,0.0,14983.0,
100,5017.0,0.0,0.0,14983.0,
101,5017.0,0.0,0.0,14983.0,
102,5018.0,0.0,0.0,14982.0,
103,5028.0,0.0,0.0,14972.0,
104,5028.0,0.0,0.0,14972.0,
105,5047.0,0.0,0.0,14953.0,
106,5088.0,0.0,0.0,14912.0,
107,5089.0,0.0,0.0,14911.0,
108,5183.0,0.0,0.0,14817.0,
109,5246.0,0.0,0.0,14754.0,
110,5282.0,0.0,0.0,14718.0,
111,5286.0,0.0,0.0,14714.0,
112,5289.0,0.0,0.0,14711.0,
113,5292.0,0.0,0.0,14708.0,
114,5292.0,0.0,0.0,14708.0,
115,5292.0,0.0,0.0,14708.0,
116,5292.0,0.0,0.0,14708.0,
117,5292.0,0.0,0.0,14708.0,
118,5292.0,0.0,0.0,14708.0,
119,5292.0,0.0,0.0,14708.0,
120,5292.0,0.0,0.0,14708.0,
121,5292.0,0.0,0.0,14708.0,
122,5292.0,0.0,0.0,14708.0,
123,5292.0,0.0,0.0,14708.0,
124,5292.0,0.0,0.0,14708.0,
125,5292.0,0.0,0.0,14708.0,
126,5292.0,0.0,0.0,14708.0,
127,5292.0,0.0,0.0,14708.0,
128,5292.0,0.0,0.0,14708.0,
129,5295.0,0.0,0.0,14705.0,
130,5297.0,0.0,0.0,14703.0,
131,5298.0,0.0,0.0,14702.0,
132,5298.0,0.0,0.0,14702.0,
133,5337.0,0.0,0.0,14663.0,
134,5337.0,0.0,0.0,14663.0,
135,5337.0,0.0,0.0,14663.0,
136,5478.0,0.0,0.0,14522.0,
137,5589.0,0.0,0.0,14411.0,
138,5627.0,0.0,0.0,14373.0,
139,5713.0,0.0,0.0,14287.0,
140,5748.0,0.0,0.0,14252.0,
141,5841.0,0.0,0.0,14159.0,
142,5848.0,0.0,0.0,14152.0,
143,5942.0,0.0,0.0,14058.0,
144,5942.0,0.0,0.0,14058.0,
145,5950.0,0.0,0.0,14050.0,
146,6151.0,0.0,0.0,13849.0,
147,6266.0,0.0,0.0,13734.0,
148,6336.0,0.0,0.0,13664.0,
149,6367.0,0.0,0.0,13633.0,
150,6367.0,0.0,0.0,13633.0,
151,6368.0,0.0,0.0,13632.0,
152,6368.0,0.0,0.0,13632.0,
153,6368.0,0.0,0.0,13632.0,
154,6368.0,0.0,0.0,13632.0,
155,6368.0,0.0,0.0,13632.0,
156,6368.0,0.0,0.0,13632.0,
157,6368.0,0.0,0.0,13632.0,
158,6370.0,0.0,0.0,13630.0,
159,6370.0,0.0,0.0,13630.0,
160,6370.0,0.0,0.0,13630.0,
161,6374.0,0.0,0.0,13626.0,
162,6390.0,0.0,0.0,13610.0,
163,6397.0,0.0,0.0,13603.0,
164,6420.0,0.0,0.0,13580.0,
165,6481.0,0.0,0.0,13519.0,
166,6563.0,0.0,0.0,13437.0,
167,6599.0,0.0,0.0,13401.0,
168,6667.0,0.0,0.0,13333.0,
169,6726.0,0.0,0.0,13274.0,
170,6897.0,0.0,0.0,13103.0,
171,6987.0,0.0,0.0,13013.0,
172,7090.0,0.0,0.0,12910.0,
173,7162.0,0.0,0.0,12838.0,
174,7175.0,0.0,0.0,12825.0,
175,7175.0,0.0,0.0,12825.0,
176,7175.0,0.0,0.0,12825.0,
177,7175.0,0.0,0.0,12825.0,
178,7175.0,0.0,0.0,12825.0,
179,7244.0,0.0,0.0,12756.0,
180,7291.0,0.0,0.0,12709.0,
181,7362.0,0.0,0.0,12638.0,
182,7421.0,0.0,0.0,12579.0,
183,7447.0,0.0,0.0,12553.0,
184,7447.0,0.0,0.0,12553.0,
185,7448.0,0.0,0.0,12552.0,
186,7448.0,0.0,0.0,12552.0,
187,7448.0,0.0,0.0,12552.0,
188,7448.0,0.0,0.0,12552.0,
189,7448.0,0.0,0.0,12552.0,
190,7448.0,0.0,0.0,12552.0,
191,7448.0,0.0,0.0,12552.0,
192,7454.0,0.0,0.0,12546.0,
193,7460.0,0.0,0.0,12540.0,
194,7460.0,0.0,0.0,12540.0,
195,7484.0,0.0,0.0,12516.0,
196,7521.0,0.0,0.0,12479.0,
197,7532.0,0.0,0.0,12468.0,
198,7532.0,0.0,0.0,12468.0,
199,7599.0,0.0,0.0,12401.0,
200,7610.0,0.0,0.0,12390.0,
201,7611.0,0.0,0.0,12389.0,
202,7611.0,0.0,0.0,12389.0,
203,7611.0,0.0,0.0,12389.0,
204,7611.0,0.0,0.0,12389.0,
205,7612.0,0.0,0.0,12388.0,
206,7612.0,0.0,0.0,12388.0,
207,7612.0,0.0,0.0,12388.0,
208,7616.0,0.0,0.0,12384.0,
209,7616.0,0.0,0.0,12384.0,
210,7616.0,0.0,0.0,12384.0,
211,7617.0,0.0,0.0,12383.0,
212,7622.0,0.0,0.0,12378.0,
213,7625.0,0.0,0.0,12375.0,
214,7746.0,0.0,0.0,12254.0,
215,7965.0,0.0,0.0,12035.0,
216,8087.0,0.0,0.0,11913.0,
217,8124.0,0.0,0.0,11876.0,
218,8152.0,0.0,0.0,11848.0,
219,8153.0,0.0,0.0,11847.0,
220,8153.0,0.0,0.0,11847.0,
221,8153.0,0.0,0.0,11847.0,
222,8178.0,0.0,0.0,11822.0,
223,8219.0,0.0,0.0,11781.0,
224,8272.0,0.0,0.0,11728.0,
225,8335.0,0.0,0.0,11665.0,
226,8385.0,0.0,0.0,11615.0,
227,8385.0,0.0,0.0,11615.0,
228,8413.0,0.0,0.0,11587.0,
229,8413.0,0.0,0.0,11587.0,
230,8414.0,0.0,0.0,11586.0,
231,8414.0,0.0,0.0,11586.0,
232,8414.0,0.0,0.0,11586.0,
233,8414.0,0.0,0.0,11586.0,
234,8414.0,0.0,0.0,11586.0,
235,8414.0,0.0,0.0,11586.0,
236,8414.0,0.0,0.0,11586.0,
237,8414.0,0.0,0.0,11586.0,
238,8415.0,0.0,0.0,11585.0,
239,8415.0,0.0,0.0,11585.0,
240,8423.0,0.0,0.0,11577.0,
241,8426.0,0.0,0.0,11574.0,
242,8460.0,0.0,0.0,11540.0,
243,8463.0,0.0,0.0,11537.0,
244,8480.0,0.0,0.0,11520.0,
245,8498.0,0.0,0.0,11502.0,
246,8547.0,0.0,0.0,11453.0,
247,8633.0,0.0,0.0,11367.0,
248,8664.0,0.0,0.0,11336.0,
249,8744.0,0.0,0.0,11256.0,
250,8755.0,0.0,0.0,11245.0,
251,8934.0,0.0,0.0,11066.0,
252,8947.0,0.0,0.0,11053.0,
253,8948.0,0.0,0.0,11052.0,
254,8953.0,0.0,0.0,11047.0,
255,8975.0,0.0,0.0,11025.0,
256,8977.0,0.0,0.0,11023.0,
257,9020.0,0.0,0.0,10980.0,
258,9020.0,0.0,0.0,10980.0,
259,9094.0,0.0,0.0,10906.0,
260,9098.0,0.0,0.0,10902.0,
261,9232.0,0.0,0.0,10768.0,
262,9305.0,0.0,0.0,10695.0,
263,9406.0,0.0,0.0,10594.0,
264,9436.0,0.0,0.0,10564.0,
265,9470.0,0.0,0.0,10530.0,
266,9594.0,0.0,0.0,10406.0,
267,9616.0,0.0,0.0,10384.0,
268,9708.0,0.0,0.0,10292.0,
269,9767.0,0.0,0.0,10233.0,
270,9830.0,0.0,0.0,10170.0,
271,9909.0,0.0,0.0,10091.0,
272,9944.0,0.0,0.0,10056.0,
273,10042.0,0.0,0.0,9958.0,
274,10110.0,0.0,0.0,9890.0,
275,10111.0,0.0,0.0,9889.0,
276,10208.0,0.0,0.0,9792.0,
277,10254.0,0.0,0.0,9746.0,
278,10258.0,0.0,0.0,9742.0,
279,10270.0,0.0,0.0,9730.0,
280,10270.0,0.0,0.0,9730.0,
281,10270.0,0.0,0.0,9730.0,
282,10270.0,0.0,0.0,9730.0,
283,10270.0,0.0,0.0,9730.0,
284,10270.0,0.0,0.0,9730.0,
285,10270.0,0.0,0.0,9730.0,
286,10270.0,0.0,0.0,9730.0,
287,10270.0,0.0,0.0,9730.0,
288,10272.0,0.0,0.0,9728.0,
289,10272.0,0.0,0.0,9728.0,
290,10272.0,0.0,0.0,9728.0,
291,10277.0,0.0,0.0,9723.0,
292,10287.0,0.0,0.0,9713.0,
293,10310.0,0.0,0.0,9690.0,
294,10346.0,0.0,0.0,9654.0,
295,10413.0,0.0,0.0,9587.0,
296,10425.0,0.0,0.0,9575.0,
297,10482.0,0.0,0.0,9518.0,
298,10515.0,0.0,0.0,9485.0,
299,10550.0,0.0,0.0,9450.0,
300,10598.0,0.0,0.0,9402.0,
301,10603.0,0.0,0.0,9397.0,
302,10700.0,0.0,0.0,9300.0,
303,10729.0,0.0,0.0,9271.0,
304,10779.0,0.0,0.0,9221.0,
305,10837.0,0.0,0.0,9163.0,
306,10943.0,0.0,0.0,9057.0,
307,11003.0,0.0,0.0,8997.0,
308,11066.0,0.0,0.0,8934.0,
309,11067.0,0.0,0.0,8933.0,
310,11071.0,0.0,0.0,8929.0,
311,11142.0,0.0,0.0,8858.0,
312,11166.0,0.0,0.0,8834.0,
313,11262.0,0.0,0.0,8738.0,
314,11313.0,0.0,0.0,8687.0,
315,11317.0,0.0,0.0,8683.0,
316,11322.0,0.0,0.0,8678.0,
317,11322.0,0.0,0.0,8678.0,
318,11322.0,0.0,0.0,8678.0,
319,11322.0,0.0,0.0,8678.0,
320,11322.0,0.0,0.0,8678.0,
321,11322.0,0.0,0.0,8678.0,
322,11322.0,0.0,0.0,8678.0,
323,11322.0,0.0,0.0,8678.0,
324,11322.0,0.0,0.0,8678.0,
325,11325.0,0.0,0.0,8675.0,
326,11335.0,0.0,0.0,8665.0,
327,11335.0,0.0,0.0,8665.0,
328,11376.0,0.0,0.0,8624.0,
329,11439.0,0.0,0.0,8561.0,
330,11439.0,0.0,0.0,8561.0,
331,11439.0,0.0,0.0,8561.0,
332,11558.0,0.0,0.0,8442.0,
333,11588.0,0.0,0.0,8412.0,
334,11593.0,0.0,0.0,8407.0,
335,11593.0,0.0,0.0,8407.0,
336,11594.0,0.0,0.0,8406.0,
337,11594.0,0.0,0.0,8406.0,
338,11594.0,0.0,0.0,8406.0,
339,11594.0,0.0,0.0,8406.0,
340,11594.0,0.0,0.0,8406.0,
341,11594.0,0.0,0.0,8406.0,
342,11594.0,0.0,0.0,8406.0,
343,11594.0,0.0,0.0,8406.0,
344,11594.0,0.0,0.0,8406.0,
345,11594.0,0.0,0.0,8406.0,
346,11594.0,0.0,0.0,8406.0,
347,11594.0,0.0,0.0,8406.0,
348,11594.0,0.0,0.0,8406.0,
349,11594.0,0.0,0.0,8406.0,
350,11594.0,0.0,0.0,8406.0,
351,11594.0,0.0,0.0,8406.0,
352,11594.0,0.0,0.0,8406.0,
353,11594.0,0.0,0.0,8406.0,
354,11594.0,0.0,0.0,8406.0,
355,11594.0,0.0,0.0,8406.0,
356,11594.0,0.0,0.0,8406.0,
357,11594.0,0.0,0.0,8406.0,
358,11594.0,0.0,0.0,8406.0,
359,11594.0,0.0,0.0,8406.0,
360,11594.0,0.0,0.0,8406.0,
361,11594.0,0.0,0.0,8406.0,
362,11594.0,0.0,0.0,8406.0,
363,11594.0,0.0,0.0,8406.0,
364,11595.0,0.0,0.0,8405.0,
365,11595.0,0.0,0.0,8405.0,
366,11597.0,0.0,0.0,8403.0,
367,11601.0,0.0,0.0,8399.0,
368,11603.0,0.0,0.0,8397.0,
369,11603.0,0.0,0.0,8397.0,
370,11603.0,0.0,0.0,8397.0,
371,11618.0,0.0,0.0,8382.0,
372,11644.0,0.0,0.0,8356.0,
373,11676.0,0.0,0.0,8324.0,
374,11886.0,0.0,0.0,8114.0,
375,11889.0,0.0,0.0,8111.0,
376,11992.0,0.0,0.0,8008.0,
377,12100.0,0.0,0.0,7900.0,
378,12123.0,0.0,0.0,7877.0,
379,12211.0,0.0,0.0,7789.0,
380,12216.0,0.0,0.0,7784.0,
381,12324.0,0.0,0.0,7676.0,
382,12324.0,0.0,0.0,7676.0,
383,12365.0,0.0,0.0,7635.0,
384,12396.0,0.0,0.0,7604.0,
385,12401.0,0.0,0.0,7599.0,
386,12401.0,0.0,0.0,7599.0,
387,12401.0,0.0,0.0,7599.0,
388,12401.0,0.0,0.0,7599.0,
389,12401.0,0.0,0.0,7599.0,
390,12401.0,0.0,0.0,7599.0,
391,12401.0,0.0,0.0,7599.0,
392,12401.0,0.0,0.0,7599.0,
393,12404.0,0.0,0.0,7596.0,
394,12409.0,0.0,0.0,7591.0,
395,12410.0,0.0,0.0,7590.0,
396,12412.0,0.0,0.0,7588.0,
397,12412.0,0.0,0.0,7588.0,
398,12421.0,0.0,0.0,7579.0,
399,12527.0,0.0,0.0,7473.0,
400,12527.0,0.0,0.0,7473.0,
401,12584.0,0.0,0.0,7416.0,
402,12640.0,0.0,0.0,7360.0,
403,12654.0,0.0,0.0,7346.0,
404,12656.0,0.0,0.0,7344.0,
405,12658.0,0.0,0.0,7342.0,
406,12658.0,0.0,0.0,7342.0,
407,12658.0,0.0,0.0,7342.0,
408,12666.0,0.0,0.0,7334.0,
409,12681.0,0.0,0.0,7319.0,
410,12684.0,0.0,0.0,7316.0,
411,12715.0,0.0,0.0,7285.0,
412,12722.0,0.0,0.0,7278.0,
413,12816.0,0.0,0.0,7184.0,
414,12877.0,0.0,0.0,7123.0,
415,12914.0,0.0,0.0,7086.0,
416,12920.0,0.0,0.0,7080.0,
417,12920.0,0.0,0.0,7080.0,
418,12922.0,0.0,0.0,7078.0,
419,12924.0,0.0,0.0,7076.0,
420,12938.0,0.0,0.0,7062.0,
421,12939.0,0.0,0.0,7061.0,
422,12939.0,0.0,0.0,7061.0,
423,12939.0,0.0,0.0,7061.0,
424,13043.0,0.0,0.0,6957.0,
425,13079.0,0.0,0.0,6921.0,
426,13174.0,0.0,0.0,6826.0,
427,13182.0,0.0,0.0,6818.0,
428,13183.0,0.0,0.0,6817.0,
429,13183.0,0.0,0.0,6817.0,
430,13183.0,0.0,0.0,6817.0,
431,13183.0,0.0,0.0,6817.0,
432,13184.0,0.0,0.0,6816.0,
433,13184.0,0.0,0.0,6816.0,
434,13184.0,0.0,0.0,6816.0,
435,13184.0,0.0,0.0,6816.0,
436,13184.0,0.0,0.0,6816.0,
437,13226.0,0.0,0.0,6774.0,
438,13281.0,0.0,0.0,6719.0,
439,13358.0,0.0,0.0,6642.0,
440,13419.0,0.0,0.0,6581.0,
441,13427.0,0.0,0.0,6573.0,
442,13442.0,0.0,0.0,6558.0,
443,13442.0,0.0,0.0,6558.0,
444,13446.0,0.0,0.0,6554.0,
445,13446.0,0.0,0.0,6554.0,
446,13446.0,0.0,0.0,6554.0,
447,13446.0,0.0,0.0,6554.0,
448,13446.0,0.0,0.0,6554.0,
449,13446.0,0.0,0.0,6554.0,
450,13446.0,0.0,0.0,6554.0,
451,13446.0,0.0,0.0,6554.0,
452,13446.0,0.0,0.0,6554.0,
453,13446.0,0.0,0.0,6554.0,
454,13446.0,0.0,0.0,6554.0,
455,13446.0,0.0,0.0,6554.0,
456,13446.0,0.0,0.0,6554.0,
457,13448.0,0.0,0.0,6552.0,
458,13448.0,0.0,0.0,6552.0,
459,13453.0,0.0,0.0,6547.0,
460,13464.0,0.0,0.0,6536.0,
461,13464.0,0.0,0.0,6536.0,
462,13497.0,0.0,0.0,6503.0,
463,13498.0,0.0,0.0,6502.0,
464,13590.0,0.0,0.0,6410.0,
465,13655.0,0.0,0.0,6345.0,
466,13693.0,0.0,0.0,6307.0,
467,13705.0,0.0,0.0,6295.0,
468,13706.0,0.0,0.0,6294.0,
469,13706.0,0.0,0.0,6294.0,
470,13780.0,0.0,0.0,6220.0,
471,13782.0,0.0,0.0,6218.0,
472,13794.0,0.0,0.0,6206.0,
473,13866.0,0.0,0.0,6134.0,
474,13941.0,0.0,0.0,6059.0,
475,13948.0,0.0,0.0,6052.0,
476,13963.0,0.0,0.0,6037.0,
477,13964.0,0.0,0.0,6036.0,
478,13968.0,0.0,0.0,6032.0,
479,13968.0,0.0,0.0,6032.0,
480,13968.0,0.0,0.0,6032.0,
481,13968.0,0.0,0.0,6032.0,
482,13968.0,0.0,0.0,6032.0,
483,13968.0,0.0,0.0,6032.0,
484,13968.0,0.0,0.0,6032.0,
485,13968.0,0.0,0.0,6032.0,
486,13968.0,0.0,0.0,6032.0,
487,13968.0,0.0,0.0,6032.0,
488,13968.0,0.0,0.0,6032.0,
489,13968.0,0.0,0.0,6032.0,
490,13968.0,0.0,0.0,6032.0,
491,13969.0,0.0,0.0,6031.0,
492,13971.0,0.0,0.0,6029.0,
493,13971.0,0.0,0.0,6029.0,
494,13976.0,0.0,0.0,6024.0,
495,13978.0,0.0,0.0,6022.0,
496,13978.0,0.0,0.0,6022.0,
497,14018.0,0.0,0.0,5982.0,
498,14085.0,0.0,0.0,5915.0,
499,14105.0,0.0,0.0,5895.0,
500,14186.0,0.0,0.0,5814.0,
501,14224.0,0.0,0.0,5776.0,
502,14246.0,0.0,0.0,5754.0,
503,14249.0,0.0,0.0,5751.0,
504,14273.0,0.0,0.0,5727.0,
505,14273.0,0.0,0.0,5727.0,
506,14293.0,0.0,0.0,5707.0,
507,14359.0,0.0,0.0,5641.0,
508,14476.0,0.0,0.0,5524.0,
509,14689.0,0.0,0.0,5311.0,
510,14716.0,0.0,0.0,5284.0,
511,14770.0,0.0,0.0,5230.0,
512,14779.0,0.0,0.0,5221.0,
513,14780.0,0.0,0.0,5220.0,
514,14780.0,0.0,0.0,5220.0,
515,14782.0,0.0,0.0,5218.0,
516,14784.0,0.0,0.0,5216.0,
517,14787.0,0.0,0.0,5213.0,
518,14787.0,0.0,0.0,5213.0,
519,14787.0,0.0,0.0,5213.0,
520,14807.0,0.0,0.0,5193.0,
521,14845.0,0.0,0.0,5155.0,
522,14852.0,0.0,0.0,5148.0,
523,14853.0,0.0,0.0,5147.0,
524,14892.0,0.0,0.0,5108.0,
525,15020.0,0.0,0.0,4980.0,
526,15046.0,0.0,0.0,4954.0,
527,15052.0,0.0,0.0,4948.0,
528,15052.0,0.0,0.0,4948.0,
529,15052.0,0.0,0.0,4948.0,
530,15052.0,0.0,0.0,4948.0,
531,15052.0,0.0,0.0,4948.0,
532,15052.0,0.0,0.0,4948.0,
533,15052.0,0.0,0.0,4948.0,
534,15052.0,0.0,0.0,4948.0,
535,15052.0,0.0,0.0,4948.0,
536,15052.0,0.0,0.0,4948.0,
537,15052.0,0.0,0.0,4948.0,
538,15052.0,0.0,0.0,4948.0,
539,15052.0,0.0,0.0,4948.0,
540,15052.0,0.0,0.0,4948.0,
541,15064.0,0.0,0.0,4936.0,
542,15079.0,0.0,0.0,4921.0,
543,15115.0,0.0,0.0,4885.0,
544,15181.0,0.0,0.0,4819.0,
545,15233.0,0.0,0.0,4767.0,
546,15253.0,0.0,0.0,4747.0,
547,15299.0,0.0,0.0,4701.0,
548,15314.0,0.0,0.0,4686.0,
549,15314.0,0.0,0.0,4686.0,
550,15314.0,0.0,0.0,4686.0,
551,15314.0,0.0,0.0,4686.0,
552,15314.0,0.0,0.0,4686.0,
553,15314.0,0.0,0.0,4686.0,
554,15314.0,0.0,0.0,4686.0,
555,15314.0,0.0,0.0,4686.0,
556,15314.0,0.0,0.0,4686.0,
557,15314.0,0.0,0.0,4686.0,
558,15314.0,0.0,0.0,4686.0,
559,15314.0,0.0,0.0,4686.0,
560,15314.0,0.0,0.0,4686.0,
561,15314.0,0.0,0.0,4686.0,
562,15314.0,0.0,0.0,4686.0,
563,15314.0,0.0,0.0,4686.0,
564,15314.0,0.0,0.0,4686.0,
565,15314.0,0.0,0.0,4686.0,
566,15314.0,0.0,0.0,4686.0,
567,15314.0,0.0,0.0,4686.0,
568,15314.0,0.0,0.0,4686.0,
569,15314.0,0.0,0.0,4686.0,
570,15314.0,0.0,0.0,4686.0,
571,15314.0,0.0,0.0,4686.0,
572,15314.0,0.0,0.0,4686.0,
573,15314.0,0.0,0.0,4686.0,
574,15314.0,0.0,0.0,4686.0,
575,15314.0,0.0,0.0,4686.0,
576,15314.0,0.0,0.0,4686.0,
577,15314.0,0.0,0.0,4686.0,
578,15314.0,0.0,0.0,4686.0,
579,15314.0,0.0,0.0,4686.0,
580,15315.0,0.0,0.0,4685.0,
581,15316.0,0.0,0.0,4684.0,
582,15316.0,0.0,0.0,4684.0,
583,15316.0,0.0,0.0,4684.0,
584,15316.0,0.0,0.0,4684.0,
585,15330.0,0.0,0.0,4670.0,
586,15330.0,0.0,0.0,4670.0,
587,15334.0,0.0,0.0,4666.0,
588,15334.0,0.0,0.0,4666.0,
589,15449.0,0.0,0.0,4551.0,
590,15531.0,0.0,0.0,4469.0,
591,15575.0,0.0,0.0,4425.0,
592,15578.0,0.0,0.0,4422.0,
593,15587.0,0.0,0.0,4413.0,
594,15595.0,0.0,0.0,4405.0,
595,15595.0,0.0,0.0,4405.0,
596,15621.0,0.0,0.0,4379.0,
597,15621.0,0.0,0.0,4379.0,
598,15630.0,0.0,0.0,4370.0,
599,15633.0,0.0,0.0,4367.0,
600,15781.0,0.0,0.0,4219.0,
601,15849.0,0.0,0.0,4151.0,
602,15859.0,0.0,0.0,4141.0,
603,15895.0,0.0,0.0,4105.0,
604,15953.0,0.0,0.0,4047.0,
605,16030.0,0.0,0.0,3970.0,
606,16030.0,0.0,0.0,3970.0,
607,16109.0,0.0,0.0,3891.0,
608,16116.0,0.0,0.0,3884.0,
609,16119.0,0.0,0.0,3881.0,
610,16120.0,0.0,0.0,3880.0,
611,16120.0,0.0,0.0,3880.0,
612,16120.0,0.0,0.0,3880.0,
613,16120.0,0.0,0.0,3880.0,
614,16120.0,0.0,0.0,3880.0,
615,16127.0,0.0,0.0,3873.0,
616,16127.0,0.0,0.0,3873.0,
617,16162.0,0.0,0.0,3838.0,
618,16240.0,0.0,0.0,3760.0,
619,16305.0,0.0,0.0,3695.0,
620,16311.0,0.0,0.0,3689.0,
621,16321.0,0.0,0.0,3679.0,
622,16390.0,0.0,0.0,3610.0,
623,16394.0,0.0,0.0,3606.0,
624,16399.0,0.0,0.0,3601.0,
625,16408.0,0.0,0.0,3592.0,
626,16432.0,0.0,0.0,3568.0,
627,16432.0,0.0,0.0,3568.0,
628,16537.0,0.0,0.0,3463.0,
629,16575.0,0.0,0.0,3425.0,
630,16582.0,0.0,0.0,3418.0,
631,16582.0,0.0,0.0,3418.0,
632,16641.0,0.0,0.0,3359.0,
633,16641.0,0.0,0.0,3359.0,
634,16641.0,0.0,0.0,3359.0,
635,16641.0,0.0,0.0,3359.0,
636,16641.0,0.0,0.0,3359.0,
637,16641.0,0.0,0.0,3359.0,
638,16645.0,0.0,0.0,3355.0,
639,16652.0,0.0,0.0,3348.0,
640,16652.0,0.0,0.0,3348.0,
641,16657.0,0.0,0.0,3343.0,
642,16657.0,0.0,0.0,3343.0,
643,16664.0,0.0,0.0,3336.0,
644,16813.0,0.0,0.0,3187.0,
645,16825.0,0.0,0.0,3175.0,
646,16889.0,0.0,0.0,3111.0,
647,16935.0,0.0,0.0,3065.0,
648,17084.0,0.0,0.0,2916.0,
649,17095.0,0.0,0.0,2905.0,
650,17147.0,0.0,0.0,2853.0,
651,17173.0,0.0,0.0,2827.0,
652,17173.0,0.0,0.0,2827.0,
653,17173.0,0.0,0.0,2827.0,
654,17202.0,0.0,0.0,2798.0,
655,17202.0,0.0,0.0,2798.0,
656,17213.0,0.0,0.0,2787.0,
657,17237.0,0.0,0.0,2763.0,
658,17274.0,0.0,0.0,2726.0,
659,17406.0,0.0,0.0,2594.0,
660,17432.0,0.0,0.0,2568.0,
661,17443.0,0.0,0.0,2557.0,
662,17458.0,0.0,0.0,2542.0,
663,17480.0,0.0,0.0,2520.0,
664,17512.0,0.0,0.0,2488.0,
665,17513.0,0.0,0.0,2487.0,
666,17603.0,0.0,0.0,2397.0,
667,17604.0,0.0,0.0,2396.0,
668,17604.0,0.0,0.0,2396.0,
669,17671.0,0.0,0.0,2329.0,
670,17702.0,0.0,0.0,2298.0,
671,17705.0,0.0,0.0,2295.0,
672,17705.0,0.0,0.0,2295.0,
673,17705.0,0.0,0.0,2295.0,
674,17705.0,0.0,0.0,2295.0,
675,17705.0,0.0,0.0,2295.0,
676,17705.0,0.0,0.0,2295.0,
677,17705.0,0.0,0.0,2295.0,
678,17705.0,0.0,0.0,2295.0,
679,17705.0,0.0,0.0,2295.0,
680,17705.0,0.0,0.0,2295.0,
681,17705.0,0.0,0.0,2295.0,
682,17705.0,0.0,0.0,2295.0,
683,17705.0,0.0,0.0,2295.0,
684,17705.0,0.0,0.0,2295.0,
685,17705.0,0.0,0.0,2295.0,
686,17705.0,0.0,0.0,2295.0,
687,17705.0,0.0,0.0,2295.0,
688,17705.0,0.0,0.0,2295.0,
689,17705.0,0.0,0.0,2295.0,
690,17709.0,0.0,0.0,2291.0,
691,17714.0,0.0,0.0,2286.0,
692,17714.0,0.0,0.0,2286.0,
693,17739.0,0.0,0.0,2261.0,
694,17739.0,0.0,0.0,2261.0,
695,17741.0,0.0,0.0,2259.0,
696,17773.0,0.0,0.0,2227.0,
697,17776.0,0.0,0.0,2224.0,
698,17812.0,0.0,0.0,2188.0,
699,17940.0,0.0,0.0,2060.0,
700,17956.0,0.0,0.0,2044.0,
701,17962.0,0.0,0.0,2038.0,
702,17982.0,0.0,0.0,2018.0,
703,17982.0,0.0,0.0,2018.0,
704,17982.0,0.0,0.0,2018.0,
705,17982.0,0.0,0.0,2018.0,
706,17982.0,0.0,0.0,2018.0,
707,17982.0,0.0,0.0,2018.0,
708,17982.0,0.0,0.0,2018.0,
709,17982.0,0.0,0.0,2018.0,
710,17982.0,0.0,0.0,2018.0,
711,17982.0,0.0,0.0,2018.0,
712,17982.0,0.0,0.0,2018.0,
713,17982.0,0.0,0.0,2018.0,
714,17982.0,0.0,0.0,2018.0,
715,17982.0,0.0,0.0,2018.0,
716,17982.0,0.0,0.0,2018.0,
717,17982.0,0.0,0.0,2018.0,
718,17982.0,0.0,0.0,2018.0,
719,17982.0,0.0,0.0,2018.0,
720,17982.0,0.0,0.0,2018.0,
721,17982.0,0.0,0.0,2018.0,
722,17982.0,0.0,0.0,2018.0,
723,17982.0,0.0,0.0,2018.0,
724,17982.0,0.0,0.0,2018.0,
725,17982.0,0.0,0.0,2018.0,
726,17982.0,0.0,0.0,2018.0,
727,17982.0,0.0,0.0,2018.0,
728,17982.0,0.0,0.0,2018.0,
729,17982.0,0.0,0.0,2018.0,
730,17982.0,0.0,0.0,2018.0,
