jour,S,I,E,R,
0,19980.0,20.0,0.0,0.0,
1,19963.0,20.0,17.0,0.0,
2,19898.0,25.0,77.0,0.0,
3,19790.0,52.0,158.0,0.0,
4,19543.0,109.0,342.0,6.0,
5,18983.0,202.0,806.0,9.0,
6,18042.0,365.0,1546.0,47.0,
7,16295.0,858.0,2733.0,114.0,
8,13322.0,1374.0,5031.0,273.0,
9,9551.0,2771.0,7225.0,453.0,
10,5398.0,4501.0,9029.0,1072.0,
11,2128.0,6111.0,9750.0,2011.0,
12,1054.0,7535.0,8020.0,3391.0,
13,131.0,8453.0,6662.0,4754.0,
14,18.0,9088.0,4826.0,6068.0,
15,1.0,8738.0,3679.0,7582.0,
16,0.0,8974.0,2124.0,8902.0,
17,16.0,8093.0,1589.0,10302.0,
18,11.0,7405.0,1058.0,11526.0,
19,27.0,7199.0,635.0,12139.0,
20,58.0,6695.0,494.0,12753.0,
21,59.0,5949.0,431.0,13561.0,
22,57.0,5579.0,216.0,14148.0,
23,61.0,4848.0,96.0,14995.0,
24,63.0,4148.0,73.0,15716.0,
25,71.0,3427.0,4.0,16498.0,
26,74.0,3064.0,52.0,16810.0,
27,74.0,2648.0,50.0,17228.0,
28,24.0,2464.0,52.0,17460.0,
29,22.0,2144.0,54.0,17780.0,
30,17.0,2100.0,7.0,17876.0,
31,33.0,1532.0,5.0,18430.0,
32,28.0,1155.0,15.0,18802.0,
33,45.0,886.0,24.0,19045.0,
34,88.0,704.0,22.0,19186.0,
35,90.0,408.0,13.0,19489.0,
36,127.0,275.0,2.0,19596.0,
37,128.0,189.0,2.0,19681.0,
38,130.0,51.0,0.0,19819.0,
39,177.0,29.0,3.0,19791.0,
40,177.0,3.0,3.0,19817.0,
41,229.0,3.0,0.0,19768.0,
42,231.0,0.0,0.0,19769.0,
43,236.0,0.0,0.0,19764.0,
44,236.0,0.0,0.0,19764.0,
45,251.0,0.0,0.0,19749.0,
46,260.0,0.0,0.0,19740.0,
47,273.0,0.0,0.0,19727.0,
48,273.0,0.0,0.0,19727.0,
49,275.0,0.0,0.0,19725.0,
50,276.0,0.0,0.0,19724.0,
51,279.0,0.0,0.0,19721.0,
52,292.0,0.0,0.0,19708.0,
53,292.0,0.0,0.0,19708.0,
54,292.0,0.0,0.0,19708.0,
55,292.0,0.0,0.0,19708.0,
56,306.0,0.0,0.0,19694.0,
57,306.0,0.0,0.0,19694.0,
58,512.0,0.0,0.0,19488.0,
59,545.0,0.0,0.0,19455.0,
60,587.0,0.0,0.0,19413.0,
61,688.0,0.0,0.0,19312.0,
62,736.0,0.0,0.0,19264.0,
63,866.0,0.0,0.0,19134.0,
64,872.0,0.0,0.0,19128.0,
65,969.0,0.0,0.0,19031.0,
66,1060.0,0.0,0.0,18940.0,
67,1191.0,0.0,0.0,18809.0,
68,1217.0,0.0,0.0,18783.0,
69,1280.0,0.0,0.0,18720.0,
70,1294.0,0.0,0.0,18706.0,
71,1341.0,0.0,0.0,18659.0,
72,1352.0,0.0,0.0,18648.0,
73,1352.0,0.0,0.0,18648.0,
74,1352.0,0.0,0.0,18648.0,
75,1352.0,0.0,0.0,18648.0,
76,1356.0,0.0,0.0,18644.0,
77,1359.0,0.0,0.0,18641.0,
78,1373.0,0.0,0.0,18627.0,
79,1403.0,0.0,0.0,18597.0,
80,1405.0,0.0,0.0,18595.0,
81,1472.0,0.0,0.0,18528.0,
82,1545.0,0.0,0.0,18455.0,
83,1597.0,0.0,0.0,18403.0,
84,1639.0,0.0,0.0,18361.0,
85,1721.0,0.0,0.0,18279.0,
86,1790.0,0.0,0.0,18210.0,
87,1922.0,0.0,0.0,18078.0,
88,2030.0,0.0,0.0,17970.0,
89,2040.0,0.0,0.0,17960.0,
90,2042.0,0.0,0.0,17958.0,
91,2153.0,0.0,0.0,17847.0,
92,2179.0,0.0,0.0,17821.0,
93,2192.0,0.0,0.0,17808.0,
94,2240.0,0.0,0.0,17760.0,
95,2284.0,0.0,0.0,17716.0,
96,2345.0,0.0,0.0,17655.0,
97,2484.0,0.0,0.0,17516.0,
98,2512.0,0.0,0.0,17488.0,
99,2637.0,0.0,0.0,17363.0,
100,2720.0,0.0,0.0,17280.0,
101,2735.0,0.0,0.0,17265.0,
102,2789.0,0.0,0.0,17211.0,
103,2889.0,0.0,0.0,17111.0,
104,2898.0,0.0,0.0,17102.0,
105,2948.0,0.0,0.0,17052.0,
106,2989.0,0.0,0.0,17011.0,
107,2990.0,0.0,0.0,17010.0,
108,2990.0,0.0,0.0,17010.0,
109,2990.0,0.0,0.0,17010.0,
110,2990.0,0.0,0.0,17010.0,
111,2992.0,0.0,0.0,17008.0,
112,2992.0,0.0,0.0,17008.0,
113,2992.0,0.0,0.0,17008.0,
114,2992.0,0.0,0.0,17008.0,
115,2993.0,0.0,0.0,17007.0,
116,3006.0,0.0,0.0,16994.0,
117,3006.0,0.0,0.0,16994.0,
118,3149.0,0.0,0.0,16851.0,
119,3239.0,0.0,0.0,16761.0,
120,3246.0,0.0,0.0,16754.0,
121,3267.0,0.0,0.0,16733.0,
122,3268.0,0.0,0.0,16732.0,
123,3268.0,0.0,0.0,16732.0,
124,3268.0,0.0,0.0,16732.0,
125,3274.0,0.0,0.0,16726.0,
126,3287.0,0.0,0.0,16713.0,
127,3295.0,0.0,0.0,16705.0,
128,3373.0,0.0,0.0,16627.0,
129,3415.0,0.0,0.0,16585.0,
130,3542.0,0.0,0.0,16458.0,
131,3556.0,0.0,0.0,16444.0,
132,3702.0,0.0,0.0,16298.0,
133,3847.0,0.0,0.0,16153.0,
134,3925.0,0.0,0.0,16075.0,
135,3984.0,0.0,0.0,16016.0,
136,4107.0,0.0,0.0,15893.0,
137,4201.0,0.0,0.0,15799.0,
138,4284.0,0.0,0.0,15716.0,
139,4349.0,0.0,0.0,15651.0,
140,4452.0,0.0,0.0,15548.0,
141,4728.0,0.0,0.0,15272.0,
142,4929.0,0.0,0.0,15071.0,
143,4978.0,0.0,0.0,15022.0,
144,5006.0,0.0,0.0,14994.0,
145,5122.0,0.0,0.0,14878.0,
146,5136.0,0.0,0.0,14864.0,
147,5136.0,0.0,0.0,14864.0,
148,5145.0,0.0,0.0,14855.0,
149,5161.0,0.0,0.0,14839.0,
150,5161.0,0.0,0.0,14839.0,
151,5201.0,0.0,0.0,14799.0,
152,5289.0,0.0,0.0,14711.0,
153,5310.0,0.0,0.0,14690.0,
154,5390.0,0.0,0.0,14610.0,
155,5403.0,0.0,0.0,14597.0,
156,5408.0,0.0,0.0,14592.0,
157,5411.0,0.0,0.0,14589.0,
158,5411.0,0.0,0.0,14589.0,
159,5441.0,0.0,0.0,14559.0,
160,5488.0,0.0,0.0,14512.0,
161,5557.0,0.0,0.0,14443.0,
162,5624.0,0.0,0.0,14376.0,
163,5626.0,0.0,0.0,14374.0,
164,5665.0,0.0,0.0,14335.0,
165,5666.0,0.0,0.0,14334.0,
166,5667.0,0.0,0.0,14333.0,
167,5669.0,0.0,0.0,14331.0,
168,5670.0,0.0,0.0,14330.0,
169,5675.0,0.0,0.0,14325.0,
170,5675.0,0.0,0.0,14325.0,
171,5696.0,0.0,0.0,14304.0,
172,5696.0,0.0,0.0,14304.0,
173,5759.0,0.0,0.0,14241.0,
174,5781.0,0.0,0.0,14219.0,
175,5794.0,0.0,0.0,14206.0,
176,6019.0,0.0,0.0,13981.0,
177,6196.0,0.0,0.0,13804.0,
178,6272.0,0.0,0.0,13728.0,
179,6296.0,0.0,0.0,13704.0,
180,6393.0,0.0,0.0,13607.0,
181,6395.0,0.0,0.0,13605.0,
182,6476.0,0.0,0.0,13524.0,
183,6476.0,0.0,0.0,13524.0,
184,6482.0,0.0,0.0,13518.0,
185,6482.0,0.0,0.0,13518.0,
186,6492.0,0.0,0.0,13508.0,
187,6493.0,0.0,0.0,13507.0,
188,6493.0,0.0,0.0,13507.0,
189,6496.0,0.0,0.0,13504.0,
190,6496.0,0.0,0.0,13504.0,
191,6496.0,0.0,0.0,13504.0,
192,6496.0,0.0,0.0,13504.0,
193,6524.0,0.0,0.0,13476.0,
194,6524.0,0.0,0.0,13476.0,
195,6755.0,0.0,0.0,13245.0,
196,6769.0,0.0,0.0,13231.0,
197,6772.0,0.0,0.0,13228.0,
198,6777.0,0.0,0.0,13223.0,
199,6869.0,0.0,0.0,13131.0,
200,6869.0,0.0,0.0,13131.0,
201,6869.0,0.0,0.0,13131.0,
202,7015.0,0.0,0.0,12985.0,
203,7039.0,0.0,0.0,12961.0,
204,7039.0,0.0,0.0,12961.0,
205,7040.0,0.0,0.0,12960.0,
206,7040.0,0.0,0.0,12960.0,
207,7040.0,0.0,0.0,12960.0,
208,7040.0,0.0,0.0,12960.0,
209,7040.0,0.0,0.0,12960.0,
210,7040.0,0.0,0.0,12960.0,
211,7040.0,0.0,0.0,12960.0,
212,7040.0,0.0,0.0,12960.0,
213,7040.0,0.0,0.0,12960.0,
214,7041.0,0.0,0.0,12959.0,
215,7051.0,0.0,0.0,12949.0,
216,7051.0,0.0,0.0,12949.0,
217,7051.0,0.0,0.0,12949.0,
218,7051.0,0.0,0.0,12949.0,
219,7053.0,0.0,0.0,12947.0,
220,7197.0,0.0,0.0,12803.0,
221,7254.0,0.0,0.0,12746.0,
222,7254.0,0.0,0.0,12746.0,
223,7254.0,0.0,0.0,12746.0,
224,7303.0,0.0,0.0,12697.0,
225,7303.0,0.0,0.0,12697.0,
226,7319.0,0.0,0.0,12681.0,
227,7319.0,0.0,0.0,12681.0,
228,7345.0,0.0,0.0,12655.0,
229,7366.0,0.0,0.0,12634.0,
230,7454.0,0.0,0.0,12546.0,
231,7519.0,0.0,0.0,12481.0,
232,7654.0,0.0,0.0,12346.0,
233,7694.0,0.0,0.0,12306.0,
234,7927.0,0.0,0.0,12073.0,
235,8017.0,0.0,0.0,11983.0,
236,8112.0,0.0,0.0,11888.0,
237,8122.0,0.0,0.0,11878.0,
238,8147.0,0.0,0.0,11853.0,
239,8147.0,0.0,0.0,11853.0,
240,8203.0,0.0,0.0,11797.0,
241,8215.0,0.0,0.0,11785.0,
242,8321.0,0.0,0.0,11679.0,
243,8442.0,0.0,0.0,11558.0,
244,8463.0,0.0,0.0,11537.0,
245,8634.0,0.0,0.0,11366.0,
246,8668.0,0.0,0.0,11332.0,
247,8669.0,0.0,0.0,11331.0,
248,8670.0,0.0,0.0,11330.0,
249,8670.0,0.0,0.0,11330.0,
250,8674.0,0.0,0.0,11326.0,
251,8674.0,0.0,0.0,11326.0,
252,8681.0,0.0,0.0,11319.0,
253,8697.0,0.0,0.0,11303.0,
254,8720.0,0.0,0.0,11280.0,
255,8781.0,0.0,0.0,11219.0,
256,8781.0,0.0,0.0,11219.0,
257,8790.0,0.0,0.0,11210.0,
258,8867.0,0.0,0.0,11133.0,
259,8944.0,0.0,0.0,11056.0,
260,8946.0,0.0,0.0,11054.0,
261,8968.0,0.0,0.0,11032.0,
262,8998.0,0.0,0.0,11002.0,
263,9001.0,0.0,0.0,10999.0,
264,9005.0,0.0,0.0,10995.0,
265,9128.0,0.0,0.0,10872.0,
266,9173.0,0.0,0.0,10827.0,
267,9218.0,0.0,0.0,10782.0,
268,9296.0,0.0,0.0,10704.0,
269,9411.0,0.0,0.0,10589.0,
270,9496.0,0.0,0.0,10504.0,
271,9537.0,0.0,0.0,10463.0,
272,9599.0,0.0,0.0,10401.0,
273,9831.0,0.0,0.0,10169.0,
274,10003.0,0.0,0.0,9997.0,
275,10256.0,0.0,0.0,9744.0,
276,10531.0,0.0,0.0,9469.0,
277,10554.0,0.0,0.0,9446.0,
278,10756.0,0.0,0.0,9244.0,
279,10777.0,0.0,0.0,9223.0,
280,10807.0,0.0,0.0,9193.0,
281,10812.0,0.0,0.0,9188.0,
282,10814.0,0.0,0.0,9186.0,
283,10814.0,0.0,0.0,9186.0,
284,10814.0,0.0,0.0,9186.0,
285,10814.0,0.0,0.0,9186.0,
286,10814.0,0.0,0.0,9186.0,
287,10829.0,0.0,0.0,9171.0,
288,10829.0,0.0,0.0,9171.0,
289,10829.0,0.0,0.0,9171.0,
290,10836.0,0.0,0.0,9164.0,
291,10836.0,0.0,0.0,9164.0,
292,10837.0,0.0,0.0,9163.0,
293,11028.0,0.0,0.0,8972.0,
294,11046.0,0.0,0.0,8954.0,
295,11048.0,0.0,0.0,8952.0,
296,11082.0,0.0,0.0,8918.0,
297,11086.0,0.0,0.0,8914.0,
298,11086.0,0.0,0.0,8914.0,
299,11102.0,0.0,0.0,8898.0,
300,11103.0,0.0,0.0,8897.0,
301,11157.0,0.0,0.0,8843.0,
302,11225.0,0.0,0.0,8775.0,
303,11252.0,0.0,0.0,8748.0,
304,11323.0,0.0,0.0,8677.0,
305,11323.0,0.0,0.0,8677.0,
306,11345.0,0.0,0.0,8655.0,
307,11345.0,0.0,0.0,8655.0,
308,11345.0,0.0,0.0,8655.0,
309,11345.0,0.0,0.0,8655.0,
310,11345.0,0.0,0.0,8655.0,
311,11345.0,0.0,0.0,8655.0,
312,11345.0,0.0,0.0,8655.0,
313,11345.0,0.0,0.0,8655.0,
314,11345.0,0.0,0.0,8655.0,
315,11365.0,0.0,0.0,8635.0,
316,11365.0,0.0,0.0,8635.0,
317,11365.0,0.0,0.0,8635.0,
318,11369.0,0.0,0.0,8631.0,
319,11369.0,0.0,0.0,8631.0,
320,11377.0,0.0,0.0,8623.0,
321,11377.0,0.0,0.0,8623.0,
322,11377.0,0.0,0.0,8623.0,
323,11381.0,0.0,0.0,8619.0,
324,11446.0,0.0,0.0,8554.0,
325,11497.0,0.0,0.0,8503.0,
326,11503.0,0.0,0.0,8497.0,
327,11528.0,0.0,0.0,8472.0,
328,11538.0,0.0,0.0,8462.0,
329,11542.0,0.0,0.0,8458.0,
330,11545.0,0.0,0.0,8455.0,
331,11545.0,0.0,0.0,8455.0,
332,11545.0,0.0,0.0,8455.0,
333,11545.0,0.0,0.0,8455.0,
334,11545.0,0.0,0.0,8455.0,
335,11545.0,0.0,0.0,8455.0,
336,11545.0,0.0,0.0,8455.0,
337,11545.0,0.0,0.0,8455.0,
338,11545.0,0.0,0.0,8455.0,
339,11545.0,0.0,0.0,8455.0,
340,11545.0,0.0,0.0,8455.0,
341,11546.0,0.0,0.0,8454.0,
342,11547.0,0.0,0.0,8453.0,
343,11548.0,0.0,0.0,8452.0,
344,11554.0,0.0,0.0,8446.0,
345,11571.0,0.0,0.0,8429.0,
346,11617.0,0.0,0.0,8383.0,
347,11655.0,0.0,0.0,8345.0,
348,11662.0,0.0,0.0,8338.0,
349,11908.0,0.0,0.0,8092.0,
350,11954.0,0.0,0.0,8046.0,
351,12024.0,0.0,0.0,7976.0,
352,12137.0,0.0,0.0,7863.0,
353,12270.0,0.0,0.0,7730.0,
354,12389.0,0.0,0.0,7611.0,
355,12545.0,0.0,0.0,7455.0,
356,12723.0,0.0,0.0,7277.0,
357,12927.0,0.0,0.0,7073.0,
358,13143.0,0.0,0.0,6857.0,
359,13165.0,0.0,0.0,6835.0,
360,13288.0,0.0,0.0,6712.0,
361,13383.0,0.0,0.0,6617.0,
362,13385.0,0.0,0.0,6615.0,
363,13389.0,0.0,0.0,6611.0,
364,13411.0,0.0,0.0,6589.0,
365,13418.0,0.0,0.0,6582.0,
366,13426.0,0.0,0.0,6574.0,
367,13539.0,0.0,0.0,6461.0,
368,13625.0,0.0,0.0,6375.0,
369,13670.0,0.0,0.0,6330.0,
370,13689.0,0.0,0.0,6311.0,
371,13873.0,0.0,0.0,6127.0,
372,13918.0,0.0,0.0,6082.0,
373,13920.0,0.0,0.0,6080.0,
374,13921.0,0.0,0.0,6079.0,
375,13922.0,0.0,0.0,6078.0,
376,13922.0,0.0,0.0,6078.0,
377,13922.0,0.0,0.0,6078.0,
378,13922.0,0.0,0.0,6078.0,
379,13922.0,0.0,0.0,6078.0,
380,13922.0,0.0,0.0,6078.0,
381,13922.0,0.0,0.0,6078.0,
382,13922.0,0.0,0.0,6078.0,
383,13922.0,0.0,0.0,6078.0,
384,13922.0,0.0,0.0,6078.0,
385,13922.0,0.0,0.0,6078.0,
386,13922.0,0.0,0.0,6078.0,
387,13922.0,0.0,0.0,6078.0,
388,13922.0,0.0,0.0,6078.0,
389,13922.0,0.0,0.0,6078.0,
390,13922.0,0.0,0.0,6078.0,
391,13922.0,0.0,0.0,6078.0,
392,13922.0,0.0,0.0,6078.0,
393,13922.0,0.0,0.0,6078.0,
394,13922.0,0.0,0.0,6078.0,
395,13926.0,0.0,0.0,6074.0,
396,13926.0,0.0,0.0,6074.0,
397,13950.0,0.0,0.0,6050.0,
398,14008.0,0.0,0.0,5992.0,
399,14016.0,0.0,0.0,5984.0,
400,14099.0,0.0,0.0,5901.0,
401,14101.0,0.0,0.0,5899.0,
402,14174.0,0.0,0.0,5826.0,
403,14181.0,0.0,0.0,5819.0,
404,14181.0,0.0,0.0,5819.0,
405,14181.0,0.0,0.0,5819.0,
406,14181.0,0.0,0.0,5819.0,
407,14181.0,0.0,0.0,5819.0,
408,14181.0,0.0,0.0,5819.0,
409,14181.0,0.0,0.0,5819.0,
410,14181.0,0.0,0.0,5819.0,
411,14181.0,0.0,0.0,5819.0,
412,14181.0,0.0,0.0,5819.0,
413,14181.0,0.0,0.0,5819.0,
414,14181.0,0.0,0.0,5819.0,
415,14181.0,0.0,0.0,5819.0,
416,14181.0,0.0,0.0,5819.0,
417,14181.0,0.0,0.0,5819.0,
418,14181.0,0.0,0.0,5819.0,
419,14181.0,0.0,0.0,5819.0,
420,14181.0,0.0,0.0,5819.0,
421,14181.0,0.0,0.0,5819.0,
422,14181.0,0.0,0.0,5819.0,
423,14181.0,0.0,0.0,5819.0,
424,14181.0,0.0,0.0,5819.0,
425,14181.0,0.0,0.0,5819.0,
426,14181.0,0.0,0.0,5819.0,
427,14181.0,0.0,0.0,5819.0,
428,14181.0,0.0,0.0,5819.0,
429,14181.0,0.0,0.0,5819.0,
430,14181.0,0.0,0.0,5819.0,
431,14181.0,0.0,0.0,5819.0,
432,14181.0,0.0,0.0,5819.0,
433,14181.0,0.0,0.0,5819.0,
434,14181.0,0.0,0.0,5819.0,
435,14181.0,0.0,0.0,5819.0,
436,14213.0,0.0,0.0,5787.0,
437,14213.0,0.0,0.0,5787.0,
438,14215.0,0.0,0.0,5785.0,
439,14354.0,0.0,0.0,5646.0,
440,14355.0,0.0,0.0,5645.0,
441,14449.0,0.0,0.0,5551.0,
442,14459.0,0.0,0.0,5541.0,
443,14459.0,0.0,0.0,5541.0,
444,14459.0,0.0,0.0,5541.0,
445,14459.0,0.0,0.0,5541.0,
446,14459.0,0.0,0.0,5541.0,
447,14459.0,0.0,0.0,5541.0,
448,14459.0,0.0,0.0,5541.0,
449,14459.0,0.0,0.0,5541.0,
450,14459.0,0.0,0.0,5541.0,
451,14459.0,0.0,0.0,5541.0,
452,14459.0,0.0,0.0,5541.0,
453,14459.0,0.0,0.0,5541.0,
454,14459.0,0.0,0.0,5541.0,
455,14459.0,0.0,0.0,5541.0,
456,14459.0,0.0,0.0,5541.0,
457,14459.0,0.0,0.0,5541.0,
458,14459.0,0.0,0.0,5541.0,
459,14459.0,0.0,0.0,5541.0,
460,14459.0,0.0,0.0,5541.0,
461,14459.0,0.0,0.0,5541.0,
462,14459.0,0.0,0.0,5541.0,
463,14459.0,0.0,0.0,5541.0,
464,14459.0,0.0,0.0,5541.0,
465,14459.0,0.0,0.0,5541.0,
466,14459.0,0.0,0.0,5541.0,
467,14459.0,0.0,0.0,5541.0,
468,14459.0,0.0,0.0,5541.0,
469,14459.0,0.0,0.0,5541.0,
470,14459.0,0.0,0.0,5541.0,
471,14464.0,0.0,0.0,5536.0,
472,14467.0,0.0,0.0,5533.0,
473,14470.0,0.0,0.0,5530.0,
474,14484.0,0.0,0.0,5516.0,
475,14494.0,0.0,0.0,5506.0,
476,14572.0,0.0,0.0,5428.0,
477,14654.0,0.0,0.0,5346.0,
478,14716.0,0.0,0.0,5284.0,
479,14806.0,0.0,0.0,5194.0,
480,14944.0,0.0,0.0,5056.0,
481,15253.0,0.0,0.0,4747.0,
482,15419.0,0.0,0.0,4581.0,
483,15426.0,0.0,0.0,4574.0,
484,15519.0,0.0,0.0,4481.0,
485,15545.0,0.0,0.0,4455.0,
486,15546.0,0.0,0.0,4454.0,
487,15546.0,0.0,0.0,4454.0,
488,15546.0,0.0,0.0,4454.0,
489,15546.0,0.0,0.0,4454.0,
490,15546.0,0.0,0.0,4454.0,
491,15546.0,0.0,0.0,4454.0,
492,15546.0,0.0,0.0,4454.0,
493,15546.0,0.0,0.0,4454.0,
494,15546.0,0.0,0.0,4454.0,
495,15546.0,0.0,0.0,4454.0,
496,15546.0,0.0,0.0,4454.0,
497,15546.0,0.0,0.0,4454.0,
498,15546.0,0.0,0.0,4454.0,
499,15546.0,0.0,0.0,4454.0,
500,15546.0,0.0,0.0,4454.0,
501,15553.0,0.0,0.0,4447.0,
502,15561.0,0.0,0.0,4439.0,
503,15579.0,0.0,0.0,4421.0,
504,15608.0,0.0,0.0,4392.0,
505,15658.0,0.0,0.0,4342.0,
506,15658.0,0.0,0.0,4342.0,
507,15686.0,0.0,0.0,4314.0,
508,15797.0,0.0,0.0,4203.0,
509,15802.0,0.0,0.0,4198.0,
510,15823.0,0.0,0.0,4177.0,
511,15823.0,0.0,0.0,4177.0,
512,15823.0,0.0,0.0,4177.0,
513,15823.0,0.0,0.0,4177.0,
514,15823.0,0.0,0.0,4177.0,
515,15823.0,0.0,0.0,4177.0,
516,15823.0,0.0,0.0,4177.0,
517,15823.0,0.0,0.0,4177.0,
518,15823.0,0.0,0.0,4177.0,
519,15823.0,0.0,0.0,4177.0,
520,15823.0,0.0,0.0,4177.0,
521,15823.0,0.0,0.0,4177.0,
522,15823.0,0.0,0.0,4177.0,
523,15823.0,0.0,0.0,4177.0,
524,15823.0,0.0,0.0,4177.0,
525,15824.0,0.0,0.0,4176.0,
526,15824.0,0.0,0.0,4176.0,
527,15849.0,0.0,0.0,4151.0,
528,15886.0,0.0,0.0,4114.0,
529,15919.0,0.0,0.0,4081.0,
530,15923.0,0.0,0.0,4077.0,
531,15937.0,0.0,0.0,4063.0,
532,15942.0,0.0,0.0,4058.0,
533,15943.0,0.0,0.0,4057.0,
534,15943.0,0.0,0.0,4057.0,
535,15943.0,0.0,0.0,4057.0,
536,15943.0,0.0,0.0,4057.0,
537,15943.0,0.0,0.0,4057.0,
538,15943.0,0.0,0.0,4057.0,
539,15943.0,0.0,0.0,4057.0,
540,15943.0,0.0,0.0,4057.0,
541,15943.0,0.0,0.0,4057.0,
542,15965.0,0.0,0.0,4035.0,
543,15965.0,0.0,0.0,4035.0,
544,15969.0,0.0,0.0,4031.0,
545,16052.0,0.0,0.0,3948.0,
546,16057.0,0.0,0.0,3943.0,
547,16082.0,0.0,0.0,3918.0,
548,16193.0,0.0,0.0,3807.0,
549,16204.0,0.0,0.0,3796.0,
550,16205.0,0.0,0.0,3795.0,
551,16205.0,0.0,0.0,3795.0,
552,16205.0,0.0,0.0,3795.0,
553,16205.0,0.0,0.0,3795.0,
554,16205.0,0.0,0.0,3795.0,
555,16205.0,0.0,0.0,3795.0,
556,16205.0,0.0,0.0,3795.0,
557,16205.0,0.0,0.0,3795.0,
558,16205.0,0.0,0.0,3795.0,
559,16205.0,0.0,0.0,3795.0,
560,16205.0,0.0,0.0,3795.0,
561,16205.0,0.0,0.0,3795.0,
562,16205.0,0.0,0.0,3795.0,
563,16205.0,0.0,0.0,3795.0,
564,16205.0,0.0,0.0,3795.0,
565,16205.0,0.0,0.0,3795.0,
566,16205.0,0.0,0.0,3795.0,
567,16205.0,0.0,0.0,3795.0,
568,16205.0,0.0,0.0,3795.0,
569,16205.0,0.0,0.0,3795.0,
570,16205.0,0.0,0.0,3795.0,
571,16218.0,0.0,0.0,3782.0,
572,16240.0,0.0,0.0,3760.0,
573,16240.0,0.0,0.0,3760.0,
574,16330.0,0.0,0.0,3670.0,
575,16417.0,0.0,0.0,3583.0,
576,16426.0,0.0,0.0,3574.0,
577,16436.0,0.0,0.0,3564.0,
578,16492.0,0.0,0.0,3508.0,
579,16538.0,0.0,0.0,3462.0,
580,16630.0,0.0,0.0,3370.0,
581,16705.0,0.0,0.0,3295.0,
582,16744.0,0.0,0.0,3256.0,
583,16751.0,0.0,0.0,3249.0,
584,16751.0,0.0,0.0,3249.0,
585,16756.0,0.0,0.0,3244.0,
586,16760.0,0.0,0.0,3240.0,
587,16760.0,0.0,0.0,3240.0,
588,16760.0,0.0,0.0,3240.0,
589,16760.0,0.0,0.0,3240.0,
590,16760.0,0.0,0.0,3240.0,
591,16760.0,0.0,0.0,3240.0,
592,16760.0,0.0,0.0,3240.0,
593,16760.0,0.0,0.0,3240.0,
594,16760.0,0.0,0.0,3240.0,
595,16760.0,0.0,0.0,3240.0,
596,16760.0,0.0,0.0,3240.0,
597,16760.0,0.0,0.0,3240.0,
598,16760.0,0.0,0.0,3240.0,
599,16760.0,0.0,0.0,3240.0,
600,16760.0,0.0,0.0,3240.0,
601,16760.0,0.0,0.0,3240.0,
602,16760.0,0.0,0.0,3240.0,
603,16760.0,0.0,0.0,3240.0,
604,16760.0,0.0,0.0,3240.0,
605,16760.0,0.0,0.0,3240.0,
606,16760.0,0.0,0.0,3240.0,
607,16760.0,0.0,0.0,3240.0,
608,16760.0,0.0,0.0,3240.0,
609,16760.0,0.0,0.0,3240.0,
610,16760.0,0.0,0.0,3240.0,
611,16760.0,0.0,0.0,3240.0,
612,16760.0,0.0,0.0,3240.0,
613,16760.0,0.0,0.0,3240.0,
614,16760.0,0.0,0.0,3240.0,
615,16760.0,0.0,0.0,3240.0,
616,16760.0,0.0,0.0,3240.0,
617,16760.0,0.0,0.0,3240.0,
618,16760.0,0.0,0.0,3240.0,
619,16760.0,0.0,0.0,3240.0,
620,16760.0,0.0,0.0,3240.0,
621,16760.0,0.0,0.0,3240.0,
622,16760.0,0.0,0.0,3240.0,
623,16760.0,0.0,0.0,3240.0,
624,16760.0,0.0,0.0,3240.0,
625,16760.0,0.0,0.0,3240.0,
626,16760.0,0.0,0.0,3240.0,
627,16760.0,0.0,0.0,3240.0,
628,16760.0,0.0,0.0,3240.0,
629,16760.0,0.0,0.0,3240.0,
630,16760.0,0.0,0.0,3240.0,
631,16760.0,0.0,0.0,3240.0,
632,16760.0,0.0,0.0,3240.0,
633,16760.0,0.0,0.0,3240.0,
634,16764.0,0.0,0.0,3236.0,
635,16768.0,0.0,0.0,3232.0,
636,16776.0,0.0,0.0,3224.0,
637,16776.0,0.0,0.0,3224.0,
638,16799.0,0.0,0.0,3201.0,
639,16843.0,0.0,0.0,3157.0,
640,16897.0,0.0,0.0,3103.0,
641,16928.0,0.0,0.0,3072.0,
642,16946.0,0.0,0.0,3054.0,
643,16998.0,0.0,0.0,3002.0,
644,17014.0,0.0,0.0,2986.0,
645,17020.0,0.0,0.0,2980.0,
646,17020.0,0.0,0.0,2980.0,
647,17020.0,0.0,0.0,2980.0,
648,17020.0,0.0,0.0,2980.0,
649,17020.0,0.0,0.0,2980.0,
650,17020.0,0.0,0.0,2980.0,
651,17020.0,0.0,0.0,2980.0,
652,17020.0,0.0,0.0,2980.0,
653,17020.0,0.0,0.0,2980.0,
654,17020.0,0.0,0.0,2980.0,
655,17020.0,0.0,0.0,2980.0,
656,17020.0,0.0,0.0,2980.0,
657,17020.0,0.0,0.0,2980.0,
658,17020.0,0.0,0.0,2980.0,
659,17020.0,0.0,0.0,2980.0,
660,17020.0,0.0,0.0,2980.0,
661,17020.0,0.0,0.0,2980.0,
662,17020.0,0.0,0.0,2980.0,
663,17020.0,0.0,0.0,2980.0,
664,17020.0,0.0,0.0,2980.0,
665,17020.0,0.0,0.0,2980.0,
666,17020.0,0.0,0.0,2980.0,
667,17020.0,0.0,0.0,2980.0,
668,17020.0,0.0,0.0,2980.0,
669,17020.0,0.0,0.0,2980.0,
670,17020.0,0.0,0.0,2980.0,
671,17020.0,0.0,0.0,2980.0,
672,17020.0,0.0,0.0,2980.0,
673,17020.0,0.0,0.0,2980.0,
674,17020.0,0.0,0.0,2980.0,
675,17020.0,0.0,0.0,2980.0,
676,17020.0,0.0,0.0,2980.0,
677,17020.0,0.0,0.0,2980.0,
678,17020.0,0.0,0.0,2980.0,
679,17020.0,0.0,0.0,2980.0,
680,17020.0,0.0,0.0,2980.0,
681,17020.0,0.0,0.0,2980.0,
682,17020.0,0.0,0.0,2980.0,
683,17020.0,0.0,0.0,2980.0,
684,17022.0,0.0,0.0,2978.0,
685,17022.0,0.0,0.0,2978.0,
686,17024.0,0.0,0.0,2976.0,
687,17035.0,0.0,0.0,2965.0,
688,17035.0,0.0,0.0,2965.0,
689,17035.0,0.0,0.0,2965.0,
690,17039.0,0.0,0.0,2961.0,
691,17052.0,0.0,0.0,2948.0,
692,17097.0,0.0,0.0,2903.0,
693,17178.0,0.0,0.0,2822.0,
694,17248.0,0.0,0.0,2752.0,
695,17251.0,0.0,0.0,2749.0,
696,17287.0,0.0,0.0,2713.0,
697,17290.0,0.0,0.0,2710.0,
698,17290.0,0.0,0.0,2710.0,
699,17290.0,0.0,0.0,2710.0,
700,17290.0,0.0,0.0,2710.0,
701,17290.0,0.0,0.0,2710.0,
702,17290.0,0.0,0.0,2710.0,
703,17290.0,0.0,0.0,2710.0,
704,17290.0,0.0,0.0,2710.0,
705,17290.0,0.0,0.0,2710.0,
706,17290.0,0.0,0.0,2710.0,
707,17299.0,0.0,0.0,2701.0,
708,17315.0,0.0,0.0,2685.0,
709,17343.0,0.0,0.0,2657.0,
710,17392.0,0.0,0.0,2608.0,
711,17458.0,0.0,0.0,2542.0,
712,17520.0,0.0,0.0,2480.0,
713,17548.0,0.0,0.0,2452.0,
714,17551.0,0.0,0.0,2449.0,
715,17556.0,0.0,0.0,2444.0,
716,17557.0,0.0,0.0,2443.0,
717,17557.0,0.0,0.0,2443.0,
718,17557.0,0.0,0.0,2443.0,
719,17557.0,0.0,0.0,2443.0,
720,17557.0,0.0,0.0,2443.0,
721,17557.0,0.0,0.0,2443.0,
722,17557.0,0.0,0.0,2443.0,
723,17557.0,0.0,0.0,2443.0,
724,17557.0,0.0,0.0,2443.0,
725,17557.0,0.0,0.0,2443.0,
726,17557.0,0.0,0.0,2443.0,
727,17557.0,0.0,0.0,2443.0,
728,17557.0,0.0,0.0,2443.0,
729,17557.0,0.0,0.0,2443.0,
730,17557.0,0.0,0.0,2443.0,
