\relax 
\providecommand\hyper@newdestlabel[2]{}
\@nameuse{bbl@beforestart}
\catcode `:\active 
\catcode `;\active 
\catcode `!\active 
\catcode `?\active 
\providecommand\HyperFirstAtBeginDocument{\AtBeginDocument}
\HyperFirstAtBeginDocument{\ifx\hyper@anchor\@undefined
\global\let\oldcontentsline\contentsline
\gdef\contentsline#1#2#3#4{\oldcontentsline{#1}{#2}{#3}}
\global\let\oldnewlabel\newlabel
\gdef\newlabel#1#2{\newlabelxx{#1}#2}
\gdef\newlabelxx#1#2#3#4#5#6{\oldnewlabel{#1}{{#2}{#3}}}
\AtEndDocument{\ifx\hyper@anchor\@undefined
\let\contentsline\oldcontentsline
\let\newlabel\oldnewlabel
\fi}
\fi}
\global\let\hyper@last\relax 
\gdef\HyperFirstAtBeginDocument#1{#1}
\providecommand\HyField@AuxAddToFields[1]{}
\providecommand\HyField@AuxAddToCoFields[2]{}
\babel@aux{french}{}
\@writefile{toc}{\contentsline {section}{\numberline {1}Rappel}{2}{section.1}\protected@file@percent }
\@writefile{toc}{\contentsline {section}{\numberline {2}Interpolation Polynomiale}{2}{section.2}\protected@file@percent }
\@writefile{toc}{\contentsline {subsection}{\numberline {2.1}Interpolation de Neville}{2}{subsection.2.1}\protected@file@percent }
\@writefile{toc}{\contentsline {subsection}{\numberline {2.2}Interpolation de Newton}{2}{subsection.2.2}\protected@file@percent }
\@writefile{toc}{\contentsline {subsection}{\numberline {2.3}Comparaison des deux methodes d'interpolation}{3}{subsection.2.3}\protected@file@percent }
\@writefile{lof}{\contentsline {figure}{\numberline {1}{\ignorespaces Jeux d'essais sur les données du tableau 4.1 avec les fonctions Neville et Newton }}{3}{figure.1}\protected@file@percent }
\newlabel{fig:methode_gauss_image}{{1}{3}{Jeux d'essais sur les données du tableau 4.1 avec les fonctions Neville et Newton}{figure.1}{}}
\@writefile{toc}{\contentsline {section}{\numberline {3}Approximation}{3}{section.3}\protected@file@percent }
\@writefile{toc}{\contentsline {subsection}{\numberline {3.1} Regression linéaire}{3}{subsection.3.1}\protected@file@percent }
\@writefile{lof}{\contentsline {figure}{\numberline {2}{\ignorespaces Jeux d'essais sur les données du tableau 4.3 avec les fonctions Neville et Newton }}{4}{figure.2}\protected@file@percent }
\newlabel{fig:methode_gauss_image}{{2}{4}{Jeux d'essais sur les données du tableau 4.3 avec les fonctions Neville et Newton}{figure.2}{}}
\@writefile{toc}{\contentsline {subsection}{\numberline {3.2} Regression linéaire: ajustement exponentiel}{4}{subsection.3.2}\protected@file@percent }
\@writefile{toc}{\contentsline {subsection}{\numberline {3.3} Regression linéaire: ajustement puissance}{5}{subsection.3.3}\protected@file@percent }
