<?xml version="1.0" encoding="iso-8859-1"?>
<!-- Generator: Adobe Illustrator 16.0.0, SVG Export Plug-In . SVG Version: 6.00 Build 0)  -->
<!DOCTYPE svg PUBLIC "-//W3C//DTD SVG 1.1//EN" "http://www.w3.org/Graphics/SVG/1.1/DTD/svg11.dtd">
<svg version="1.1" id="Capa_1" xmlns="http://www.w3.org/2000/svg" xmlns:xlink="http://www.w3.org/1999/xlink" x="0px" y="0px"
	 width="81.95px" height="81.95px" viewBox="0 0 81.95 81.95" style="enable-background:new 0 0 81.95 81.95;" xml:space="preserve"
	>
<g>
	<g>
		<path d="M45.635,4.093c-2.236-0.387-4.489-0.583-6.684-0.583C17.473,3.51,0,20.981,0,42.458c0,21.477,17.474,38.95,38.951,38.95
			c21.476,0,38.949-17.474,38.949-38.95c0-1.352-0.08-2.765-0.229-4.196l-0.222-2.098H47.578V4.43L45.635,4.093z"/>
		<path d="M56.898,27.402V0.542c12.779,3.322,22.627,13.87,25.052,26.86H56.898z"/>
	</g>
</g>
<g>
</g>
<g>
</g>
<g>
</g>
<g>
</g>
<g>
</g>
<g>
</g>
<g>
</g>
<g>
</g>
<g>
</g>
<g>
</g>
<g>
</g>
<g>
</g>
<g>
</g>
<g>
</g>
<g>
</g>
</svg>
