{
    "coms": {
        "can_interface": ["vcan0"],
        "sid_whitelist": [1616, 1870, 1806, 1776, 1161, 1296, 1644, 1676, 1292, 1324, 1356],
        "sid_buttons": {
            "sw_btn1" : "button_1",
            "sw_btn2" : "button_2",
            "me0" : "me0",
            "me1" : "me1",
            "me2" : "me2"
        }
    },
    "themes": {
        "dark_mode": {
            "nan_str": "--",
            "default_background_color": "#000000",
            "default_font_color": "#ffffff",
            "default_font_missing_color": "#666666",
            "default_font_error_color": "#ff0000",
            "default_font_warning_color": "#ffff00",
            "default_font_ok_color": "#00ff00"
        },
        "light_mode": {
            "nan_str": "--",
            "default_background_color": "#ffffff",
            "default_font_color": "#000000",
            "default_font_missing_color": "#dddddd",
            "default_font_error_color": "#ff0000",
            "default_font_warning_color": "#ffff00",
            "default_font_ok_color": "#00ff00"
        },
        "use_theme": "dark_mode"
    },
    "mapping": {
        "enduranceScreen.qml": {
            "button_1": "decrease_torque",
            "button_2": "increase_torque",
            "me0": {"1": {  "function" : "select_src", 
                            "src" : "iib_diff_gain",
                            "name" : "diff"
                            }
                    },
            "me1": {"1": {  "function" : "toggle_interface",
                            "state" : true
                        },
                    "2" : { "function" : "toggle_interface",
                            "state" : false         
                        }
                    }
        }
    },
    "dash_values": {
        "amk_actual_speed": {
            "timeout": 20,
            "color": "default_font_color",
            "color_ranges": {
                "default_font_color": [0, 20000],
                "default_font_error_color": "else"
            }
        },
        "master_em_soc": {
            "timeout": 20,
            "color": "default_font_color",
            "color_ranges": {
                "default_font_ok_color": [60,100],
                "default_font_warning_color": [40, 60],
                "default_font_error_color": "else"
            }
        },
        "cell_max_tmp":{
            "timeout": 20,
            "color": "default_font_color",
            "color_ranges": {
                "default_font_ok_color": [0, 50],
                "default_font_error_color": "else"
            }
        },
        "max_sfty_torque0":{
            "timeout": 20,
            "color": "default_font_color",
            "color_ranges": {
                "default_font_color": "else"
            }
        },
        "max_sfty_torque2":{
            "timeout": 20,
            "color": "default_font_color",
            "color_ranges": {
                "default_font_color": "else"
            }
        },
        "iib_diff_gain":{
            "timeout": 20,
            "color": "default_font_color",
            "color_ranges": {
                "default_font_color": [0, 200],
                "default_font_error_color": "else"
            }
        },
        "te_press_f":{
            "timeout": 20,
            "color": "default_font_color",
            "color_ranges": {
                "default_font_color": "else"
            }
        },
        "te_press_r":{
            "timeout": 20,
            "color": "default_font_color",
            "color_ranges": {
                "default_font_color": "else"
            }
        }
    }
}
