<?xml version="1.0" encoding="iso-8859-1"?>
<!-- Generator: Adobe Illustrator 19.0.0, SVG Export Plug-In . SVG Version: 6.00 Build 0)  -->
<svg version="1.1" id="Capa_1" xmlns="http://www.w3.org/2000/svg" xmlns:xlink="http://www.w3.org/1999/xlink" x="0px" y="0px"
	 viewBox="0 0 512.03 512.03" style="enable-background:new 0 0 512.03 512.03;" xml:space="preserve">
<g transform="translate(0 -1)">
	<g transform="translate(1 5)">
		<polygon style="fill:#E3E7F2;" points="266.108,80.254 289.148,149.63 220.881,149.63 243.921,80.254 		"/>
		<g>
			<path style="fill:#A4C2F7;" d="M58.748,431.23h76.8v51.2c0,9.426-7.641,17.067-17.067,17.067H75.815
				c-9.426,0-17.067-7.641-17.067-17.067V431.23z"/>
			<path style="fill:#A4C2F7;" d="M374.481,431.23h76.8v51.2c0,9.426-7.641,17.067-17.067,17.067h-42.667
				c-9.426,0-17.067-7.641-17.067-17.067V431.23z"/>
		</g>
		<path style="fill:#7FACFA;" d="M442.748,269.096v42.667H67.281v-42.667l53.504-93.696c9.127-15.94,26.09-25.773,44.459-25.771
			h179.541c18.368-0.002,35.332,9.831,44.459,25.771L442.748,269.096z"/>
		
			<linearGradient id="SVGID_1_" gradientUnits="userSpaceOnUse" x1="-49.6562" y1="648.1068" x2="-49.0342" y2="646.7644" gradientTransform="matrix(349.8667 0 0 -162.1333 17506.4492 105239.9531)">
			<stop  offset="0" style="stop-color:#D4E1F4"/>
			<stop  offset="0.1717" style="stop-color:#D4E1F4"/>
			<stop  offset="0.2" style="stop-color:#D4E1F4"/>
			<stop  offset="0.2001" style="stop-color:#DAE4F4"/>
			<stop  offset="0.2007" style="stop-color:#EBEBF4"/>
			<stop  offset="0.2014" style="stop-color:#F6F1F4"/>
			<stop  offset="0.2023" style="stop-color:#FDF4F4"/>
			<stop  offset="0.205" style="stop-color:#FFF5F4"/>
			<stop  offset="0.2522" style="stop-color:#FFF5F4"/>
			<stop  offset="0.26" style="stop-color:#FFF5F4"/>
			<stop  offset="0.26" style="stop-color:#D4E1F4"/>
			<stop  offset="0.3974" style="stop-color:#D4E1F4"/>
			<stop  offset="0.42" style="stop-color:#D4E1F4"/>
			<stop  offset="0.4201" style="stop-color:#DAE4F4"/>
			<stop  offset="0.4207" style="stop-color:#EBEBF4"/>
			<stop  offset="0.4214" style="stop-color:#F6F1F4"/>
			<stop  offset="0.4223" style="stop-color:#FDF4F4"/>
			<stop  offset="0.425" style="stop-color:#FFF5F4"/>
			<stop  offset="0.4894" style="stop-color:#FFF5F4"/>
			<stop  offset="0.5" style="stop-color:#FFF5F4"/>
			<stop  offset="0.5" style="stop-color:#F9F2F4"/>
			<stop  offset="0.5001" style="stop-color:#E8EBF4"/>
			<stop  offset="0.5003" style="stop-color:#DDE5F4"/>
			<stop  offset="0.5005" style="stop-color:#D6E2F4"/>
			<stop  offset="0.501" style="stop-color:#D4E1F4"/>
			<stop  offset="0.7062" style="stop-color:#D4E1F4"/>
			<stop  offset="0.74" style="stop-color:#D4E1F4"/>
			<stop  offset="0.741" style="stop-color:#FFF5F4"/>
			<stop  offset="0.8346" style="stop-color:#FFF5F4"/>
			<stop  offset="0.85" style="stop-color:#FFF5F4"/>
			<stop  offset="0.851" style="stop-color:#D4E1F4"/>
		</linearGradient>
		<path style="fill:url(#SVGID_1_);" d="M417.148,269.096v42.667H67.281v-42.667l53.504-93.696
			c9.127-15.94,26.09-25.773,44.459-25.771h153.941c18.368-0.002,35.332,9.831,44.459,25.771L417.148,269.096z"/>
		<path style="fill:#7FACFA;" d="M58.748,269.096h392.533c14.138,0,25.6,11.461,25.6,25.6v128c0,14.138-11.462,25.6-25.6,25.6
			H58.748c-14.138,0-25.6-11.462-25.6-25.6v-128C33.148,280.558,44.61,269.096,58.748,269.096z"/>
		<g>
			<path style="fill:#E3E7F2;" d="M58.748,269.096h366.933c14.138,0,25.6,11.461,25.6,25.6v128c0,14.138-11.462,25.6-25.6,25.6
				H58.748c-14.138,0-25.6-11.462-25.6-25.6v-128C33.148,280.558,44.61,269.096,58.748,269.096z"/>
			<path style="fill:#E3E7F2;" d="M134.49,344.697l-51.2-6.4c-4.27-0.534-7.475-4.164-7.475-8.467v-18.067
				c0-4.713,3.82-8.533,8.533-8.533h51.2c4.713,0,8.533,3.82,8.533,8.533v24.467c0,2.448-1.051,4.777-2.886,6.397
				C139.361,344.247,136.919,345.001,134.49,344.697z"/>
			<path style="fill:#E3E7F2;" d="M375.54,344.697l51.2-6.4c4.27-0.534,7.475-4.164,7.475-8.467v-18.067
				c0-4.713-3.82-8.533-8.533-8.533h-51.2c-4.713,0-8.533,3.82-8.533,8.533v24.467c0,2.448,1.051,4.777,2.886,6.397
				C370.669,344.247,373.111,345.001,375.54,344.697z"/>
			<path style="fill:#E3E7F2;" d="M24.615,209.363h17.067c4.713,0,8.533,3.82,8.533,8.533v17.067c0,4.713-3.821,8.533-8.533,8.533
				H24.615c-9.426,0-17.067-7.641-17.067-17.067C7.548,217.004,15.189,209.363,24.615,209.363z"/>
			<path style="fill:#E3E7F2;" d="M485.415,243.496h-17.067c-4.713,0-8.533-3.821-8.533-8.533v-17.067
				c0-4.713,3.82-8.533,8.533-8.533h17.067c9.426,0,17.067,7.641,17.067,17.067C502.481,235.855,494.84,243.496,485.415,243.496z"/>
			<path style="fill:#E3E7F2;" d="M400.081,397.096c-0.069,9.397-7.67,16.998-17.067,17.067h-256
				c-9.414-0.028-17.039-7.653-17.067-17.067c0.068-9.397,7.669-16.999,17.067-17.067h256
				C392.429,380.057,400.054,387.682,400.081,397.096z"/>
			<circle style="fill:#E3E7F2;" cx="255.015" cy="57.214" r="25.6"/>
		</g>
	</g>
	<g transform="translate(4 19)">
		<path style="fill:#FFFFFF;" d="M162.244,135.63h25.087c-18.368-0.002-35.332,9.831-44.459,25.771l-53.504,93.696h-8.533
			c-6.792-0.009-13.309,2.685-18.112,7.488s-7.497,11.32-7.488,18.112v128c-0.009,6.792,2.685,13.309,7.488,18.112
			c4.803,4.803,11.32,7.497,18.112,7.488v34.133c-0.001,4.527,1.797,8.868,4.998,12.069c3.201,3.201,7.542,4.999,12.069,4.998
			H72.815c-9.414-0.028-17.039-7.652-17.067-17.067v-34.133c-6.792,0.009-13.309-2.685-18.112-7.488
			c-4.803-4.803-7.497-11.32-7.488-18.112v-128c-0.009-6.792,2.685-13.309,7.488-18.112s11.32-7.497,18.112-7.488h8.533
			l53.504-93.696C126.913,145.46,143.876,135.627,162.244,135.63z"/>
		<path style="fill:#FFFFFF;" d="M413.636,485.496h-25.087c-9.414-0.028-17.039-7.652-17.067-17.067v-34.133h25.087v34.133
			c-0.001,4.527,1.797,8.868,4.998,12.069C404.767,483.699,409.109,485.497,413.636,485.496z"/>
	</g>
	<g>
		<polygon style="fill:#FFFFFF;" points="42.681,299.696 42.681,410.63 42.681,427.696 25.615,427.696 25.615,410.63 
			25.615,299.696 		"/>
		<g>
			<path style="fill:#428DFF;" d="M34.148,376.496c3.45-0.014,6.556-2.096,7.879-5.282c1.323-3.187,0.606-6.856-1.82-9.31
				l-1.279-1.025c-0.476-0.324-0.993-0.583-1.538-0.771c-0.484-0.246-1.003-0.417-1.538-0.508c-0.563-0.096-1.133-0.153-1.704-0.171
				c-2.259,0.031-4.423,0.915-6.059,2.475c-2.07,1.994-2.979,4.908-2.409,7.726c0.57,2.818,2.539,5.149,5.222,6.183
				C31.929,376.251,33.032,376.483,34.148,376.496z"/>
			<path style="fill:#428DFF;" d="M136.548,299.696h-51.2c-9.421,0.011-17.056,7.645-17.067,17.067v18.067
				c0.011,8.603,6.415,15.857,14.95,16.933l51.2,6.4c0.702,0.088,1.409,0.132,2.116,0.133c9.425-0.001,17.065-7.642,17.067-17.067
				v-24.467C153.604,307.342,145.969,299.707,136.548,299.696z M136.548,341.23l-51.2-6.4v-18.067h51.2l0.017,24.467H136.548z"/>
			<path style="fill:#428DFF;" d="M377.598,358.163l51.2-6.4c8.535-1.077,14.939-8.33,14.95-16.933v-18.067
				c-0.011-9.421-7.645-17.056-17.067-17.067h-51.2c-9.421,0.011-17.056,7.645-17.067,17.067v24.467
				c0.001,9.425,7.642,17.065,17.067,17.067C376.189,358.295,376.896,358.251,377.598,358.163z M375.481,316.763h51.2v18.067
				l-51.2,6.4V316.763z"/>
			<path style="fill:#428DFF;" d="M486.415,205.83h-17.067c-9.421,0.011-17.056,7.645-17.067,17.067v17.067
				c0.007,5.772,2.936,11.149,7.782,14.285l-11.316,11.315h-0.049l-51.068-89.371c-10.657-18.591-30.438-30.069-51.867-30.096
				h-49.456l-19.056-57.374c11.365-9.032,15.773-24.264,10.99-37.969s-17.711-22.887-32.228-22.887
				c-14.516,0-27.445,9.181-32.228,22.887c-4.783,13.706-0.374,28.938,10.99,37.969l-19.056,57.374h-49.456
				c-21.429,0.027-41.21,11.505-51.867,30.096L63.33,265.563h-0.049l-11.316-11.315c4.846-3.136,7.775-8.512,7.782-14.285v-17.067
				c-0.011-9.421-7.645-17.056-17.067-17.067H25.615c-14.138,0-25.6,11.462-25.6,25.6c0,14.138,11.462,25.6,25.6,25.6h5
				l12.853,12.853c-10.96,5.92-17.809,17.357-17.853,29.814v34.133c0,4.713,3.821,8.533,8.533,8.533s8.533-3.82,8.533-8.533v-34.133
				c0.011-9.421,7.645-17.056,17.067-17.067h392.533c9.421,0.011,17.056,7.645,17.067,17.067v128
				c-0.011,9.421-7.645,17.056-17.067,17.067H59.748c-9.421-0.011-17.056-7.645-17.067-17.067v-25.6
				c0-4.713-3.821-8.533-8.533-8.533s-8.533,3.82-8.533,8.533v25.6c0.046,15.521,10.569,29.053,25.6,32.922v26.812
				c0.015,14.132,11.468,25.585,25.6,25.6h42.667c14.132-0.015,25.585-11.468,25.6-25.6v-25.6h221.867v25.6
				c0.015,14.132,11.468,25.585,25.6,25.6h42.667c14.132-0.015,25.585-11.468,25.6-25.6v-26.812
				c15.031-3.869,25.554-17.4,25.6-32.922v-128c-0.044-12.457-6.893-23.894-17.853-29.814l12.853-12.853h5
				c14.138,0,25.6-11.462,25.6-25.6C512.015,217.291,500.553,205.83,486.415,205.83z M128.015,487.43
				c-0.005,4.711-3.822,8.529-8.533,8.533H76.815c-4.711-0.005-8.529-3.822-8.533-8.533v-25.6h59.733V487.43z M443.748,487.43
				c-0.005,4.711-3.822,8.529-8.533,8.533h-42.667c-4.711-0.005-8.529-3.822-8.533-8.533v-25.6h59.733V487.43z M256.015,45.146
				c9.426,0,17.067,7.641,17.067,17.067S265.44,79.28,256.015,79.28c-9.426,0-17.067-7.641-17.067-17.067
				C238.959,52.792,246.594,45.157,256.015,45.146z M250.421,95.781c3.691,0.754,7.496,0.754,11.187,0l16.715,50.316h-44.617
				L250.421,95.781z M17.081,231.43c0.005-4.711,3.822-8.529,8.533-8.533h17.067l0.009,17.067H25.615
				C20.904,239.958,17.086,236.14,17.081,231.43z M82.99,265.563l46.225-80.905c7.614-13.278,21.744-21.475,37.05-21.495h179.5
				c15.306,0.02,29.436,8.217,37.05,21.495l46.225,80.905H82.99z M486.415,239.963h-17.067v-17.067h17.067
				c4.713,0,8.533,3.821,8.533,8.533C494.948,236.142,491.128,239.963,486.415,239.963z"/>
			<path style="fill:#428DFF;" d="M128.015,376.496c-14.138,0-25.6,11.462-25.6,25.6s11.462,25.6,25.6,25.6h256
				c14.138,0,25.6-11.462,25.6-25.6s-11.462-25.6-25.6-25.6H128.015z M332.815,393.563v17.067H187.748v-17.067H332.815z
				 M119.481,402.096c0.005-4.711,3.822-8.529,8.533-8.533h42.667v17.067h-42.667C123.304,410.625,119.486,406.807,119.481,402.096z
				 M392.548,402.096c-0.005,4.711-3.822,8.529-8.533,8.533h-34.133v-17.067h34.133
				C388.726,393.568,392.543,397.385,392.548,402.096z"/>
			<path style="fill:#428DFF;" d="M159.648,203.329l8.533-8.533c3.281-3.341,3.256-8.701-0.054-12.012
				c-3.311-3.311-8.671-3.335-12.012-0.054l-8.533,8.533c-2.188,2.149-3.055,5.307-2.27,8.271c0.785,2.965,3.1,5.28,6.065,6.065
				C154.341,206.384,157.499,205.517,159.648,203.329z"/>
			<path style="fill:#428DFF;" d="M190.248,191.263l-34.133,34.133c-2.188,2.149-3.055,5.307-2.27,8.271
				c0.785,2.965,3.1,5.28,6.065,6.065c2.965,0.785,6.122-0.082,8.271-2.27l34.133-34.133c3.281-3.341,3.256-8.701-0.054-12.012
				C198.949,188.007,193.589,187.982,190.248,191.263z"/>
			<path style="fill:#428DFF;" d="M175.373,13.421c-4.232-2.072-9.342-0.323-11.417,3.908c-13.789,28.335-13.789,61.436,0,89.771
				c2.073,4.234,7.187,5.986,11.421,3.913c4.234-2.073,5.986-7.187,3.913-11.421c-11.478-23.596-11.478-51.158,0-74.754
				C181.358,20.603,179.605,15.494,175.373,13.421z"/>
			<path style="fill:#428DFF;" d="M208.265,25.271c-1.966-1.123-4.298-1.417-6.481-0.817c-2.183,0.601-4.037,2.046-5.152,4.017
				c-11.844,20.935-11.844,46.548,0,67.483c2.332,4.09,7.536,5.518,11.628,3.191c4.093-2.327,5.527-7.529,3.205-11.625
				c-8.867-15.707-8.867-34.909,0-50.617c1.12-1.967,1.412-4.298,0.812-6.48S210.233,26.388,208.265,25.271z"/>
			<path style="fill:#428DFF;" d="M303.765,99.154c1.967,1.12,4.298,1.412,6.48,0.811s4.036-2.043,5.153-4.011
				c11.844-20.935,11.844-46.548,0-67.483c-2.332-4.09-7.536-5.518-11.628-3.191c-4.093,2.327-5.527,7.529-3.205,11.625
				c8.867,15.707,8.867,34.909,0,50.617c-1.12,1.967-1.412,4.298-0.812,6.48C300.353,96.183,301.796,98.037,303.765,99.154z"/>
			<path style="fill:#428DFF;" d="M336.656,111.009c2.032,0.996,4.377,1.144,6.518,0.411c2.141-0.733,3.903-2.287,4.899-4.319
				c13.789-28.335,13.789-61.436,0-89.771c-2.087-4.209-7.183-5.941-11.402-3.875c-4.219,2.066-5.976,7.153-3.931,11.382
				c11.478,23.596,11.478,51.158,0,74.754C330.671,103.826,332.424,108.936,336.656,111.009z"/>
			<path style="fill:#428DFF;" d="M142.915,1.805c-2.057-0.946-4.406-1.034-6.528-0.244s-3.842,2.392-4.78,4.453
				c-8.06,17.635-12.197,36.81-12.125,56.2c-0.072,19.39,4.065,38.565,12.125,56.2c1.972,4.265,7.021,6.133,11.294,4.178
				c4.273-1.955,6.161-6.997,4.223-11.277c-7.033-15.41-10.641-32.161-10.575-49.1c-0.066-16.939,3.542-33.69,10.575-49.1
				C149.082,8.828,147.198,3.766,142.915,1.805z"/>
			<path style="fill:#428DFF;" d="M369.115,122.621c2.057,0.943,4.405,1.029,6.526,0.24c2.121-0.789,3.841-2.389,4.782-4.448
				c8.06-17.635,12.197-36.81,12.125-56.2c0.072-19.39-4.065-38.564-12.125-56.2c-1.261-2.784-3.914-4.681-6.956-4.974
				c-3.042-0.292-6.008,1.065-7.776,3.558c-1.768,2.493-2.067,5.741-0.784,8.515c7.033,15.41,10.641,32.161,10.575,49.1
				c0.066,16.939-3.542,33.69-10.575,49.1C362.948,115.598,364.831,120.659,369.115,122.621z"/>
		</g>
	</g>
</g>
<g>
</g>
<g>
</g>
<g>
</g>
<g>
</g>
<g>
</g>
<g>
</g>
<g>
</g>
<g>
</g>
<g>
</g>
<g>
</g>
<g>
</g>
<g>
</g>
<g>
</g>
<g>
</g>
<g>
</g>
</svg>
