<?xml version="1.0" encoding="iso-8859-1"?>
<!-- Generator: Adobe Illustrator 16.0.0, SVG Export Plug-In . SVG Version: 6.00 Build 0)  -->
<!DOCTYPE svg PUBLIC "-//W3C//DTD SVG 1.1//EN" "http://www.w3.org/Graphics/SVG/1.1/DTD/svg11.dtd">
<svg version="1.1" id="Capa_1" xmlns="http://www.w3.org/2000/svg" xmlns:xlink="http://www.w3.org/1999/xlink" x="0px" y="0px"
	 width="98.109px" height="98.109px" viewBox="0 0 98.109 98.109" style="enable-background:new 0 0 98.109 98.109;"
	 xml:space="preserve">
<g>
	<g>
		<path d="M87.5,46.306V13.5c0-2.757-2.242-5-5-5H5c-2.757,0-5,2.243-5,5V74c0,2.758,2.243,5,5,5h49.807
			c4.229,6.387,11.477,10.609,19.693,10.609c13.02,0,23.609-10.592,23.609-23.609C98.11,57.783,93.887,50.535,87.5,46.306z
			 M73.277,13.724h7.667v2.666h-7.667V13.724z M59.777,13.724h7.667v2.666h-7.667V13.724z M45.944,13.724h7.667v2.666h-7.667V13.724
			z M52.119,73.5H5.951v-53h75.5v22.936c-2.197-0.679-4.532-1.045-6.95-1.045c-13.019,0-23.608,10.591-23.608,23.609
			C50.891,68.622,51.326,71.143,52.119,73.5z M74.5,83.61c-9.71,0-17.609-7.899-17.609-17.609S64.79,48.392,74.5,48.392
			s17.609,7.899,17.609,17.609S84.21,83.61,74.5,83.61z"/>
		<path d="M87.777,66.057H75.61v-13.5c0-0.828-0.673-1.5-1.5-1.5c-0.828,0-1.5,0.672-1.5,1.5v15c0,0.83,0.672,1.5,1.5,1.5h13.667
			c0.828,0,1.5-0.67,1.5-1.5C89.277,66.729,88.605,66.057,87.777,66.057z"/>
	</g>
</g>
<g>
</g>
<g>
</g>
<g>
</g>
<g>
</g>
<g>
</g>
<g>
</g>
<g>
</g>
<g>
</g>
<g>
</g>
<g>
</g>
<g>
</g>
<g>
</g>
<g>
</g>
<g>
</g>
<g>
</g>
</svg>
