<?xml version="1.0" encoding="iso-8859-1"?>
<!-- Generator: Adobe Illustrator 16.0.0, SVG Export Plug-In . SVG Version: 6.00 Build 0)  -->
<!DOCTYPE svg PUBLIC "-//W3C//DTD SVG 1.1//EN" "http://www.w3.org/Graphics/SVG/1.1/DTD/svg11.dtd">
<svg version="1.1" id="Capa_1" xmlns="http://www.w3.org/2000/svg" xmlns:xlink="http://www.w3.org/1999/xlink" x="0px" y="0px"
	 width="94.668px" height="94.667px" viewBox="0 0 94.668 94.667" style="enable-background:new 0 0 94.668 94.667;"
	 xml:space="preserve">
<g>
	<g>
		<path d="M6.908,79.896h9.344V16.839l8.158,7.321c-0.645,0.977-1.022,2.145-1.022,3.4c0,1.477,0.521,2.832,1.386,3.898v48.438
			h9.344V31.773c1.029-1.107,1.665-2.586,1.665-4.213c0-0.404-0.042-0.799-0.116-1.183l5.937-4.606
			c0.025,0.031,0.044,0.068,0.069,0.099v58.025h9.347V22.034c0.517-0.573,0.926-1.243,1.201-1.978l4.281,2.568
			c-0.124,0.487-0.195,0.994-0.195,1.52c0,1.651,0.652,3.151,1.711,4.263v51.489h9.346V27.979c0.293-0.37,0.525-0.783,0.729-1.214
			l6.194,5.891c-0.516,0.903-0.814,1.945-0.814,3.059c0,1.509,0.543,2.892,1.442,3.968v40.215h9.347V39.861
			c0.993-1.1,1.605-2.553,1.605-4.148c0-3.417-2.78-6.197-6.197-6.197c-1.582,0-3.021,0.601-4.119,1.58l-6.886-6.547
			c0.01-0.137,0.035-0.268,0.035-0.405c0-3.417-2.78-6.197-6.197-6.197c-2.175,0-4.089,1.129-5.194,2.829l-4.693-2.816
			c0-0.021,0.003-0.043,0.003-0.065c0-3.417-2.78-6.197-6.197-6.197s-6.197,2.78-6.197,6.197c0,0.746,0.136,1.461,0.379,2.124
			l-5.68,4.407c-1.079-1.829-3.063-3.062-5.336-3.062c-1.44,0-2.765,0.498-3.819,1.326l-8.807-7.903
			c0.409-0.825,0.656-1.744,0.656-2.726c0-3.417-2.78-6.197-6.197-6.197s-6.197,2.78-6.197,6.197c0,1.64,0.645,3.128,1.688,4.237
			v63.598H6.908z M79.545,31.546c2.314,0,4.197,1.883,4.197,4.197s-1.883,4.197-4.197,4.197s-4.197-1.883-4.197-4.197
			S77.23,31.546,79.545,31.546z M62.378,19.978c2.313,0,4.197,1.883,4.197,4.197c0,2.314-1.884,4.197-4.197,4.197
			s-4.196-1.883-4.196-4.197C58.182,21.86,60.062,19.978,62.378,19.978z M46.295,13.728c2.314,0,4.197,1.883,4.197,4.197
			c0,2.314-1.883,4.197-4.197,4.197c-2.314,0-4.197-1.883-4.197-4.197C42.098,15.61,43.98,13.728,46.295,13.728z M29.461,23.395
			c2.314,0,4.197,1.883,4.197,4.197c0,2.314-1.883,4.197-4.197,4.197s-4.197-1.883-4.197-4.197
			C25.264,25.277,27.147,23.395,29.461,23.395z M11.294,7.895c2.314,0,4.197,1.883,4.197,4.197c0,2.314-1.883,4.197-4.197,4.197
			s-4.197-1.883-4.197-4.197C7.097,9.777,8.98,7.895,11.294,7.895z"/>
		<rect y="81.87" width="94.668" height="6.934"/>
	</g>
</g>
<g>
</g>
<g>
</g>
<g>
</g>
<g>
</g>
<g>
</g>
<g>
</g>
<g>
</g>
<g>
</g>
<g>
</g>
<g>
</g>
<g>
</g>
<g>
</g>
<g>
</g>
<g>
</g>
<g>
</g>
</svg>
