<?xml version="1.0" encoding="iso-8859-1"?>
<!-- Generator: Adobe Illustrator 16.0.0, SVG Export Plug-In . SVG Version: 6.00 Build 0)  -->
<!DOCTYPE svg PUBLIC "-//W3C//DTD SVG 1.1//EN" "http://www.w3.org/Graphics/SVG/1.1/DTD/svg11.dtd">
<svg version="1.1" id="Capa_1" xmlns="http://www.w3.org/2000/svg" xmlns:xlink="http://www.w3.org/1999/xlink" x="0px" y="0px"
	 width="102.158px" height="102.158px" viewBox="0 0 102.158 102.158" style="enable-background:new 0 0 102.158 102.158;"
	 xml:space="preserve">
<g>
	<g>
		<path d="M80.825,74.492c-0.127-0.997-0.403-1.992-0.842-2.955c-2.347-5.139-8.408-7.404-13.548-5.061
			c-2.222,1.014-3.903,2.725-4.911,4.754c-0.012,0.024-0.027,0.048-0.039,0.072c-0.102,0.209-0.187,0.422-0.272,0.635
			c-0.037,0.093-0.082,0.183-0.117,0.275c-0.056,0.148-0.097,0.301-0.146,0.452c-0.052,0.164-0.11,0.326-0.154,0.492
			c-0.022,0.085-0.036,0.173-0.057,0.259c-0.056,0.235-0.111,0.471-0.15,0.709c-0.004,0.021-0.004,0.045-0.008,0.067
			c-0.303,1.925-0.063,3.956,0.812,5.858c2.364,5.129,8.436,7.371,13.564,5.01c1.603-0.738,2.923-1.838,3.91-3.158
			c0.014-0.02,0.024-0.038,0.037-0.057c0.182-0.246,0.354-0.498,0.512-0.758c0.035-0.058,0.062-0.119,0.097-0.178
			c0.13-0.223,0.257-0.448,0.369-0.682c0.048-0.099,0.085-0.201,0.13-0.303c0.088-0.197,0.178-0.393,0.253-0.595
			c0.052-0.139,0.091-0.283,0.136-0.425c0.055-0.168,0.114-0.334,0.16-0.505c0.047-0.181,0.081-0.363,0.119-0.546
			c0.029-0.137,0.064-0.271,0.087-0.41c0.037-0.223,0.058-0.448,0.08-0.672c0.011-0.103,0.028-0.201,0.035-0.303
			c0.019-0.268,0.021-0.535,0.017-0.804c0-0.062,0.006-0.122,0.004-0.185c-0.01-0.309-0.035-0.617-0.072-0.928
			C80.827,74.535,80.827,74.514,80.825,74.492z"/>
		<path d="M93.163,75.075l-0.032-0.013l0.05-1.022c3.199-1.51,4.596-5.334,3.113-8.56l-1.393-3.021
			c-1.055-2.287-3.363-3.765-5.884-3.765c-0.938,0-1.849,0.198-2.703,0.594l-0.073,0.034c-0.207-0.2-0.418-0.395-0.633-0.586
			l0.027-0.072c0.898-2.412,0.213-5.234-1.709-7.025c-0.094-0.086-0.195-0.17-0.301-0.252c-0.213-0.179-0.432-0.346-0.621-0.462
			c-0.406-0.262-0.83-0.475-1.26-0.634l-3.123-1.153c-0.698-0.257-1.434-0.388-2.186-0.388c-0.079,0-0.154,0.015-0.234,0.018V3.291
			C76.202,1.478,74.725,0,72.911,0H8.056C6.243,0,4.767,1.477,4.767,3.291v81.775c0,1.813,1.476,3.291,3.289,3.291h38.355
			c0.187,0.408,0.419,0.802,0.64,1.096c1.211,1.719,3.191,2.746,5.296,2.746c0.936,0,1.844-0.199,2.697-0.592l0.068-0.031
			c0.209,0.201,0.42,0.398,0.637,0.591l-0.029,0.079c-0.604,1.618-0.541,3.375,0.175,4.947c0.716,1.57,2.003,2.771,3.626,3.378
			l3.108,1.159c0.407,0.154,0.844,0.268,1.213,0.324c0.38,0.068,0.769,0.104,1.151,0.104c0.938,0,1.846-0.199,2.691-0.59
			c1.569-0.723,2.764-2.012,3.367-3.639l0.025-0.069c0.289-0.005,0.576-0.015,0.863-0.031l0.034,0.074
			c1.42,3.11,5.151,4.7,8.535,3.219l3.063-1.397c0.395-0.179,0.774-0.401,1.133-0.664c2.541-1.804,3.438-5.15,2.134-7.98
			l-0.032-0.068c0.199-0.207,0.395-0.416,0.584-0.63l0.066,0.024c1.601,0.604,3.377,0.548,4.961-0.17
			c1.496-0.684,2.652-1.881,3.287-3.401l1.252-3.336l0.121-0.366C98.139,79.854,96.426,76.281,93.163,75.075z M44.854,80.373
			c-0.583,1.562-0.547,3.25,0.118,4.821l0.156,0.344H8.056c-0.26,0-0.47-0.211-0.47-0.47V3.345h65.326
			c0.166,0,0.322-0.027,0.472-0.066v0.052l-0.005,0.014v46.167c-1.379,0.724-2.49,1.916-3.055,3.414l-1.021-0.092
			c-1.083-2.202-3.345-3.615-5.812-3.615c-0.931,0-1.834,0.196-2.685,0.584l-3.026,1.38c-0.074,0.035-0.136,0.084-0.209,0.121v-1.87
			H17.858v1.879h39.697c-1.455,0.736-2.576,1.957-3.149,3.494c-0.601,1.604-0.545,3.343,0.149,4.898l-0.631,0.803l-0.038-0.015
			c-0.727-0.271-1.485-0.407-2.257-0.407c-2.617,0-4.998,1.604-5.971,3.96l-1.275,3.399l-0.104,0.326
			c-0.042,0.139-0.078,0.283-0.115,0.443l-0.08,0.342c-0.25,1.326-0.086,2.672,0.48,3.906c0.729,1.572,2.023,2.766,3.633,3.354
			l0.077,0.028c0.001,0.151,0.005,0.306,0.011,0.461l0.015,0.225c0.003,0.061,0.006,0.121,0.009,0.181l-0.079,0.036
			C46.659,77.465,45.458,78.752,44.854,80.373z M93.71,82.503l-0.008,0.022c-0.008,0.022-0.01,0.048-0.019,0.07l-0.585,1.564
			l-0.541,1.465c-0.009,0.023-0.023,0.044-0.033,0.068l-0.007,0.02c-0.278,0.746-0.829,1.336-1.551,1.666
			c-0.724,0.328-1.533,0.357-2.272,0.078l-2.466-0.919c-1.013,1.469-2.239,2.801-3.664,3.95l1.099,2.383
			c0.61,1.326,0.154,2.869-1.002,3.676c-0.164,0.122-0.342,0.229-0.535,0.317l-2.613,1.192l-0.33,0.152
			c-0.005,0.002-0.009,0.002-0.014,0.005l-0.072,0.033c-1.491,0.679-3.257,0.019-3.938-1.472l-1.09-2.391
			c-1.803,0.329-3.613,0.387-5.391,0.193l-0.909,2.465c-0.274,0.743-0.823,1.337-1.546,1.67c-0.559,0.258-1.169,0.328-1.764,0.223
			c-0.201-0.031-0.401-0.08-0.598-0.154l-3.117-1.164c-0.744-0.278-1.336-0.828-1.666-1.551s-0.356-1.531-0.08-2.273l0.923-2.464
			c-1.472-1.015-2.808-2.245-3.958-3.672l-2.383,1.097c-1.32,0.608-2.858,0.159-3.668-0.99c-0.122-0.164-0.23-0.343-0.318-0.537
			l-1.16-2.543l-0.188-0.408c-0.002-0.006-0.004-0.012-0.006-0.018l-0.027-0.06c-0.681-1.491-0.021-3.259,1.471-3.938l2.389-1.089
			c-0.071-0.392-0.124-0.784-0.169-1.177c-0.005-0.046-0.014-0.092-0.02-0.137c-0.042-0.389-0.067-0.777-0.086-1.165
			c-0.003-0.069-0.012-0.14-0.015-0.207c-0.014-0.384-0.01-0.767-0.001-1.148c0.002-0.073-0.002-0.145,0.001-0.217
			c0.012-0.334,0.042-0.667,0.071-0.999c0.011-0.115,0.013-0.23,0.025-0.348l-2.467-0.911c-0.743-0.272-1.337-0.823-1.671-1.543
			c-0.26-0.566-0.329-1.185-0.216-1.786c0.007-0.046,0.026-0.09,0.035-0.135c0.028-0.118,0.05-0.237,0.093-0.354l0.004-0.009
			c0.008-0.023,0.01-0.047,0.019-0.07l0.536-1.434l0.594-1.609c0.009-0.023,0.024-0.043,0.033-0.066l0.003-0.008
			c0.575-1.537,2.29-2.318,3.824-1.746l2.466,0.92c0.217-0.314,0.444-0.623,0.682-0.926c0.001,0,0.003,0.002,0.005,0.002
			c0.883-1.125,1.894-2.162,3.034-3.078l-1.089-2.389c-0.682-1.49-0.021-3.256,1.473-3.938l3.024-1.381
			c1.493-0.68,3.259-0.021,3.938,1.47l1.09,2.392c1.695-0.31,3.395-0.371,5.067-0.219c0-0.002,0-0.004,0-0.007
			c0.109,0.01,0.218,0.012,0.327,0.022l0.911-2.469c0.549-1.488,2.329-2.309,3.819-1.759l3.121,1.153
			c0.207,0.076,0.397,0.177,0.576,0.291c0.115,0.072,0.217,0.16,0.319,0.246c0.037,0.031,0.08,0.058,0.115,0.09
			c0.862,0.804,1.237,2.105,0.813,3.24l-0.921,2.461c1.472,1.015,2.806,2.239,3.958,3.666l2.387-1.101
			c1.488-0.687,3.256-0.03,3.943,1.458l1.391,3.021c0.687,1.49,0.033,3.259-1.455,3.943l-2.385,1.1
			c0.269,1.443,0.357,2.893,0.289,4.326h0.002c-0.008,0.17-0.027,0.336-0.039,0.506c-0.016,0.209-0.022,0.418-0.045,0.627
			l2.471,0.912C93.487,79.253,94.276,80.965,93.71,82.503z"/>
		<rect x="13.512" y="19.659" width="3.289" height="1.88"/>
		<rect x="17.858" y="19.659" width="39.713" height="1.88"/>
		<rect x="13.512" y="29.32" width="3.289" height="1.88"/>
		<rect x="17.858" y="29.32" width="39.713" height="1.88"/>
		<rect x="17.858" y="38.876" width="39.713" height="1.88"/>
		<rect x="13.512" y="38.876" width="3.289" height="1.88"/>
		<rect x="13.512" y="49.434" width="3.289" height="1.88"/>
		<polygon points="70.682,6.965 61.178,6.965 70.682,16.47 		"/>
	</g>
</g>
<g>
</g>
<g>
</g>
<g>
</g>
<g>
</g>
<g>
</g>
<g>
</g>
<g>
</g>
<g>
</g>
<g>
</g>
<g>
</g>
<g>
</g>
<g>
</g>
<g>
</g>
<g>
</g>
<g>
</g>
</svg>
