dwt_stm32_delay.h:18:22:DWT_Delay_us	24	static
LTC6811.c:22:6:LTC6811_init	16	static
LTC6811.c:36:6:wake_up_LTC6811_from_SLEEP	24	static
LTC6811.c:61:6:wake_up_LTC6811_from_IDLE	24	static
LTC6811.c:82:6:start_comm_with_LTC6811	16	static
LTC6811.c:99:6:end_comm_with_LTC6811	16	static
LTC6811.c:116:5:broadcast_poll	40	static
LTC6811.c:147:5:broadcast_write	64	dynamic
LTC6811.c:196:5:broadcast_read	56	static
LTC6811.c:242:6:daisy_chain_B_init	16	static
