[{
  "_id": {
    "$oid": "62a309a5c6f47bb8055e1770"
  },
  "stars": 1,
  "note": "superman",
  "createdAt": {
    "$date": {
      "$numberLong": "1654851849348"
    }
  },
  "updatedAt": {
    "$date": {
      "$numberLong": "1654851849348"
    }
  },
  "__v": 0
},{
  "_id": {
    "$oid": "62a3270c765d5343c4d3b786"
  },
  "stars": 5,
  "note": "spiderman",
  "createdAt": {
    "$date": {
      "$numberLong": "1654859199850"
    }
  },
  "updatedAt": {
    "$date": {
      "$numberLong": "1654859199850"
    }
  },
  "__v": 0
},{
  "_id": {
    "$oid": "62a960d492355ab90d226c11"
  },
  "stars": 4,
  "note": "Good",
  "createdAt": {
    "$date": {
      "$numberLong": "1655267431012"
    }
  },
  "updatedAt": {
    "$date": {
      "$numberLong": "1655267431012"
    }
  },
  "__v": 0
}]