module parser

go 1.20

require (
	github.com/jinzhu/inflection v1.0.0 // indirect
	github.com/jinzhu/now v1.1.5 // indirect
	github.com/mattn/go-sqlite3 v1.14.17 // indirect
	gorm.io/driver/sqlite v1.5.3 // indirect
	gorm.io/gorm v1.25.4 // indirect
)
