{
  "boxes": [
    {
      "id": 2226,
      "x0": 1.5,
      "y0": 6.5,
      "x1": 2.5,
      "y1": 7.5,
      "color": "#ff0000",
      "artag": null,
      "artag_direction": null,
      "x_center_local": 5.5,
      "y_center_local": 6.5
    },
    {
      "id": 2229,
      "x0": 4.0,
      "y0": 5.5,
      "x1": 5.0,
      "y1": 6.5,
      "color": "#00ff00",
      "artag": null,
      "artag_direction": null,
      "x_center_local": 3.0,
      "y_center_local": 5.5
    },
    {
      "id": 2231,
      "x0": 3.0,
      "y0": 0.0,
      "x1": 4.0,
      "y1": 1.0,
      "color": "#0000ff",
      "artag": null,
      "artag_direction": null,
      "x_center_local": 4.0,
      "y_center_local": 0.0
    },
    {
      "id": 2234,
      "x0": 4.0,
      "y0": 1.0,
      "x1": 5.0,
      "y1": 2.0,
      "color": "#ffff00",
      "artag": {
        "id": 230,
        "x": 5,
        "y": 4,
        "x_field": 2.5,
        "y_field": 4.5,
        "artag": [
          [
            1,
            1,
            1,
            1,
            1,
            1
          ],
          [
            1,
            1,
            1,
            1,
            1,
            1
          ],
          [
            1,
            1,
            1,
            0,
            1,
            1
          ],
          [
            1,
            0,
            1,
            0,
            1,
            1
          ],
          [
            1,
            1,
            0,
            0,
            0,
            1
          ],
          [
            1,
            1,
            1,
            1,
            1,
            1
          ]
        ],
        "flip": false
      },
      "artag_direction": [
        1,
        0
      ],
      "x_center_local": 3.0,
      "y_center_local": 1.0
    }
  ],
  "robot": {
    "id": 153,
    "x": 7.5,
    "y": 7.5,
    "dir": [
      0,
      1
    ],
    "x_local": 0.0,
    "y_local": 7.0
  },
  "closest_box": {
    "id": 2231,
    "x0": 3.0,
    "y0": 0.0,
    "x1": 4.0,
    "y1": 1.0,
    "color": "#0000ff",
    "artag": null,
    "artag_direction": null,
    "x_center_local": 4.0,
    "y_center_local": 0.0
  }
}