{
  "boxes": [
    {
      "id": 2301,
      "x0": 6.5,
      "y0": 1.0,
      "x1": 7.5,
      "y1": 2.0,
      "color": "#ff0000",
      "artag": null,
      "artag_direction": null,
      "x_center_local": 0.5,
      "y_center_local": 1.0
    },
    {
      "id": 2305,
      "x0": 1.0,
      "y0": 5.0,
      "x1": 2.0,
      "y1": 6.0,
      "color": "#00ff00",
      "artag": null,
      "artag_direction": null,
      "x_center_local": 6.0,
      "y_center_local": 5.0
    },
    {
      "id": 2307,
      "x0": 3.0,
      "y0": 0.0,
      "x1": 4.0,
      "y1": 1.0,
      "color": "#0000ff",
      "artag": null,
      "artag_direction": null,
      "x_center_local": 4.0,
      "y_center_local": 0.0
    },
    {
      "id": 2311,
      "x0": 3.0,
      "y0": 3.0,
      "x1": 4.0,
      "y1": 4.0,
      "color": "#ffff00",
      "artag": {
        "id": 238,
        "x": 4,
        "y": 7,
        "x_field": 3.5,
        "y_field": 7.5,
        "artag": [
          [
            1,
            1,
            1,
            1,
            1,
            1
          ],
          [
            1,
            1,
            0,
            1,
            1,
            1
          ],
          [
            1,
            0,
            0,
            0,
            1,
            1
          ],
          [
            1,
            1,
            0,
            1,
            1,
            1
          ],
          [
            1,
            1,
            0,
            0,
            0,
            1
          ],
          [
            1,
            1,
            1,
            1,
            1,
            1
          ]
        ],
        "flip": false
      },
      "artag_direction": [
        1,
        0
      ],
      "x_center_local": 4.0,
      "y_center_local": 3.0
    }
  ],
  "robot": {
    "id": 79,
    "x": 2.5,
    "y": 3.5,
    "dir": [
      0,
      -1
    ],
    "x_local": 5.0,
    "y_local": 3.0
  },
  "closest_box": {
    "id": 2307,
    "x0": 3.0,
    "y0": 0.0,
    "x1": 4.0,
    "y1": 1.0,
    "color": "#0000ff",
    "artag": null,
    "artag_direction": null,
    "x_center_local": 4.0,
    "y_center_local": 0.0
  }
}