{
  "boxes": [
    {
      "id": 834,
      "x0": 4.5,
      "y0": 0.5,
      "x1": 5.5,
      "y1": 1.5,
      "color": "#ff0000",
      "artag": null,
      "artag_direction": null,
      "x_center_local": 2.5,
      "y_center_local": 0.5
    },
    {
      "id": 836,
      "x0": 4.5,
      "y0": 6.0,
      "x1": 5.5,
      "y1": 7.0,
      "color": "#00ff00",
      "artag": null,
      "artag_direction": null,
      "x_center_local": 2.5,
      "y_center_local": 6.0
    },
    {
      "id": 839,
      "x0": 0.0,
      "y0": 2.5,
      "x1": 1.0,
      "y1": 3.5,
      "color": "#0000ff",
      "artag": null,
      "artag_direction": null,
      "x_center_local": 7.0,
      "y_center_local": 2.5
    },
    {
      "id": 844,
      "x0": 5.0,
      "y0": 3.5,
      "x1": 6.0,
      "y1": 4.5,
      "color": "#ffff00",
      "artag": {
        "id": 85,
        "x": 7,
        "y": 5,
        "x_field": 0.5,
        "y_field": 5.5,
        "artag": [
          [
            1,
            1,
            1,
            1,
            1,
            1
          ],
          [
            1,
            1,
            1,
            0,
            1,
            1
          ],
          [
            1,
            1,
            1,
            1,
            1,
            1
          ],
          [
            1,
            1,
            1,
            0,
            1,
            1
          ],
          [
            1,
            1,
            0,
            0,
            0,
            1
          ],
          [
            1,
            1,
            1,
            1,
            1,
            1
          ]
        ],
        "flip": false
      },
      "artag_direction": [
        1,
        0
      ],
      "x_center_local": 2.0,
      "y_center_local": 3.5
    }
  ],
  "robot": {
    "id": 28,
    "x": 5.5,
    "y": 5.0,
    "dir": [
      0,
      1
    ],
    "x_local": 2.0,
    "y_local": 4.5
  },
  "closest_box": {
    "id": 839,
    "x0": 0.0,
    "y0": 2.5,
    "x1": 1.0,
    "y1": 3.5,
    "color": "#0000ff",
    "artag": null,
    "artag_direction": null,
    "x_center_local": 7.0,
    "y_center_local": 2.5
  }
}