{
  "robot": {
    "id": 0,
    "x": 7.5,
    "y": 7.5,
    "dir": [
      0,
      1
    ],
    "x_local": 7.0,
    "y_local": 0.0
  },
  "boxes": [
    {
      "id": 0,
      "x0": 6,
      "y0": 1,
      "x1": 7,
      "y1": 2,
      "color": "#ff0000",
      "artag": null,
      "artag_direction": null,
      "x_center_local": 6.0,
      "y_center_local": 6.0
    },
    {
      "id": 1,
      "x0": 1,
      "y0": 6,
      "x1": 2,
      "y1": 7,
      "color": "#00ff00",
      "artag": null,
      "artag_direction": null,
      "x_center_local": 1.0,
      "y_center_local": 1.0
    },
    {
      "id": 2,
      "x0": 1,
      "y0": 1,
      "x1": 2,
      "y1": 2,
      "color": "#0000ff",
      "artag": null,
      "artag_direction": null,
      "x_center_local": 1.0,
      "y_center_local": 6.0
    },
    {
      "id": 3,
      "x0": 6,
      "y0": 7,
      "x1": 7,
      "y1": 8,
      "color": "#ffff00",
      "artag": {
        "id": 0,
        "x": 7,
        "y": 1,
        "x_field": 7.5,
        "y_field": 6.5,
        "artag": [
          [
            1,
            1,
            1,
            1,
            1,
            1
          ],
          [
            1,
            1,
            1,
            1,
            1,
            1
          ],
          [
            1,
            1,
            1,
            1,
            1,
            1
          ],
          [
            1,
            1,
            0,
            0,
            0,
            1
          ],
          [
            1,
            1,
            0,
            0,
            0,
            1
          ],
          [
            1,
            1,
            1,
            1,
            1,
            1
          ]
        ],
        "flip": false
      },
      "artag_direction": [
        0,
        -1
      ],
      "x_center_local": 6.0,
      "y_center_local": 0.0
    }
  ],
  "closest_box": {
    "id": 3,
    "x0": 6,
    "y0": 7,
    "x1": 7,
    "y1": 8,
    "color": "#ffff00",
    "artag": {
      "id": 0,
      "x": 7,
      "y": 1,
      "x_field": 7.5,
      "y_field": 6.5,
      "artag": [
        [
          1,
          1,
          1,
          1,
          1,
          1
        ],
        [
          1,
          1,
          1,
          1,
          1,
          1
        ],
        [
          1,
          1,
          1,
          1,
          1,
          1
        ],
        [
          1,
          1,
          0,
          0,
          0,
          1
        ],
        [
          1,
          1,
          0,
          0,
          0,
          1
        ],
        [
          1,
          1,
          1,
          1,
          1,
          1
        ]
      ],
      "flip": false
    },
    "artag_direction": [
      0,
      -1
    ],
    "x_center_local": 6.0,
    "y_center_local": 0.0
  }
}