{
  "boxes": [
    {
      "id": 1275,
      "x0": 5.5,
      "y0": 6.5,
      "x1": 6.5,
      "y1": 7.5,
      "color": "#ff0000",
      "artag": null,
      "artag_direction": null,
      "x_center_local": 6.5,
      "y_center_local": 5.5
    },
    {
      "id": 1277,
      "x0": 3.5,
      "y0": 3.0,
      "x1": 4.5,
      "y1": 4.0,
      "color": "#00ff00",
      "artag": null,
      "artag_direction": null,
      "x_center_local": 3.0,
      "y_center_local": 3.5
    },
    {
      "id": 1279,
      "x0": 1.0,
      "y0": 6.0,
      "x1": 2.0,
      "y1": 7.0,
      "color": "#0000ff",
      "artag": null,
      "artag_direction": null,
      "x_center_local": 6.0,
      "y_center_local": 1.0
    },
    {
      "id": 1281,
      "x0": 2.0,
      "y0": 2.5,
      "x1": 3.0,
      "y1": 3.5,
      "color": "#ffff00",
      "artag": {
        "id": 130,
        "x": 0,
        "y": 6,
        "x_field": 6.5,
        "y_field": 0.5,
        "artag": [
          [
            1,
            1,
            1,
            1,
            1,
            1
          ],
          [
            1,
            1,
            1,
            1,
            1,
            1
          ],
          [
            1,
            0,
            0,
            0,
            0,
            1
          ],
          [
            1,
            0,
            0,
            1,
            1,
            1
          ],
          [
            1,
            1,
            0,
            0,
            0,
            1
          ],
          [
            1,
            1,
            1,
            1,
            1,
            1
          ]
        ],
        "flip": false
      },
      "artag_direction": [
        0,
        1
      ],
      "x_center_local": 2.5,
      "y_center_local": 2.0
    }
  ],
  "robot": {
    "id": 43,
    "x": 2.5,
    "y": 4.0,
    "dir": [
      0,
      1
    ],
    "x_local": 3.5,
    "y_local": 2.0
  },
  "closest_box": {
    "id": 1275,
    "x0": 5.5,
    "y0": 6.5,
    "x1": 6.5,
    "y1": 7.5,
    "color": "#ff0000",
    "artag": null,
    "artag_direction": null,
    "x_center_local": 6.5,
    "y_center_local": 5.5
  }
}