{
  "boxes": [
    {
      "id": 2125,
      "x0": 6.0,
      "y0": 4.5,
      "x1": 7.0,
      "y1": 5.5,
      "color": "#ff0000",
      "artag": null,
      "artag_direction": null,
      "x_center_local": 6.0,
      "y_center_local": 2.5
    },
    {
      "id": 2127,
      "x0": 2.5,
      "y0": 2.5,
      "x1": 3.5,
      "y1": 3.5,
      "color": "#00ff00",
      "artag": null,
      "artag_direction": null,
      "x_center_local": 2.5,
      "y_center_local": 4.5
    },
    {
      "id": 2129,
      "x0": 3.5,
      "y0": 0.5,
      "x1": 4.5,
      "y1": 1.5,
      "color": "#0000ff",
      "artag": null,
      "artag_direction": null,
      "x_center_local": 3.5,
      "y_center_local": 6.5
    },
    {
      "id": 2132,
      "x0": 0.0,
      "y0": 3.5,
      "x1": 1.0,
      "y1": 4.5,
      "color": "#ffff00",
      "artag": {
        "id": 219,
        "x": 5,
        "y": 4,
        "x_field": 5.5,
        "y_field": 3.5,
        "artag": [
          [
            1,
            1,
            1,
            1,
            1,
            1
          ],
          [
            1,
            1,
            1,
            1,
            1,
            1
          ],
          [
            1,
            1,
            1,
            0,
            1,
            1
          ],
          [
            1,
            0,
            1,
            0,
            1,
            1
          ],
          [
            1,
            1,
            0,
            0,
            0,
            1
          ],
          [
            1,
            1,
            1,
            1,
            1,
            1
          ]
        ],
        "flip": false
      },
      "artag_direction": [
        -1,
        0
      ],
      "x_center_local": 0.0,
      "y_center_local": 3.5
    }
  ],
  "robot": {
    "id": 146,
    "x": 7.5,
    "y": 7.5,
    "dir": [
      0,
      1
    ],
    "x_local": 7.0,
    "y_local": 0.0
  },
  "closest_box": {
    "id": 2132,
    "x0": 0.0,
    "y0": 3.5,
    "x1": 1.0,
    "y1": 4.5,
    "color": "#ffff00",
    "artag": {
      "id": 219,
      "x": 5,
      "y": 4,
      "x_field": 5.5,
      "y_field": 3.5,
      "artag": [
        [
          1,
          1,
          1,
          1,
          1,
          1
        ],
        [
          1,
          1,
          1,
          1,
          1,
          1
        ],
        [
          1,
          1,
          1,
          0,
          1,
          1
        ],
        [
          1,
          0,
          1,
          0,
          1,
          1
        ],
        [
          1,
          1,
          0,
          0,
          0,
          1
        ],
        [
          1,
          1,
          1,
          1,
          1,
          1
        ]
      ],
      "flip": false
    },
    "artag_direction": [
      -1,
      0
    ],
    "x_center_local": 0.0,
    "y_center_local": 3.5
  }
}