{
  "boxes": [
    {
      "id": 2105,
      "x0": 2.0,
      "y0": 5.5,
      "x1": 3.0,
      "y1": 6.5,
      "color": "#ff0000",
      "artag": null,
      "artag_direction": null,
      "x_center_local": 1.5,
      "y_center_local": 5.0
    },
    {
      "id": 2107,
      "x0": 0.5,
      "y0": 1.0,
      "x1": 1.5,
      "y1": 2.0,
      "color": "#00ff00",
      "artag": null,
      "artag_direction": null,
      "x_center_local": 6.0,
      "y_center_local": 6.5
    },
    {
      "id": 2112,
      "x0": 4.5,
      "y0": 2.5,
      "x1": 5.5,
      "y1": 3.5,
      "color": "#0000ff",
      "artag": null,
      "artag_direction": null,
      "x_center_local": 4.5,
      "y_center_local": 2.5
    },
    {
      "id": 2115,
      "x0": 5.5,
      "y0": 6.0,
      "x1": 6.5,
      "y1": 7.0,
      "color": "#ffff00",
      "artag": {
        "id": 217,
        "x": 3,
        "y": 5,
        "x_field": 2.5,
        "y_field": 4.5,
        "artag": [
          [
            1,
            1,
            1,
            1,
            1,
            1
          ],
          [
            1,
            1,
            1,
            1,
            1,
            1
          ],
          [
            1,
            1,
            0,
            1,
            0,
            1
          ],
          [
            1,
            1,
            1,
            0,
            1,
            1
          ],
          [
            1,
            1,
            0,
            0,
            0,
            1
          ],
          [
            1,
            1,
            1,
            1,
            1,
            1
          ]
        ],
        "flip": false
      },
      "artag_direction": [
        0,
        1
      ],
      "x_center_local": 1.0,
      "y_center_local": 1.5
    }
  ],
  "robot": {
    "id": 72,
    "x": 7.0,
    "y": 6.5,
    "dir": [
      0,
      -1
    ],
    "x_local": 1.0,
    "y_local": 0.5
  },
  "closest_box": {
    "id": 2107,
    "x0": 0.5,
    "y0": 1.0,
    "x1": 1.5,
    "y1": 2.0,
    "color": "#00ff00",
    "artag": null,
    "artag_direction": null,
    "x_center_local": 6.0,
    "y_center_local": 6.5
  }
}