{
  "boxes": [
    {
      "id": 1542,
      "x0": 4.0,
      "y0": 6.0,
      "x1": 5.0,
      "y1": 7.0,
      "color": "#ff0000",
      "artag": null,
      "artag_direction": null,
      "x_center_local": 4.0,
      "y_center_local": 1.0
    },
    {
      "id": 1544,
      "x0": 4.5,
      "y0": 1.5,
      "x1": 5.5,
      "y1": 2.5,
      "color": "#00ff00",
      "artag": null,
      "artag_direction": null,
      "x_center_local": 4.5,
      "y_center_local": 5.5
    },
    {
      "id": 1546,
      "x0": 6.5,
      "y0": 4.0,
      "x1": 7.5,
      "y1": 5.0,
      "color": "#0000ff",
      "artag": null,
      "artag_direction": null,
      "x_center_local": 6.5,
      "y_center_local": 3.0
    },
    {
      "id": 1549,
      "x0": 4.0,
      "y0": 0.0,
      "x1": 5.0,
      "y1": 1.0,
      "color": "#ffff00",
      "artag": {
        "id": 159,
        "x": 2,
        "y": 7,
        "x_field": 2.5,
        "y_field": 0.5,
        "artag": [
          [
            1,
            1,
            1,
            1,
            1,
            1
          ],
          [
            1,
            1,
            1,
            0,
            1,
            1
          ],
          [
            1,
            0,
            0,
            1,
            0,
            1
          ],
          [
            1,
            1,
            0,
            1,
            1,
            1
          ],
          [
            1,
            1,
            0,
            0,
            0,
            1
          ],
          [
            1,
            1,
            1,
            1,
            1,
            1
          ]
        ],
        "flip": false
      },
      "artag_direction": [
        1,
        0
      ],
      "x_center_local": 4.0,
      "y_center_local": 7.0
    }
  ],
  "robot": {
    "id": 106,
    "x": 7.5,
    "y": 7.5,
    "dir": [
      0,
      -1
    ],
    "x_local": 7.0,
    "y_local": 0.0
  },
  "closest_box": {
    "id": 1549,
    "x0": 4.0,
    "y0": 0.0,
    "x1": 5.0,
    "y1": 1.0,
    "color": "#ffff00",
    "artag": {
      "id": 159,
      "x": 2,
      "y": 7,
      "x_field": 2.5,
      "y_field": 0.5,
      "artag": [
        [
          1,
          1,
          1,
          1,
          1,
          1
        ],
        [
          1,
          1,
          1,
          0,
          1,
          1
        ],
        [
          1,
          0,
          0,
          1,
          0,
          1
        ],
        [
          1,
          1,
          0,
          1,
          1,
          1
        ],
        [
          1,
          1,
          0,
          0,
          0,
          1
        ],
        [
          1,
          1,
          1,
          1,
          1,
          1
        ]
      ],
      "flip": false
    },
    "artag_direction": [
      1,
      0
    ],
    "x_center_local": 4.0,
    "y_center_local": 7.0
  }
}