{
  "boxes": [
    {
      "id": 901,
      "x0": 1.5,
      "y0": 0.0,
      "x1": 2.5,
      "y1": 1.0,
      "color": "#ff0000",
      "artag": null,
      "artag_direction": null,
      "x_center_local": 0.0,
      "y_center_local": 1.5
    },
    {
      "id": 903,
      "x0": 3.0,
      "y0": 1.0,
      "x1": 4.0,
      "y1": 2.0,
      "color": "#00ff00",
      "artag": null,
      "artag_direction": null,
      "x_center_local": 1.0,
      "y_center_local": 3.0
    },
    {
      "id": 905,
      "x0": 3.0,
      "y0": 6.5,
      "x1": 4.0,
      "y1": 7.5,
      "color": "#0000ff",
      "artag": null,
      "artag_direction": null,
      "x_center_local": 6.5,
      "y_center_local": 3.0
    },
    {
      "id": 907,
      "x0": 5.5,
      "y0": 3.0,
      "x1": 6.5,
      "y1": 4.0,
      "color": "#ffff00",
      "artag": {
        "id": 91,
        "x": 6,
        "y": 5,
        "x_field": 5.5,
        "y_field": 6.5,
        "artag": [
          [
            1,
            1,
            1,
            1,
            1,
            1
          ],
          [
            1,
            1,
            0,
            1,
            1,
            1
          ],
          [
            1,
            0,
            1,
            1,
            1,
            1
          ],
          [
            1,
            1,
            1,
            0,
            1,
            1
          ],
          [
            1,
            1,
            0,
            0,
            0,
            1
          ],
          [
            1,
            1,
            1,
            1,
            1,
            1
          ]
        ],
        "flip": false
      },
      "artag_direction": [
        1,
        0
      ],
      "x_center_local": 3.0,
      "y_center_local": 5.5
    }
  ],
  "robot": {
    "id": 30,
    "x": 6.0,
    "y": 4.5,
    "dir": [
      0,
      -1
    ],
    "x_local": 4.0,
    "y_local": 5.5
  },
  "closest_box": {
    "id": 901,
    "x0": 1.5,
    "y0": 0.0,
    "x1": 2.5,
    "y1": 1.0,
    "color": "#ff0000",
    "artag": null,
    "artag_direction": null,
    "x_center_local": 0.0,
    "y_center_local": 1.5
  }
}