{
  "boxes": [
    {
      "id": 1459,
      "x0": 3.5,
      "y0": 4.5,
      "x1": 4.5,
      "y1": 5.5,
      "color": "#ff0000",
      "artag": null,
      "artag_direction": null,
      "x_center_local": 3.5,
      "y_center_local": 2.5
    },
    {
      "id": 1461,
      "x0": 6.0,
      "y0": 3.5,
      "x1": 7.0,
      "y1": 4.5,
      "color": "#00ff00",
      "artag": null,
      "artag_direction": null,
      "x_center_local": 6.0,
      "y_center_local": 3.5
    },
    {
      "id": 1463,
      "x0": 2.0,
      "y0": 4.5,
      "x1": 3.0,
      "y1": 5.5,
      "color": "#0000ff",
      "artag": null,
      "artag_direction": null,
      "x_center_local": 2.0,
      "y_center_local": 2.5
    },
    {
      "id": 1466,
      "x0": 0.5,
      "y0": 1.5,
      "x1": 1.5,
      "y1": 2.5,
      "color": "#ffff00",
      "artag": {
        "id": 149,
        "x": 7,
        "y": 6,
        "x_field": 7.5,
        "y_field": 1.5,
        "artag": [
          [
            1,
            1,
            1,
            1,
            1,
            1
          ],
          [
            1,
            1,
            1,
            1,
            1,
            1
          ],
          [
            1,
            1,
            0,
            1,
            1,
            1
          ],
          [
            1,
            0,
            0,
            1,
            1,
            1
          ],
          [
            1,
            1,
            0,
            0,
            0,
            1
          ],
          [
            1,
            1,
            1,
            1,
            1,
            1
          ]
        ],
        "flip": false
      },
      "artag_direction": [
        0,
        1
      ],
      "x_center_local": 0.5,
      "y_center_local": 5.5
    }
  ],
  "robot": {
    "id": 99,
    "x": 7.5,
    "y": 7.5,
    "dir": [
      0,
      1
    ],
    "x_local": 7.0,
    "y_local": 0.0
  },
  "closest_box": {
    "id": 1466,
    "x0": 0.5,
    "y0": 1.5,
    "x1": 1.5,
    "y1": 2.5,
    "color": "#ffff00",
    "artag": {
      "id": 149,
      "x": 7,
      "y": 6,
      "x_field": 7.5,
      "y_field": 1.5,
      "artag": [
        [
          1,
          1,
          1,
          1,
          1,
          1
        ],
        [
          1,
          1,
          1,
          1,
          1,
          1
        ],
        [
          1,
          1,
          0,
          1,
          1,
          1
        ],
        [
          1,
          0,
          0,
          1,
          1,
          1
        ],
        [
          1,
          1,
          0,
          0,
          0,
          1
        ],
        [
          1,
          1,
          1,
          1,
          1,
          1
        ]
      ],
      "flip": false
    },
    "artag_direction": [
      0,
      1
    ],
    "x_center_local": 0.5,
    "y_center_local": 5.5
  }
}