{
  "boxes": [
    {
      "id": 1248,
      "x0": 0.5,
      "y0": 0.5,
      "x1": 1.5,
      "y1": 1.5,
      "color": "#ff0000",
      "artag": null,
      "artag_direction": null,
      "x_center_local": 0.5,
      "y_center_local": 6.5
    },
    {
      "id": 1250,
      "x0": 2.0,
      "y0": 5.5,
      "x1": 3.0,
      "y1": 6.5,
      "color": "#00ff00",
      "artag": null,
      "artag_direction": null,
      "x_center_local": 2.0,
      "y_center_local": 1.5
    },
    {
      "id": 1252,
      "x0": 5.5,
      "y0": 1.0,
      "x1": 6.5,
      "y1": 2.0,
      "color": "#0000ff",
      "artag": null,
      "artag_direction": null,
      "x_center_local": 5.5,
      "y_center_local": 6.0
    },
    {
      "id": 1256,
      "x0": 0.0,
      "y0": 3.0,
      "x1": 1.0,
      "y1": 4.0,
      "color": "#ffff00",
      "artag": {
        "id": 127,
        "x": 1,
        "y": 0,
        "x_field": 1.5,
        "y_field": 7.5,
        "artag": [
          [
            1,
            1,
            1,
            1,
            1,
            1
          ],
          [
            1,
            1,
            1,
            1,
            1,
            1
          ],
          [
            1,
            1,
            0,
            0,
            0,
            1
          ],
          [
            1,
            0,
            0,
            0,
            0,
            1
          ],
          [
            1,
            1,
            0,
            0,
            0,
            1
          ],
          [
            1,
            1,
            1,
            1,
            1,
            1
          ]
        ],
        "flip": false
      },
      "artag_direction": [
        1,
        0
      ],
      "x_center_local": 0.0,
      "y_center_local": 4.0
    }
  ],
  "robot": {
    "id": 42,
    "x": 0.5,
    "y": 4.5,
    "dir": [
      -1,
      0
    ],
    "x_local": 0.0,
    "y_local": 3.0
  },
  "closest_box": {
    "id": 1256,
    "x0": 0.0,
    "y0": 3.0,
    "x1": 1.0,
    "y1": 4.0,
    "color": "#ffff00",
    "artag": {
      "id": 127,
      "x": 1,
      "y": 0,
      "x_field": 1.5,
      "y_field": 7.5,
      "artag": [
        [
          1,
          1,
          1,
          1,
          1,
          1
        ],
        [
          1,
          1,
          1,
          1,
          1,
          1
        ],
        [
          1,
          1,
          0,
          0,
          0,
          1
        ],
        [
          1,
          0,
          0,
          0,
          0,
          1
        ],
        [
          1,
          1,
          0,
          0,
          0,
          1
        ],
        [
          1,
          1,
          1,
          1,
          1,
          1
        ]
      ],
      "flip": false
    },
    "artag_direction": [
      1,
      0
    ],
    "x_center_local": 0.0,
    "y_center_local": 4.0
  }
}