{
  "boxes": [
    {
      "id": 2430,
      "x0": 3.0,
      "y0": 0.5,
      "x1": 4.0,
      "y1": 1.5,
      "color": "#ff0000",
      "artag": null,
      "artag_direction": null,
      "x_center_local": 0.5,
      "y_center_local": 3.0
    },
    {
      "id": 2432,
      "x0": 4.0,
      "y0": 3.5,
      "x1": 5.0,
      "y1": 4.5,
      "color": "#00ff00",
      "artag": null,
      "artag_direction": null,
      "x_center_local": 3.5,
      "y_center_local": 4.0
    },
    {
      "id": 2434,
      "x0": 5.5,
      "y0": 1.5,
      "x1": 6.5,
      "y1": 2.5,
      "color": "#0000ff",
      "artag": null,
      "artag_direction": null,
      "x_center_local": 1.5,
      "y_center_local": 5.5
    },
    {
      "id": 2440,
      "x0": 1.0,
      "y0": 1.5,
      "x1": 2.0,
      "y1": 2.5,
      "color": "#ffff00",
      "artag": {
        "id": 252,
        "x": 5,
        "y": 2,
        "x_field": 2.5,
        "y_field": 5.5,
        "artag": [
          [
            1,
            1,
            1,
            1,
            1,
            1
          ],
          [
            1,
            1,
            0,
            0,
            1,
            1
          ],
          [
            1,
            1,
            1,
            0,
            1,
            1
          ],
          [
            1,
            0,
            1,
            1,
            0,
            1
          ],
          [
            1,
            1,
            0,
            0,
            0,
            1
          ],
          [
            1,
            1,
            1,
            1,
            1,
            1
          ]
        ],
        "flip": false
      },
      "artag_direction": [
        1,
        0
      ],
      "x_center_local": 1.5,
      "y_center_local": 1.0
    }
  ],
  "robot": {
    "id": 168,
    "x": 7.5,
    "y": 7.5,
    "dir": [
      -1,
      0
    ],
    "x_local": 7.0,
    "y_local": 7.0
  },
  "closest_box": {
    "id": 2430,
    "x0": 3.0,
    "y0": 0.5,
    "x1": 4.0,
    "y1": 1.5,
    "color": "#ff0000",
    "artag": null,
    "artag_direction": null,
    "x_center_local": 0.5,
    "y_center_local": 3.0
  }
}