{
  "boxes": [
    {
      "id": 1501,
      "x0": 0.0,
      "y0": 3.0,
      "x1": 1.0,
      "y1": 4.0,
      "color": "#ff0000",
      "artag": null,
      "artag_direction": null,
      "x_center_local": 3.0,
      "y_center_local": 0.0
    },
    {
      "id": 1503,
      "x0": 5.0,
      "y0": 4.5,
      "x1": 6.0,
      "y1": 5.5,
      "color": "#00ff00",
      "artag": null,
      "artag_direction": null,
      "x_center_local": 4.5,
      "y_center_local": 5.0
    },
    {
      "id": 1505,
      "x0": 4.5,
      "y0": 0.5,
      "x1": 5.5,
      "y1": 1.5,
      "color": "#0000ff",
      "artag": null,
      "artag_direction": null,
      "x_center_local": 0.5,
      "y_center_local": 4.5
    },
    {
      "id": 1507,
      "x0": 4.5,
      "y0": 6.0,
      "x1": 5.5,
      "y1": 7.0,
      "color": "#ffff00",
      "artag": {
        "id": 154,
        "x": 6,
        "y": 0,
        "x_field": 0.5,
        "y_field": 6.5,
        "artag": [
          [
            1,
            1,
            1,
            1,
            1,
            1
          ],
          [
            1,
            1,
            1,
            1,
            1,
            1
          ],
          [
            1,
            0,
            0,
            1,
            1,
            1
          ],
          [
            1,
            0,
            0,
            0,
            0,
            1
          ],
          [
            1,
            1,
            0,
            0,
            0,
            1
          ],
          [
            1,
            1,
            1,
            1,
            1,
            1
          ]
        ],
        "flip": false
      },
      "artag_direction": [
        0,
        -1
      ],
      "x_center_local": 6.0,
      "y_center_local": 4.5
    }
  ],
  "robot": {
    "id": 51,
    "x": 6.0,
    "y": 6.5,
    "dir": [
      0,
      -1
    ],
    "x_local": 6.0,
    "y_local": 5.5
  },
  "closest_box": {
    "id": 1501,
    "x0": 0.0,
    "y0": 3.0,
    "x1": 1.0,
    "y1": 4.0,
    "color": "#ff0000",
    "artag": null,
    "artag_direction": null,
    "x_center_local": 3.0,
    "y_center_local": 0.0
  }
}