{
  "boxes": [
    {
      "id": 808,
      "x0": 1.0,
      "y0": 4.0,
      "x1": 2.0,
      "y1": 5.0,
      "color": "#ff0000",
      "artag": null,
      "artag_direction": null,
      "x_center_local": 1.0,
      "y_center_local": 3.0
    },
    {
      "id": 811,
      "x0": 6.5,
      "y0": 0.5,
      "x1": 7.5,
      "y1": 1.5,
      "color": "#00ff00",
      "artag": null,
      "artag_direction": null,
      "x_center_local": 6.5,
      "y_center_local": 6.5
    },
    {
      "id": 814,
      "x0": 5.0,
      "y0": 3.0,
      "x1": 6.0,
      "y1": 4.0,
      "color": "#0000ff",
      "artag": null,
      "artag_direction": null,
      "x_center_local": 5.0,
      "y_center_local": 4.0
    },
    {
      "id": 816,
      "x0": 0.0,
      "y0": 6.0,
      "x1": 1.0,
      "y1": 7.0,
      "color": "#ffff00",
      "artag": {
        "id": 82,
        "x": 6,
        "y": 2,
        "x_field": 6.5,
        "y_field": 5.5,
        "artag": [
          [
            1,
            1,
            1,
            1,
            1,
            1
          ],
          [
            1,
            1,
            0,
            1,
            1,
            1
          ],
          [
            1,
            0,
            0,
            1,
            1,
            1
          ],
          [
            1,
            0,
            1,
            1,
            0,
            1
          ],
          [
            1,
            1,
            0,
            0,
            0,
            1
          ],
          [
            1,
            1,
            1,
            1,
            1,
            1
          ]
        ],
        "flip": false
      },
      "artag_direction": [
        -1,
        0
      ],
      "x_center_local": 0.0,
      "y_center_local": 1.0
    }
  ],
  "robot": {
    "id": 27,
    "x": 1.5,
    "y": 6.5,
    "dir": [
      1,
      0
    ],
    "x_local": 1.0,
    "y_local": 1.0
  },
  "closest_box": {
    "id": 816,
    "x0": 0.0,
    "y0": 6.0,
    "x1": 1.0,
    "y1": 7.0,
    "color": "#ffff00",
    "artag": {
      "id": 82,
      "x": 6,
      "y": 2,
      "x_field": 6.5,
      "y_field": 5.5,
      "artag": [
        [
          1,
          1,
          1,
          1,
          1,
          1
        ],
        [
          1,
          1,
          0,
          1,
          1,
          1
        ],
        [
          1,
          0,
          0,
          1,
          1,
          1
        ],
        [
          1,
          0,
          1,
          1,
          0,
          1
        ],
        [
          1,
          1,
          0,
          0,
          0,
          1
        ],
        [
          1,
          1,
          1,
          1,
          1,
          1
        ]
      ],
      "flip": false
    },
    "artag_direction": [
      -1,
      0
    ],
    "x_center_local": 0.0,
    "y_center_local": 1.0
  }
}