{
  "boxes": [
    {
      "id": 459,
      "x0": 0.0,
      "y0": 6.0,
      "x1": 1.0,
      "y1": 7.0,
      "color": "#ff0000",
      "artag": null,
      "artag_direction": null,
      "x_center_local": 6.0,
      "y_center_local": 0.0
    },
    {
      "id": 461,
      "x0": 3.5,
      "y0": 5.0,
      "x1": 4.5,
      "y1": 6.0,
      "color": "#00ff00",
      "artag": null,
      "artag_direction": null,
      "x_center_local": 5.0,
      "y_center_local": 3.5
    },
    {
      "id": 463,
      "x0": 4.5,
      "y0": 4.0,
      "x1": 5.5,
      "y1": 5.0,
      "color": "#0000ff",
      "artag": null,
      "artag_direction": null,
      "x_center_local": 4.0,
      "y_center_local": 4.5
    },
    {
      "id": 465,
      "x0": 0.5,
      "y0": 0.5,
      "x1": 1.5,
      "y1": 1.5,
      "color": "#ffff00",
      "artag": {
        "id": 47,
        "x": 4,
        "y": 2,
        "x_field": 2.5,
        "y_field": 4.5,
        "artag": [
          [
            1,
            1,
            1,
            1,
            1,
            1
          ],
          [
            1,
            1,
            1,
            1,
            1,
            1
          ],
          [
            1,
            0,
            1,
            0,
            1,
            1
          ],
          [
            1,
            0,
            1,
            1,
            0,
            1
          ],
          [
            1,
            1,
            0,
            0,
            0,
            1
          ],
          [
            1,
            1,
            1,
            1,
            1,
            1
          ]
        ],
        "flip": false
      },
      "artag_direction": [
        -1,
        0
      ],
      "x_center_local": 0.5,
      "y_center_local": 0.5
    }
  ],
  "robot": {
    "id": 31,
    "x": 7.5,
    "y": 7.5,
    "dir": [
      -1,
      0
    ],
    "x_local": 7.0,
    "y_local": 7.0
  },
  "closest_box": {
    "id": 459,
    "x0": 0.0,
    "y0": 6.0,
    "x1": 1.0,
    "y1": 7.0,
    "color": "#ff0000",
    "artag": null,
    "artag_direction": null,
    "x_center_local": 6.0,
    "y_center_local": 0.0
  }
}