{
  "boxes": [
    {
      "id": 2344,
      "x0": 0.5,
      "y0": 0.0,
      "x1": 1.5,
      "y1": 1.0,
      "color": "#ff0000",
      "artag": null,
      "artag_direction": null,
      "x_center_local": 0.0,
      "y_center_local": 0.5
    },
    {
      "id": 2346,
      "x0": 1.5,
      "y0": 1.5,
      "x1": 2.5,
      "y1": 2.5,
      "color": "#00ff00",
      "artag": null,
      "artag_direction": null,
      "x_center_local": 1.5,
      "y_center_local": 1.5
    },
    {
      "id": 2348,
      "x0": 6.5,
      "y0": 2.0,
      "x1": 7.5,
      "y1": 3.0,
      "color": "#0000ff",
      "artag": null,
      "artag_direction": null,
      "x_center_local": 2.0,
      "y_center_local": 6.5
    },
    {
      "id": 2352,
      "x0": 1.0,
      "y0": 5.5,
      "x1": 2.0,
      "y1": 6.5,
      "color": "#ffff00",
      "artag": {
        "id": 242,
        "x": 7,
        "y": 5,
        "x_field": 5.5,
        "y_field": 7.5,
        "artag": [
          [
            1,
            1,
            1,
            1,
            1,
            1
          ],
          [
            1,
            1,
            1,
            0,
            1,
            1
          ],
          [
            1,
            1,
            1,
            1,
            1,
            1
          ],
          [
            1,
            1,
            1,
            0,
            1,
            1
          ],
          [
            1,
            1,
            0,
            0,
            0,
            1
          ],
          [
            1,
            1,
            1,
            1,
            1,
            1
          ]
        ],
        "flip": false
      },
      "artag_direction": [
        0,
        -1
      ],
      "x_center_local": 5.5,
      "y_center_local": 1.0
    }
  ],
  "robot": {
    "id": 161,
    "x": 7.5,
    "y": 7.5,
    "dir": [
      1,
      0
    ],
    "x_local": 7.0,
    "y_local": 7.0
  },
  "closest_box": {
    "id": 2344,
    "x0": 0.5,
    "y0": 0.0,
    "x1": 1.5,
    "y1": 1.0,
    "color": "#ff0000",
    "artag": null,
    "artag_direction": null,
    "x_center_local": 0.0,
    "y_center_local": 0.5
  }
}