{
  "boxes": [
    {
      "id": 723,
      "x0": 2.5,
      "y0": 4.0,
      "x1": 3.5,
      "y1": 5.0,
      "color": "#ff0000",
      "artag": null,
      "artag_direction": null,
      "x_center_local": 4.5,
      "y_center_local": 4.0
    },
    {
      "id": 725,
      "x0": 3.0,
      "y0": 6.0,
      "x1": 4.0,
      "y1": 7.0,
      "color": "#00ff00",
      "artag": null,
      "artag_direction": null,
      "x_center_local": 4.0,
      "y_center_local": 6.0
    },
    {
      "id": 727,
      "x0": 2.0,
      "y0": 0.0,
      "x1": 3.0,
      "y1": 1.0,
      "color": "#0000ff",
      "artag": null,
      "artag_direction": null,
      "x_center_local": 5.0,
      "y_center_local": 0.0
    },
    {
      "id": 730,
      "x0": 0.5,
      "y0": 0.5,
      "x1": 1.5,
      "y1": 1.5,
      "color": "#ffff00",
      "artag": {
        "id": 73,
        "x": 2,
        "y": 7,
        "x_field": 5.5,
        "y_field": 7.5,
        "artag": [
          [
            1,
            1,
            1,
            1,
            1,
            1
          ],
          [
            1,
            1,
            1,
            0,
            1,
            1
          ],
          [
            1,
            0,
            0,
            1,
            0,
            1
          ],
          [
            1,
            1,
            0,
            1,
            1,
            1
          ],
          [
            1,
            1,
            0,
            0,
            0,
            1
          ],
          [
            1,
            1,
            1,
            1,
            1,
            1
          ]
        ],
        "flip": false
      },
      "artag_direction": [
        -1,
        0
      ],
      "x_center_local": 6.5,
      "y_center_local": 0.5
    }
  ],
  "robot": {
    "id": 24,
    "x": 1.0,
    "y": 2.0,
    "dir": [
      -1,
      0
    ],
    "x_local": 6.5,
    "y_local": 1.5
  },
  "closest_box": {
    "id": 727,
    "x0": 2.0,
    "y0": 0.0,
    "x1": 3.0,
    "y1": 1.0,
    "color": "#0000ff",
    "artag": null,
    "artag_direction": null,
    "x_center_local": 5.0,
    "y_center_local": 0.0
  }
}