{
  "boxes": [
    {
      "id": 2236,
      "x0": 3.0,
      "y0": 6.0,
      "x1": 4.0,
      "y1": 7.0,
      "color": "#ff0000",
      "artag": null,
      "artag_direction": null,
      "x_center_local": 3.0,
      "y_center_local": 1.0
    },
    {
      "id": 2238,
      "x0": 5.5,
      "y0": 1.5,
      "x1": 6.5,
      "y1": 2.5,
      "color": "#00ff00",
      "artag": null,
      "artag_direction": null,
      "x_center_local": 5.5,
      "y_center_local": 5.5
    },
    {
      "id": 2241,
      "x0": 4.5,
      "y0": 5.0,
      "x1": 5.5,
      "y1": 6.0,
      "color": "#0000ff",
      "artag": null,
      "artag_direction": null,
      "x_center_local": 4.5,
      "y_center_local": 2.0
    },
    {
      "id": 2243,
      "x0": 3.0,
      "y0": 0.0,
      "x1": 4.0,
      "y1": 1.0,
      "color": "#ffff00",
      "artag": {
        "id": 231,
        "x": 1,
        "y": 4,
        "x_field": 1.5,
        "y_field": 3.5,
        "artag": [
          [
            1,
            1,
            1,
            1,
            1,
            1
          ],
          [
            1,
            1,
            1,
            0,
            1,
            1
          ],
          [
            1,
            1,
            0,
            0,
            0,
            1
          ],
          [
            1,
            0,
            1,
            0,
            1,
            1
          ],
          [
            1,
            1,
            0,
            0,
            0,
            1
          ],
          [
            1,
            1,
            1,
            1,
            1,
            1
          ]
        ],
        "flip": false
      },
      "artag_direction": [
        0,
        1
      ],
      "x_center_local": 3.0,
      "y_center_local": 7.0
    }
  ],
  "robot": {
    "id": 154,
    "x": 7.5,
    "y": 7.5,
    "dir": [
      0,
      1
    ],
    "x_local": 7.0,
    "y_local": 0.0
  },
  "closest_box": {
    "id": 2243,
    "x0": 3.0,
    "y0": 0.0,
    "x1": 4.0,
    "y1": 1.0,
    "color": "#ffff00",
    "artag": {
      "id": 231,
      "x": 1,
      "y": 4,
      "x_field": 1.5,
      "y_field": 3.5,
      "artag": [
        [
          1,
          1,
          1,
          1,
          1,
          1
        ],
        [
          1,
          1,
          1,
          0,
          1,
          1
        ],
        [
          1,
          1,
          0,
          0,
          0,
          1
        ],
        [
          1,
          0,
          1,
          0,
          1,
          1
        ],
        [
          1,
          1,
          0,
          0,
          0,
          1
        ],
        [
          1,
          1,
          1,
          1,
          1,
          1
        ]
      ],
      "flip": false
    },
    "artag_direction": [
      0,
      1
    ],
    "x_center_local": 3.0,
    "y_center_local": 7.0
  }
}