{
  "boxes": [
    {
      "id": 636,
      "x0": 3.0,
      "y0": 0.5,
      "x1": 4.0,
      "y1": 1.5,
      "color": "#ff0000",
      "artag": null,
      "artag_direction": null,
      "x_center_local": 4.0,
      "y_center_local": 0.5
    },
    {
      "id": 639,
      "x0": 4.0,
      "y0": 3.5,
      "x1": 5.0,
      "y1": 4.5,
      "color": "#00ff00",
      "artag": null,
      "artag_direction": null,
      "x_center_local": 3.0,
      "y_center_local": 3.5
    },
    {
      "id": 642,
      "x0": 0.0,
      "y0": 6.0,
      "x1": 1.0,
      "y1": 7.0,
      "color": "#0000ff",
      "artag": null,
      "artag_direction": null,
      "x_center_local": 7.0,
      "y_center_local": 6.0
    },
    {
      "id": 644,
      "x0": 2.5,
      "y0": 2.0,
      "x1": 3.5,
      "y1": 3.0,
      "color": "#ffff00",
      "artag": {
        "id": 64,
        "x": 1,
        "y": 1,
        "x_field": 6.5,
        "y_field": 1.5,
        "artag": [
          [
            1,
            1,
            1,
            1,
            1,
            1
          ],
          [
            1,
            1,
            0,
            0,
            1,
            1
          ],
          [
            1,
            1,
            1,
            0,
            0,
            1
          ],
          [
            1,
            1,
            0,
            0,
            0,
            1
          ],
          [
            1,
            1,
            0,
            0,
            0,
            1
          ],
          [
            1,
            1,
            1,
            1,
            1,
            1
          ]
        ],
        "flip": false
      },
      "artag_direction": [
        -1,
        0
      ],
      "x_center_local": 4.5,
      "y_center_local": 2.0
    }
  ],
  "robot": {
    "id": 21,
    "x": 2.0,
    "y": 2.5,
    "dir": [
      -1,
      0
    ],
    "x_local": 5.5,
    "y_local": 2.0
  },
  "closest_box": {
    "id": 642,
    "x0": 0.0,
    "y0": 6.0,
    "x1": 1.0,
    "y1": 7.0,
    "color": "#0000ff",
    "artag": null,
    "artag_direction": null,
    "x_center_local": 7.0,
    "y_center_local": 6.0
  }
}