{
  "boxes": [
    {
      "id": 0,
      "x0": 4.0,
      "y0": 1.5,
      "x1": 5.0,
      "y1": 2.5,
      "color": "#ff0000",
      "artag": null,
      "artag_direction": null
    },
    {
      "id": 1,
      "x0": 2.5,
      "y0": 4.0,
      "x1": 3.5,
      "y1": 5.0,
      "color": "#00ff00",
      "artag": null,
      "artag_direction": null
    },
    {
      "id": 2,
      "x0": 1.0,
      "y0": 1.0,
      "x1": 2.0,
      "y1": 2.0,
      "color": "#0000ff",
      "artag": null,
      "artag_direction": null
    },
    {
      "id": 3,
      "x0": 4.5,
      "y0": 5.5,
      "x1": 5.5,
      "y1": 6.5,
      "color": "#ffff00",
      "artag": {
        "id": 0,
        "x": 6,
        "y": 7,
        "artag": [
          [
            1,
            1,
            1,
            1,
            1,
            1
          ],
          [
            1,
            1,
            1,
            1,
            1,
            1
          ],
          [
            1,
            0,
            1,
            1,
            1,
            1
          ],
          [
            1,
            1,
            0,
            1,
            1,
            1
          ],
          [
            1,
            1,
            0,
            0,
            0,
            1
          ],
          [
            1,
            1,
            1,
            1,
            1,
            1
          ]
        ]
      },
      "artag_direction": [
        1,
        0
      ]
    }
  ],
  "robot": {
    "id": 0,
    "x": 2.5,
    "y": 6.5,
    "dir": [
      1,
      0
    ]
  }
}