{
  "boxes": [
    {
      "id": 138,
      "x0": 1.5,
      "y0": 2.5,
      "x1": 2.5,
      "y1": 3.5,
      "color": "#ff0000",
      "artag": null,
      "artag_direction": null,
      "x_center_local": 5.5,
      "y_center_local": 2.5
    },
    {
      "id": 140,
      "x0": 6.5,
      "y0": 6.0,
      "x1": 7.5,
      "y1": 7.0,
      "color": "#00ff00",
      "artag": null,
      "artag_direction": null,
      "x_center_local": 0.5,
      "y_center_local": 6.0
    },
    {
      "id": 143,
      "x0": 4.0,
      "y0": 0.0,
      "x1": 5.0,
      "y1": 1.0,
      "color": "#0000ff",
      "artag": null,
      "artag_direction": null,
      "x_center_local": 3.0,
      "y_center_local": 0.0
    },
    {
      "id": 146,
      "x0": 3.0,
      "y0": 2.0,
      "x1": 4.0,
      "y1": 3.0,
      "color": "#ffff00",
      "artag": {
        "id": 13,
        "x": 4,
        "y": 4,
        "x_field": 3.5,
        "y_field": 4.5,
        "artag": [
          [
            1,
            1,
            1,
            1,
            1,
            1
          ],
          [
            1,
            1,
            0,
            0,
            1,
            1
          ],
          [
            1,
            0,
            1,
            0,
            1,
            1
          ],
          [
            1,
            0,
            1,
            0,
            1,
            1
          ],
          [
            1,
            1,
            0,
            0,
            0,
            1
          ],
          [
            1,
            1,
            1,
            1,
            1,
            1
          ]
        ],
        "flip": false
      },
      "artag_direction": [
        0,
        1
      ],
      "x_center_local": 4.0,
      "y_center_local": 2.0
    }
  ],
  "robot": {
    "id": 4,
    "x": 4.5,
    "y": 2.5,
    "dir": [
      -1,
      0
    ],
    "x_local": 3.0,
    "y_local": 2.0
  },
  "closest_box": {
    "id": 143,
    "x0": 4.0,
    "y0": 0.0,
    "x1": 5.0,
    "y1": 1.0,
    "color": "#0000ff",
    "artag": null,
    "artag_direction": null,
    "x_center_local": 3.0,
    "y_center_local": 0.0
  }
}