{
  "boxes": [
    {
      "id": 30,
      "x0": 4.0,
      "y0": 2.5,
      "x1": 5.0,
      "y1": 3.5,
      "color": "#ff0000",
      "artag": null,
      "artag_direction": null,
      "x_center_local": 4.5,
      "y_center_local": 3.0
    },
    {
      "id": 33,
      "x0": 5.0,
      "y0": 6.5,
      "x1": 6.0,
      "y1": 7.5,
      "color": "#00ff00",
      "artag": null,
      "artag_direction": null,
      "x_center_local": 0.5,
      "y_center_local": 2.0
    },
    {
      "id": 36,
      "x0": 6.0,
      "y0": 4.5,
      "x1": 7.0,
      "y1": 5.5,
      "color": "#0000ff",
      "artag": null,
      "artag_direction": null,
      "x_center_local": 2.5,
      "y_center_local": 1.0
    },
    {
      "id": 43,
      "x0": 5.5,
      "y0": 3.0,
      "x1": 6.5,
      "y1": 4.0,
      "color": "#ffff00",
      "artag": {
        "id": 3,
        "x": 4,
        "y": 7,
        "x_field": 0.5,
        "y_field": 3.5,
        "artag": [
          [
            1,
            1,
            1,
            1,
            1,
            1
          ],
          [
            1,
            1,
            0,
            1,
            1,
            1
          ],
          [
            1,
            0,
            0,
            0,
            1,
            1
          ],
          [
            1,
            1,
            0,
            1,
            1,
            1
          ],
          [
            1,
            1,
            0,
            0,
            0,
            1
          ],
          [
            1,
            1,
            1,
            1,
            1,
            1
          ]
        ],
        "flip": false
      },
      "artag_direction": [
        0,
        1
      ],
      "x_center_local": 4.0,
      "y_center_local": 1.5
    }
  ],
  "robot": {
    "id": 2,
    "x": 7.5,
    "y": 7.5,
    "dir": [
      0,
      1
    ],
    "x_local": 0.0,
    "y_local": 0.0
  },
  "closest_box": {
    "id": 33,
    "x0": 5.0,
    "y0": 6.5,
    "x1": 6.0,
    "y1": 7.5,
    "color": "#00ff00",
    "artag": null,
    "artag_direction": null,
    "x_center_local": 0.5,
    "y_center_local": 2.0
  }
}