{
  "boxes": [
    {
      "id": 1412,
      "x0": 2.0,
      "y0": 6.5,
      "x1": 3.0,
      "y1": 7.5,
      "color": "#ff0000",
      "artag": null,
      "artag_direction": null,
      "x_center_local": 0.5,
      "y_center_local": 5.0
    },
    {
      "id": 1414,
      "x0": 6.0,
      "y0": 0.0,
      "x1": 7.0,
      "y1": 1.0,
      "color": "#00ff00",
      "artag": null,
      "artag_direction": null,
      "x_center_local": 7.0,
      "y_center_local": 1.0
    },
    {
      "id": 1416,
      "x0": 6.0,
      "y0": 6.0,
      "x1": 7.0,
      "y1": 7.0,
      "color": "#0000ff",
      "artag": null,
      "artag_direction": null,
      "x_center_local": 1.0,
      "y_center_local": 1.0
    },
    {
      "id": 1421,
      "x0": 3.0,
      "y0": 5.5,
      "x1": 4.0,
      "y1": 6.5,
      "color": "#ffff00",
      "artag": {
        "id": 144,
        "x": 4,
        "y": 6,
        "x_field": 1.5,
        "y_field": 3.5,
        "artag": [
          [
            1,
            1,
            1,
            1,
            1,
            1
          ],
          [
            1,
            1,
            1,
            0,
            1,
            1
          ],
          [
            1,
            0,
            1,
            0,
            1,
            1
          ],
          [
            1,
            0,
            0,
            1,
            1,
            1
          ],
          [
            1,
            1,
            0,
            0,
            0,
            1
          ],
          [
            1,
            1,
            1,
            1,
            1,
            1
          ]
        ],
        "flip": false
      },
      "artag_direction": [
        0,
        -1
      ],
      "x_center_local": 1.5,
      "y_center_local": 4.0
    }
  ],
  "robot": {
    "id": 96,
    "x": 7.5,
    "y": 7.5,
    "dir": [
      1,
      0
    ],
    "x_local": 0.0,
    "y_local": 0.0
  },
  "closest_box": {
    "id": 1414,
    "x0": 6.0,
    "y0": 0.0,
    "x1": 7.0,
    "y1": 1.0,
    "color": "#00ff00",
    "artag": null,
    "artag_direction": null,
    "x_center_local": 7.0,
    "y_center_local": 1.0
  }
}