{
  "boxes": [
    {
      "id": 2587,
      "x0": 4.0,
      "y0": 3.5,
      "x1": 5.0,
      "y1": 4.5,
      "color": "#ff0000",
      "artag": null,
      "artag_direction": null,
      "x_center_local": 3.0,
      "y_center_local": 3.5
    },
    {
      "id": 2589,
      "x0": 4.0,
      "y0": 5.5,
      "x1": 5.0,
      "y1": 6.5,
      "color": "#00ff00",
      "artag": null,
      "artag_direction": null,
      "x_center_local": 3.0,
      "y_center_local": 5.5
    },
    {
      "id": 2591,
      "x0": 6.5,
      "y0": 6.0,
      "x1": 7.5,
      "y1": 7.0,
      "color": "#0000ff",
      "artag": null,
      "artag_direction": null,
      "x_center_local": 0.5,
      "y_center_local": 6.0
    },
    {
      "id": 2594,
      "x0": 1.0,
      "y0": 2.0,
      "x1": 2.0,
      "y1": 3.0,
      "color": "#ffff00",
      "artag": {
        "id": 268,
        "x": 2,
        "y": 7,
        "x_field": 5.5,
        "y_field": 7.5,
        "artag": [
          [
            1,
            1,
            1,
            1,
            1,
            1
          ],
          [
            1,
            1,
            1,
            0,
            1,
            1
          ],
          [
            1,
            0,
            0,
            1,
            0,
            1
          ],
          [
            1,
            1,
            0,
            1,
            1,
            1
          ],
          [
            1,
            1,
            0,
            0,
            0,
            1
          ],
          [
            1,
            1,
            1,
            1,
            1,
            1
          ]
        ],
        "flip": false
      },
      "artag_direction": [
        -1,
        0
      ],
      "x_center_local": 6.0,
      "y_center_local": 2.0
    }
  ],
  "robot": {
    "id": 89,
    "x": 1.5,
    "y": 1.5,
    "dir": [
      0,
      1
    ],
    "x_local": 6.0,
    "y_local": 1.0
  },
  "closest_box": {
    "id": 2591,
    "x0": 6.5,
    "y0": 6.0,
    "x1": 7.5,
    "y1": 7.0,
    "color": "#0000ff",
    "artag": null,
    "artag_direction": null,
    "x_center_local": 0.5,
    "y_center_local": 6.0
  }
}