{
  "boxes": [
    {
      "id": 322,
      "x0": 5.5,
      "y0": 3.5,
      "x1": 6.5,
      "y1": 4.5,
      "color": "#ff0000",
      "artag": null,
      "artag_direction": null,
      "x_center_local": 1.5,
      "y_center_local": 3.5
    },
    {
      "id": 324,
      "x0": 3.5,
      "y0": 2.0,
      "x1": 4.5,
      "y1": 3.0,
      "color": "#00ff00",
      "artag": null,
      "artag_direction": null,
      "x_center_local": 3.5,
      "y_center_local": 2.0
    },
    {
      "id": 326,
      "x0": 0.5,
      "y0": 6.5,
      "x1": 1.5,
      "y1": 7.5,
      "color": "#0000ff",
      "artag": null,
      "artag_direction": null,
      "x_center_local": 6.5,
      "y_center_local": 6.5
    },
    {
      "id": 330,
      "x0": 5.0,
      "y0": 1.0,
      "x1": 6.0,
      "y1": 2.0,
      "color": "#ffff00",
      "artag": {
        "id": 32,
        "x": 2,
        "y": 6,
        "x_field": 5.5,
        "y_field": 6.5,
        "artag": [
          [
            1,
            1,
            1,
            1,
            1,
            1
          ],
          [
            1,
            1,
            0,
            1,
            1,
            1
          ],
          [
            1,
            0,
            1,
            1,
            0,
            1
          ],
          [
            1,
            0,
            0,
            1,
            1,
            1
          ],
          [
            1,
            1,
            0,
            0,
            0,
            1
          ],
          [
            1,
            1,
            1,
            1,
            1,
            1
          ]
        ],
        "flip": false
      },
      "artag_direction": [
        0,
        -1
      ],
      "x_center_local": 2.0,
      "y_center_local": 1.0
    }
  ],
  "robot": {
    "id": 21,
    "x": 7.5,
    "y": 7.5,
    "dir": [
      0,
      -1
    ],
    "x_local": 0.0,
    "y_local": 7.0
  },
  "closest_box": {
    "id": 326,
    "x0": 0.5,
    "y0": 6.5,
    "x1": 1.5,
    "y1": 7.5,
    "color": "#0000ff",
    "artag": null,
    "artag_direction": null,
    "x_center_local": 6.5,
    "y_center_local": 6.5
  }
}