{
  "boxes": [
    {
      "id": 1937,
      "x0": 6.5,
      "y0": 0.5,
      "x1": 7.5,
      "y1": 1.5,
      "color": "#ff0000",
      "artag": null,
      "artag_direction": null,
      "x_center_local": 0.5,
      "y_center_local": 6.5
    },
    {
      "id": 1939,
      "x0": 1.5,
      "y0": 5.5,
      "x1": 2.5,
      "y1": 6.5,
      "color": "#00ff00",
      "artag": null,
      "artag_direction": null,
      "x_center_local": 5.5,
      "y_center_local": 1.5
    },
    {
      "id": 1941,
      "x0": 3.0,
      "y0": 2.0,
      "x1": 4.0,
      "y1": 3.0,
      "color": "#0000ff",
      "artag": null,
      "artag_direction": null,
      "x_center_local": 2.0,
      "y_center_local": 3.0
    },
    {
      "id": 1945,
      "x0": 6.0,
      "y0": 2.5,
      "x1": 7.0,
      "y1": 3.5,
      "color": "#ffff00",
      "artag": {
        "id": 200,
        "x": 0,
        "y": 4,
        "x_field": 4.5,
        "y_field": 0.5,
        "artag": [
          [
            1,
            1,
            1,
            1,
            1,
            1
          ],
          [
            1,
            1,
            0,
            1,
            1,
            1
          ],
          [
            1,
            0,
            0,
            0,
            0,
            1
          ],
          [
            1,
            0,
            1,
            0,
            1,
            1
          ],
          [
            1,
            1,
            0,
            0,
            0,
            1
          ],
          [
            1,
            1,
            1,
            1,
            1,
            1
          ]
        ],
        "flip": false
      },
      "artag_direction": [
        0,
        -1
      ],
      "x_center_local": 2.5,
      "y_center_local": 6.0
    }
  ],
  "robot": {
    "id": 133,
    "x": 7.5,
    "y": 7.5,
    "dir": [
      1,
      0
    ],
    "x_local": 7.0,
    "y_local": 7.0
  },
  "closest_box": {
    "id": 1937,
    "x0": 6.5,
    "y0": 0.5,
    "x1": 7.5,
    "y1": 1.5,
    "color": "#ff0000",
    "artag": null,
    "artag_direction": null,
    "x_center_local": 0.5,
    "y_center_local": 6.5
  }
}