{
  "boxes": [
    {
      "id": 704,
      "x0": 4.0,
      "y0": 6.5,
      "x1": 5.0,
      "y1": 7.5,
      "color": "#ff0000",
      "artag": null,
      "artag_direction": null,
      "x_center_local": 6.5,
      "y_center_local": 4.0
    },
    {
      "id": 707,
      "x0": 2.0,
      "y0": 1.5,
      "x1": 3.0,
      "y1": 2.5,
      "color": "#00ff00",
      "artag": null,
      "artag_direction": null,
      "x_center_local": 1.5,
      "y_center_local": 2.0
    },
    {
      "id": 710,
      "x0": 6.0,
      "y0": 4.5,
      "x1": 7.0,
      "y1": 5.5,
      "color": "#0000ff",
      "artag": null,
      "artag_direction": null,
      "x_center_local": 4.5,
      "y_center_local": 6.0
    },
    {
      "id": 713,
      "x0": 3.0,
      "y0": 4.5,
      "x1": 4.0,
      "y1": 5.5,
      "color": "#ffff00",
      "artag": {
        "id": 71,
        "x": 6,
        "y": 0,
        "x_field": 0.5,
        "y_field": 6.5,
        "artag": [
          [
            1,
            1,
            1,
            1,
            1,
            1
          ],
          [
            1,
            1,
            1,
            1,
            1,
            1
          ],
          [
            1,
            0,
            0,
            1,
            1,
            1
          ],
          [
            1,
            0,
            0,
            0,
            0,
            1
          ],
          [
            1,
            1,
            0,
            0,
            0,
            1
          ],
          [
            1,
            1,
            1,
            1,
            1,
            1
          ]
        ],
        "flip": false
      },
      "artag_direction": [
        0,
        1
      ],
      "x_center_local": 4.5,
      "y_center_local": 3.0
    }
  ],
  "robot": {
    "id": 47,
    "x": 7.5,
    "y": 7.5,
    "dir": [
      -1,
      0
    ],
    "x_local": 7.0,
    "y_local": 7.0
  },
  "closest_box": {
    "id": 704,
    "x0": 4.0,
    "y0": 6.5,
    "x1": 5.0,
    "y1": 7.5,
    "color": "#ff0000",
    "artag": null,
    "artag_direction": null,
    "x_center_local": 6.5,
    "y_center_local": 4.0
  }
}