{
  "boxes": [
    {
      "id": 1226,
      "x0": 0.0,
      "y0": 2.0,
      "x1": 1.0,
      "y1": 3.0,
      "color": "#ff0000",
      "artag": null,
      "artag_direction": null,
      "x_center_local": 2.0,
      "y_center_local": 0.0
    },
    {
      "id": 1228,
      "x0": 3.5,
      "y0": 6.5,
      "x1": 4.5,
      "y1": 7.5,
      "color": "#00ff00",
      "artag": null,
      "artag_direction": null,
      "x_center_local": 6.5,
      "y_center_local": 3.5
    },
    {
      "id": 1231,
      "x0": 4.5,
      "y0": 3.0,
      "x1": 5.5,
      "y1": 4.0,
      "color": "#0000ff",
      "artag": null,
      "artag_direction": null,
      "x_center_local": 3.0,
      "y_center_local": 4.5
    },
    {
      "id": 1233,
      "x0": 3.0,
      "y0": 4.0,
      "x1": 4.0,
      "y1": 5.0,
      "color": "#ffff00",
      "artag": {
        "id": 125,
        "x": 1,
        "y": 1,
        "x_field": 1.5,
        "y_field": 1.5,
        "artag": [
          [
            1,
            1,
            1,
            1,
            1,
            1
          ],
          [
            1,
            1,
            0,
            0,
            1,
            1
          ],
          [
            1,
            1,
            1,
            0,
            0,
            1
          ],
          [
            1,
            1,
            0,
            0,
            0,
            1
          ],
          [
            1,
            1,
            0,
            0,
            0,
            1
          ],
          [
            1,
            1,
            1,
            1,
            1,
            1
          ]
        ],
        "flip": false
      },
      "artag_direction": [
        0,
        1
      ],
      "x_center_local": 4.0,
      "y_center_local": 3.0
    }
  ],
  "robot": {
    "id": 83,
    "x": 7.5,
    "y": 7.5,
    "dir": [
      0,
      1
    ],
    "x_local": 7.0,
    "y_local": 7.0
  },
  "closest_box": {
    "id": 1226,
    "x0": 0.0,
    "y0": 2.0,
    "x1": 1.0,
    "y1": 3.0,
    "color": "#ff0000",
    "artag": null,
    "artag_direction": null,
    "x_center_local": 2.0,
    "y_center_local": 0.0
  }
}