{
  "boxes": [
    {
      "id": 125,
      "x0": 5.0,
      "y0": 1.5,
      "x1": 6.0,
      "y1": 2.5,
      "color": "#ff0000",
      "artag": null,
      "artag_direction": null,
      "x_center_local": 2.0,
      "y_center_local": 1.5
    },
    {
      "id": 127,
      "x0": 2.0,
      "y0": 2.5,
      "x1": 3.0,
      "y1": 3.5,
      "color": "#00ff00",
      "artag": null,
      "artag_direction": null,
      "x_center_local": 5.0,
      "y_center_local": 2.5
    },
    {
      "id": 129,
      "x0": 1.5,
      "y0": 6.5,
      "x1": 2.5,
      "y1": 7.5,
      "color": "#0000ff",
      "artag": null,
      "artag_direction": null,
      "x_center_local": 5.5,
      "y_center_local": 6.5
    },
    {
      "id": 136,
      "x0": 3.5,
      "y0": 6.0,
      "x1": 4.5,
      "y1": 7.0,
      "color": "#ffff00",
      "artag": {
        "id": 12,
        "x": 0,
        "y": 1,
        "x_field": 7.5,
        "y_field": 1.5,
        "artag": [
          [
            1,
            1,
            1,
            1,
            1,
            1
          ],
          [
            1,
            1,
            1,
            1,
            1,
            1
          ],
          [
            1,
            0,
            1,
            0,
            0,
            1
          ],
          [
            1,
            1,
            0,
            0,
            0,
            1
          ],
          [
            1,
            1,
            0,
            0,
            0,
            1
          ],
          [
            1,
            1,
            1,
            1,
            1,
            1
          ]
        ],
        "flip": false
      },
      "artag_direction": [
        1,
        0
      ],
      "x_center_local": 3.5,
      "y_center_local": 6.0
    }
  ],
  "robot": {
    "id": 8,
    "x": 7.5,
    "y": 7.5,
    "dir": [
      -1,
      0
    ],
    "x_local": 0.0,
    "y_local": 7.0
  },
  "closest_box": {
    "id": 129,
    "x0": 1.5,
    "y0": 6.5,
    "x1": 2.5,
    "y1": 7.5,
    "color": "#0000ff",
    "artag": null,
    "artag_direction": null,
    "x_center_local": 5.5,
    "y_center_local": 6.5
  }
}