Change Component Designator: OldDesignator=C? NewDesignator=C6
Change Component Designator: OldDesignator=C? NewDesignator=C7
Change Component Designator: OldDesignator=C? NewDesignator=C8
Change Component Designator: OldDesignator=Q? NewDesignator=Q6
Change Component Designator: OldDesignator=U? NewDesignator=U3
Change Net Name : Old Net Name=NetC?_2 New Net Name=NetC8_2
Added Member To Class: ClassName=DCDC 5V Member=Component C7 2.2u
Added Member To Class: ClassName=DCDC 5V Member=Component C8 10n
