Change Component Description : Designator=nFB1 Old Description=WE-CBA SMD EMI Suppression Ferrite Bead, 0402, 100O 782422101 New Description=WE-CBA SMD EMI Suppression Ferrite Bead, 0402, 100O 782422101
Change Component Description : Designator=nFB2 Old Description=WE-CBA SMD EMI Suppression Ferrite Bead, 0402, 100O 782422101 New Description=WE-CBA SMD EMI Suppression Ferrite Bead, 0402, 100O 782422101
Change Component Description : Designator=nFB3 Old Description=WE-CBA SMD EMI Suppression Ferrite Bead, 0402, 100O 782422101 New Description=WE-CBA SMD EMI Suppression Ferrite Bead, 0402, 100O 782422101
Change Component Description : Designator=nFB4 Old Description=WE-CBA SMD EMI Suppression Ferrite Bead, 0402, 100O 782422101 New Description=WE-CBA SMD EMI Suppression Ferrite Bead, 0402, 100O 782422101
Added Component: Designator=D2(0603 [1608] (high density))
Add component. Clean all parameters for all variants
Add component (AddParameter): Name = "Datasheet"; Value = "http://www.bourns.com/docs/product-datasheets/cga-mlc.pdf?sfvrsn=ad9ef60f_66"; VariantName = "[No Variations]"
Add component (AddParameter): Name = "Manufacturer"; Value = "Bourns"; VariantName = "[No Variations]"
Add component (AddParameter): Name = "Manufacturer URL"; Value = "www.bourns.com"; VariantName = "[No Variations]"
Add component (AddParameter): Name = "Part Number"; Value = "CGA0603MLC-05E"; VariantName = "[No Variations]"
Add component (AddParameter): Name = "Technology"; Value = "SMT"; VariantName = "[No Variations]"
Add component (AddParameter): Name = "Value"; Value = "5V"; VariantName = "[No Variations]"
Added Component: Designator=D3(0603 [1608] (high density))
Add component. Clean all parameters for all variants
Add component (AddParameter): Name = "Datasheet"; Value = "http://www.bourns.com/docs/product-datasheets/cga-mlc.pdf?sfvrsn=ad9ef60f_66"; VariantName = "[No Variations]"
Add component (AddParameter): Name = "Manufacturer"; Value = "Bourns"; VariantName = "[No Variations]"
Add component (AddParameter): Name = "Manufacturer URL"; Value = "www.bourns.com"; VariantName = "[No Variations]"
Add component (AddParameter): Name = "Part Number"; Value = "CGA0603MLC-05E"; VariantName = "[No Variations]"
Add component (AddParameter): Name = "Technology"; Value = "SMT"; VariantName = "[No Variations]"
Add component (AddParameter): Name = "Value"; Value = "5V"; VariantName = "[No Variations]"
Added Component: Designator=D4(0603 [1608] (high density))
Add component. Clean all parameters for all variants
Add component (AddParameter): Name = "Datasheet"; Value = "http://www.bourns.com/docs/product-datasheets/cga-mlc.pdf?sfvrsn=ad9ef60f_66"; VariantName = "[No Variations]"
Add component (AddParameter): Name = "Manufacturer"; Value = "Bourns"; VariantName = "[No Variations]"
Add component (AddParameter): Name = "Manufacturer URL"; Value = "www.bourns.com"; VariantName = "[No Variations]"
Add component (AddParameter): Name = "Part Number"; Value = "CGA0603MLC-05E"; VariantName = "[No Variations]"
Add component (AddParameter): Name = "Technology"; Value = "SMT"; VariantName = "[No Variations]"
Add component (AddParameter): Name = "Value"; Value = "5V"; VariantName = "[No Variations]"
Added Component: Designator=D5(0603 [1608] (high density))
Add component. Clean all parameters for all variants
Add component (AddParameter): Name = "Datasheet"; Value = "http://www.bourns.com/docs/product-datasheets/cga-mlc.pdf?sfvrsn=ad9ef60f_66"; VariantName = "[No Variations]"
Add component (AddParameter): Name = "Manufacturer"; Value = "Bourns"; VariantName = "[No Variations]"
Add component (AddParameter): Name = "Manufacturer URL"; Value = "www.bourns.com"; VariantName = "[No Variations]"
Add component (AddParameter): Name = "Part Number"; Value = "CGA0603MLC-05E"; VariantName = "[No Variations]"
Add component (AddParameter): Name = "Technology"; Value = "SMT"; VariantName = "[No Variations]"
Add component (AddParameter): Name = "Value"; Value = "5V"; VariantName = "[No Variations]"
Added Component: Designator=D6(0603 [1608] (high density))
Add component. Clean all parameters for all variants
Add component (AddParameter): Name = "Datasheet"; Value = "http://www.bourns.com/docs/product-datasheets/cga-mlc.pdf?sfvrsn=ad9ef60f_66"; VariantName = "[No Variations]"
Add component (AddParameter): Name = "Manufacturer"; Value = "Bourns"; VariantName = "[No Variations]"
Add component (AddParameter): Name = "Manufacturer URL"; Value = "www.bourns.com"; VariantName = "[No Variations]"
Add component (AddParameter): Name = "Part Number"; Value = "CGA0603MLC-05E"; VariantName = "[No Variations]"
Add component (AddParameter): Name = "Technology"; Value = "SMT"; VariantName = "[No Variations]"
Add component (AddParameter): Name = "Value"; Value = "5V"; VariantName = "[No Variations]"
Added Component: Designator=D7(0603 [1608] (high density))
Add component. Clean all parameters for all variants
Add component (AddParameter): Name = "Datasheet"; Value = "http://www.bourns.com/docs/product-datasheets/cga-mlc.pdf?sfvrsn=ad9ef60f_66"; VariantName = "[No Variations]"
Add component (AddParameter): Name = "Manufacturer"; Value = "Bourns"; VariantName = "[No Variations]"
Add component (AddParameter): Name = "Manufacturer URL"; Value = "www.bourns.com"; VariantName = "[No Variations]"
Add component (AddParameter): Name = "Part Number"; Value = "CGA0603MLC-05E"; VariantName = "[No Variations]"
Add component (AddParameter): Name = "Technology"; Value = "SMT"; VariantName = "[No Variations]"
Add component (AddParameter): Name = "Value"; Value = "5V"; VariantName = "[No Variations]"
Added Pin To Net: NetName=RX Pin=D2-1
Added Pin To Net: NetName=GND Pin=D3-2
Added Pin To Net: NetName=GND Pin=D4-2
Added Pin To Net: NetName=R_LED Pin=D5-1
Added Pin To Net: NetName=G_LED Pin=D6-1
Added Pin To Net: NetName=GND Pin=D6-2
Added Pin To Net: NetName=B_LED Pin=D7-1
Added Pin To Net: NetName=GND Pin=D7-2
Added Pin To Net: NetName=On Pin=D3-1
Added Net: Name=On
Added Pin To Net: NetName=TX Pin=D4-1
Added Net: Name=TX
Added Member To Class: ClassName=top_level Member=Component D2 CGA0603MLC-05E
Added Member To Class: ClassName=top_level Member=Component D3 CGA0603MLC-05E
Added Member To Class: ClassName=top_level Member=Component D4 CGA0603MLC-05E
Added Member To Class: ClassName=LPC1768 Member=Component D5 CGA0603MLC-05E
Added Member To Class: ClassName=LPC1768 Member=Component D6 CGA0603MLC-05E
Added Member To Class: ClassName=LPC1768 Member=Component D7 CGA0603MLC-05E
