Change Physical Footprint: Designator=bC1 Old Footprint=FP-C0603C-CF-MFG New Footprint=FP-C0603C-CF-MFG
Change Physical Footprint: Designator=bC5 Old Footprint=CAPC1210(3225)210_L New Footprint=CAPC1210(3225)210_L
Change Physical Footprint: Designator=bC6 Old Footprint=CAPC1210(3225)210_L New Footprint=CAPC1210(3225)210_L
Change Physical Footprint: Designator=bH Old Footprint=WE-LED0603 New Footprint=WE-LED0603
Change Physical Footprint: Designator=C1 Old Footprint=0603_1.6x0.8x0.8mm_Reflow Soldering New Footprint=0603_1.6x0.8x0.8mm_Reflow Soldering
Change Physical Footprint: Designator=C2 Old Footprint=0603_1.6x0.8x0.8mm_Reflow Soldering New Footprint=0603_1.6x0.8x0.8mm_Reflow Soldering
Change Physical Footprint: Designator=C4 Old Footprint=0603_1.6x0.8x0.8mm_Reflow Soldering New Footprint=0603_1.6x0.8x0.8mm_Reflow Soldering
Change Physical Footprint: Designator=C5 Old Footprint=CAPC1608X90X35LL10T15 New Footprint=CAPC1608X90X35LL10T15
Change Physical Footprint: Designator=C6 Old Footprint=CAPC1608X90X35LL10T15 New Footprint=CAPC1608X90X35LL10T15
Change Physical Footprint: Designator=C8 Old Footprint=CAPC1608X90X35ML10T15 New Footprint=CAPC1608X90X35ML10T15
Change Physical Footprint: Designator=C9 Old Footprint=CAPC3225X200N New Footprint=CAPC3225X200N
Change Physical Footprint: Designator=C10 Old Footprint=CAPC2013X145X20ML20 New Footprint=CAPC2013X145X20ML20
Change Physical Footprint: Designator=C11 Old Footprint=CAPC1210(3225)280_N New Footprint=CAPC1210(3225)280_N
Change Physical Footprint: Designator=C12 Old Footprint=CAPPR65-500-1600X1000X1700 New Footprint=CAPPR65-500-1600X1000X1700
Change Physical Footprint: Designator=C13 Old Footprint=CAPC1210(3225)280_N New Footprint=CAPC1210(3225)280_N
Change Physical Footprint: Designator=C14 Old Footprint=CAPC1206(3216)190_N New Footprint=CAPC1206(3216)190_N
Change Physical Footprint: Designator=C15 Old Footprint=CAPC3225X200N New Footprint=CAPC3225X200N
Change Physical Footprint: Designator=C16 Old Footprint=0603_1.6x0.8x0.8mm_Reflow Soldering New Footprint=0603_1.6x0.8x0.8mm_Reflow Soldering
Change Physical Footprint: Designator=C17 Old Footprint=0603_1.6x0.8x0.8mm_Reflow Soldering New Footprint=0603_1.6x0.8x0.8mm_Reflow Soldering
Change Physical Footprint: Designator=C18 Old Footprint=0603_1.6x0.8x0.8mm_Reflow Soldering New Footprint=0603_1.6x0.8x0.8mm_Reflow Soldering
Change Physical Footprint: Designator=C19 Old Footprint=0603_1.6x0.8x0.8mm_Reflow Soldering New Footprint=0603_1.6x0.8x0.8mm_Reflow Soldering
Change Physical Footprint: Designator=C20 Old Footprint=0603_1.6x0.8x0.8mm_Reflow Soldering New Footprint=0603_1.6x0.8x0.8mm_Reflow Soldering
Change Physical Footprint: Designator=C21 Old Footprint=0603_1.6x0.8x0.8mm_Reflow Soldering New Footprint=0603_1.6x0.8x0.8mm_Reflow Soldering
Change Physical Footprint: Designator=C22 Old Footprint=0603_1.6x0.8x0.8mm_Reflow Soldering New Footprint=0603_1.6x0.8x0.8mm_Reflow Soldering
Change Physical Footprint: Designator=C23 Old Footprint=0603_1.6x0.8x0.8mm_Reflow Soldering New Footprint=0603_1.6x0.8x0.8mm_Reflow Soldering
Change Physical Footprint: Designator=C24 Old Footprint=0603_1.6x0.8x0.8mm_Reflow Soldering New Footprint=0603_1.6x0.8x0.8mm_Reflow Soldering
Change Physical Footprint: Designator=C28 Old Footprint=0603_1.6x0.8x0.8mm_Reflow Soldering New Footprint=0603_1.6x0.8x0.8mm_Reflow Soldering
Change Physical Footprint: Designator=C29 Old Footprint=0603_1.6x0.8x0.8mm_Reflow Soldering New Footprint=0603_1.6x0.8x0.8mm_Reflow Soldering
Change Physical Footprint: Designator=C30 Old Footprint=0603_1.6x0.8x0.8mm_Reflow Soldering New Footprint=0603_1.6x0.8x0.8mm_Reflow Soldering
Change Physical Footprint: Designator=C31 Old Footprint=0603_1.6x0.8x0.8mm_Reflow Soldering New Footprint=0603_1.6x0.8x0.8mm_Reflow Soldering
Change Physical Footprint: Designator=C32 Old Footprint=0603_1.6x0.8x0.8mm_Reflow Soldering New Footprint=0603_1.6x0.8x0.8mm_Reflow Soldering
Change Physical Footprint: Designator=C33 Old Footprint=0603_1.6x0.8x0.8mm_Reflow Soldering New Footprint=0603_1.6x0.8x0.8mm_Reflow Soldering
Change Physical Footprint: Designator=C34 Old Footprint=0603_1.6x0.8x0.8mm_Reflow Soldering New Footprint=0603_1.6x0.8x0.8mm_Reflow Soldering
Change Physical Footprint: Designator=C35 Old Footprint=0603_1.6x0.8x0.8mm_Reflow Soldering New Footprint=0603_1.6x0.8x0.8mm_Reflow Soldering
Change Physical Footprint: Designator=C36 Old Footprint=0603_1.6x0.8x0.8mm_Reflow Soldering New Footprint=0603_1.6x0.8x0.8mm_Reflow Soldering
Change Physical Footprint: Designator=C37 Old Footprint=0603_1.6x0.8x0.8mm_Reflow Soldering New Footprint=0603_1.6x0.8x0.8mm_Reflow Soldering
Change Physical Footprint: Designator=C38 Old Footprint=0603_1.6x0.8x0.8mm_Reflow Soldering New Footprint=0603_1.6x0.8x0.8mm_Reflow Soldering
Change Physical Footprint: Designator=C39 Old Footprint=0603_1.6x0.8x0.8mm_Reflow Soldering New Footprint=0603_1.6x0.8x0.8mm_Reflow Soldering
Change Physical Footprint: Designator=C40 Old Footprint=0603_1.6x0.8x0.8mm_Reflow Soldering New Footprint=0603_1.6x0.8x0.8mm_Reflow Soldering
Change Physical Footprint: Designator=C41 Old Footprint=0603_1.6x0.8x0.8mm_Reflow Soldering New Footprint=0603_1.6x0.8x0.8mm_Reflow Soldering
Change Physical Footprint: Designator=C44 Old Footprint=0603_1.6x0.8x0.8mm_Reflow Soldering New Footprint=0603_1.6x0.8x0.8mm_Reflow Soldering
Change Physical Footprint: Designator=C45 Old Footprint=FP-CGA3E-0_3-0_1-IPC_A New Footprint=FP-CGA3E-0_3-0_1-IPC_A
Change Physical Footprint: Designator=C48 Old Footprint=0603_1.6x0.8x0.8mm_Reflow Soldering New Footprint=0603_1.6x0.8x0.8mm_Reflow Soldering
Change Physical Footprint: Designator=C49 Old Footprint=0603_1.6x0.8x0.8mm_Reflow Soldering New Footprint=0603_1.6x0.8x0.8mm_Reflow Soldering
Change Physical Footprint: Designator=C50 Old Footprint=FP-CGA3E-0_3-0_1-IPC_A New Footprint=FP-CGA3E-0_3-0_1-IPC_A
Change Physical Footprint: Designator=C51 Old Footprint=FP-CGA3E-0_3-0_1-IPC_A New Footprint=FP-CGA3E-0_3-0_1-IPC_A
Change Physical Footprint: Designator=C52 Old Footprint=0603_1.6x0.8x0.8mm_Reflow Soldering New Footprint=0603_1.6x0.8x0.8mm_Reflow Soldering
Change Physical Footprint: Designator=C58 Old Footprint=0603_1.6x0.8x0.8mm_Reflow Soldering New Footprint=0603_1.6x0.8x0.8mm_Reflow Soldering
Change Physical Footprint: Designator=C59 Old Footprint=0603_1.6x0.8x0.8mm_Reflow Soldering New Footprint=0603_1.6x0.8x0.8mm_Reflow Soldering
Change Physical Footprint: Designator=D2 Old Footprint=0603 [1608] (high density) New Footprint=0603 [1608] (high density)
Change Physical Footprint: Designator=D3 Old Footprint=0603 [1608] (high density) New Footprint=0603 [1608] (high density)
Change Physical Footprint: Designator=D4 Old Footprint=0603 [1608] (high density) New Footprint=0603 [1608] (high density)
Change Physical Footprint: Designator=D5 Old Footprint=0603 [1608] (high density) New Footprint=0603 [1608] (high density)
Change Physical Footprint: Designator=D6 Old Footprint=0603 [1608] (high density) New Footprint=0603 [1608] (high density)
Change Physical Footprint: Designator=D7 Old Footprint=0603 [1608] (high density) New Footprint=0603 [1608] (high density)
Change Physical Footprint: Designator=E1C3 Old Footprint=1812_4.5x3.2x1.25mm New Footprint=1812_4.5x3.2x1.25mm
Change Physical Footprint: Designator=E1C42 Old Footprint=0603_1.6x0.8x0.8mm_Reflow Soldering New Footprint=0603_1.6x0.8x0.8mm_Reflow Soldering
Change Physical Footprint: Designator=E1C43 Old Footprint=0603_1.6x0.8x0.8mm_Reflow Soldering New Footprint=0603_1.6x0.8x0.8mm_Reflow Soldering
Change Physical Footprint: Designator=E1Ethernet_Port Old Footprint=74990112116A New Footprint=74990112116A
Change Physical Footprint: Designator=E1R33 Old Footprint=RESC1608X55X25NL10T15 New Footprint=RESC1608X55X25NL10T15
Change Physical Footprint: Designator=E1R34 Old Footprint=RESC1608X55X25NL10T15 New Footprint=RESC1608X55X25NL10T15
Change Physical Footprint: Designator=E1R35 Old Footprint=RESC1608X55X25NL10T15 New Footprint=RESC1608X55X25NL10T15
Change Physical Footprint: Designator=E1R36 Old Footprint=RESC1608X55X25NL10T15 New Footprint=RESC1608X55X25NL10T15
Change Physical Footprint: Designator=E1R37 Old Footprint=RESC1608X55X25LL10T15 New Footprint=RESC1608X55X25LL10T15
Change Physical Footprint: Designator=E1R38 Old Footprint=RESC1608X55X25LL10T15 New Footprint=RESC1608X55X25LL10T15
Change Physical Footprint: Designator=E2C3 Old Footprint=1812_4.5x3.2x1.25mm New Footprint=1812_4.5x3.2x1.25mm
Change Physical Footprint: Designator=E2C42 Old Footprint=0603_1.6x0.8x0.8mm_Reflow Soldering New Footprint=0603_1.6x0.8x0.8mm_Reflow Soldering
Change Physical Footprint: Designator=E2C43 Old Footprint=0603_1.6x0.8x0.8mm_Reflow Soldering New Footprint=0603_1.6x0.8x0.8mm_Reflow Soldering
Change Physical Footprint: Designator=E2Ethernet_Port Old Footprint=74990112116A New Footprint=74990112116A
Change Physical Footprint: Designator=E2R33 Old Footprint=RESC1608X55X25NL10T15 New Footprint=RESC1608X55X25NL10T15
Change Physical Footprint: Designator=E2R34 Old Footprint=RESC1608X55X25NL10T15 New Footprint=RESC1608X55X25NL10T15
Change Physical Footprint: Designator=E2R35 Old Footprint=RESC1608X55X25NL10T15 New Footprint=RESC1608X55X25NL10T15
Change Physical Footprint: Designator=E2R36 Old Footprint=RESC1608X55X25NL10T15 New Footprint=RESC1608X55X25NL10T15
Change Physical Footprint: Designator=E2R37 Old Footprint=RESC1608X55X25LL10T15 New Footprint=RESC1608X55X25LL10T15
Change Physical Footprint: Designator=E2R38 Old Footprint=RESC1608X55X25LL10T15 New Footprint=RESC1608X55X25LL10T15
Change Physical Footprint: Designator=F1 Old Footprint=BOUR-MF-MSMF030-2_V New Footprint=BOUR-MF-MSMF030-2_V
Change Physical Footprint: Designator=F2 Old Footprint=BOUR-MF-MSMF030-2_V New Footprint=BOUR-MF-MSMF030-2_V
Change Physical Footprint: Designator=F3 Old Footprint=BOUR-MF-MSMF030-2_V New Footprint=BOUR-MF-MSMF030-2_V
Change Physical Footprint: Designator=F4 Old Footprint=BOUR-MF-MSMF030-2_V New Footprint=BOUR-MF-MSMF030-2_V
Change Physical Footprint: Designator=F5 Old Footprint=BOUR-MF-MSMF030-2_V New Footprint=BOUR-MF-MSMF030-2_V
Change Physical Footprint: Designator=F6 Old Footprint=BOUR-MF-MSMF030-2_V New Footprint=BOUR-MF-MSMF030-2_V
Change Physical Footprint: Designator=F7 Old Footprint=BOUR-MF-MSMF030-2_V New Footprint=BOUR-MF-MSMF030-2_V
Change Physical Footprint: Designator=F8 Old Footprint=BOUR-MF-MSMF030-2_V New Footprint=BOUR-MF-MSMF030-2_V
Change Physical Footprint: Designator=h1C7 Old Footprint=0603_1.6x0.8x0.8mm_Reflow Soldering New Footprint=0603_1.6x0.8x0.8mm_Reflow Soldering
Change Physical Footprint: Designator=h1C25 Old Footprint=0603_1.6x0.8x0.8mm_Reflow Soldering New Footprint=0603_1.6x0.8x0.8mm_Reflow Soldering
Change Physical Footprint: Designator=h1C26 Old Footprint=0603_1.6x0.8x0.8mm_Reflow Soldering New Footprint=0603_1.6x0.8x0.8mm_Reflow Soldering
Change Physical Footprint: Designator=h1C27 Old Footprint=FP-C0603C-CF-MFG New Footprint=FP-C0603C-CF-MFG
Change Physical Footprint: Designator=h1C53 Old Footprint=FP-CGA3E-0_3-0_1-IPC_A New Footprint=FP-CGA3E-0_3-0_1-IPC_A
Change Physical Footprint: Designator=h1C54 Old Footprint=0603_1.6x0.8x0.8mm_Reflow Soldering New Footprint=0603_1.6x0.8x0.8mm_Reflow Soldering
Change Physical Footprint: Designator=h1C55 Old Footprint=0603_1.6x0.8x0.8mm_Reflow Soldering New Footprint=0603_1.6x0.8x0.8mm_Reflow Soldering
Change Physical Footprint: Designator=h1D1 Old Footprint=ONSC-SOT-23-3-318-08_V New Footprint=ONSC-SOT-23-3-318-08_V
Change Physical Footprint: Designator=h1Q1 Old Footprint=KTT0002A New Footprint=KTT0002A
Change Physical Footprint: Designator=h1Q2 Old Footprint=NXP-SOT23_N New Footprint=NXP-SOT23_N
Change Physical Footprint: Designator=h1R7 Old Footprint=RESC2013X50X30NL20T20 New Footprint=RESC2013X50X30NL20T20
Change Physical Footprint: Designator=h1R9 Old Footprint=RESC1609X50X30NL8T20 New Footprint=RESC1609X50X30NL8T20
Change Physical Footprint: Designator=h1R10 Old Footprint=RESC1609X50X30NL8T20 New Footprint=RESC1609X50X30NL8T20
Change Physical Footprint: Designator=h1R14 Old Footprint=FP-CRCW0603-e3-IPC_A New Footprint=FP-CRCW0603-e3-IPC_A
Change Physical Footprint: Designator=h1R20 Old Footprint=RESC1609X50X30NL8T20 New Footprint=RESC1609X50X30NL8T20
Change Physical Footprint: Designator=h1R28 Old Footprint=RESC1608X55X30LL20T20 New Footprint=RESC1608X55X30LL20T20
Change Physical Footprint: Designator=h1R29 Old Footprint=RESC1608X55X30ML15T15 New Footprint=RESC1608X55X30ML15T15
Change Physical Footprint: Designator=h1R41 Old Footprint=RESC1608X55X30LL20T20 New Footprint=RESC1608X55X30LL20T20
Change Physical Footprint: Designator=h1Rs1 Old Footprint=RESC2013X50X30LL20T20 New Footprint=RESC2013X50X30LL20T20
Change Physical Footprint: Designator=h1U1 Old Footprint=VSSOP10 New Footprint=VSSOP10
Change Physical Footprint: Designator=h2C7 Old Footprint=0603_1.6x0.8x0.8mm_Reflow Soldering New Footprint=0603_1.6x0.8x0.8mm_Reflow Soldering
Change Physical Footprint: Designator=h2C25 Old Footprint=0603_1.6x0.8x0.8mm_Reflow Soldering New Footprint=0603_1.6x0.8x0.8mm_Reflow Soldering
Change Physical Footprint: Designator=h2C26 Old Footprint=0603_1.6x0.8x0.8mm_Reflow Soldering New Footprint=0603_1.6x0.8x0.8mm_Reflow Soldering
Change Physical Footprint: Designator=h2C27 Old Footprint=FP-C0603C-CF-MFG New Footprint=FP-C0603C-CF-MFG
Change Physical Footprint: Designator=h2C53 Old Footprint=FP-CGA3E-0_3-0_1-IPC_A New Footprint=FP-CGA3E-0_3-0_1-IPC_A
Change Physical Footprint: Designator=h2C54 Old Footprint=0603_1.6x0.8x0.8mm_Reflow Soldering New Footprint=0603_1.6x0.8x0.8mm_Reflow Soldering
Change Physical Footprint: Designator=h2C55 Old Footprint=0603_1.6x0.8x0.8mm_Reflow Soldering New Footprint=0603_1.6x0.8x0.8mm_Reflow Soldering
Change Physical Footprint: Designator=h2D1 Old Footprint=ONSC-SOT-23-3-318-08_V New Footprint=ONSC-SOT-23-3-318-08_V
Change Physical Footprint: Designator=h2Q1 Old Footprint=KTT0002A New Footprint=KTT0002A
Change Physical Footprint: Designator=h2Q2 Old Footprint=NXP-SOT23_N New Footprint=NXP-SOT23_N
Change Physical Footprint: Designator=h2R7 Old Footprint=RESC2013X50X30NL20T20 New Footprint=RESC2013X50X30NL20T20
Change Physical Footprint: Designator=h2R9 Old Footprint=RESC1609X50X30NL8T20 New Footprint=RESC1609X50X30NL8T20
Change Physical Footprint: Designator=h2R10 Old Footprint=RESC1609X50X30NL8T20 New Footprint=RESC1609X50X30NL8T20
Change Physical Footprint: Designator=h2R14 Old Footprint=FP-CRCW0603-e3-IPC_A New Footprint=FP-CRCW0603-e3-IPC_A
Change Physical Footprint: Designator=h2R20 Old Footprint=RESC1609X50X30NL8T20 New Footprint=RESC1609X50X30NL8T20
Change Physical Footprint: Designator=h2R28 Old Footprint=RESC1608X55X30LL20T20 New Footprint=RESC1608X55X30LL20T20
Change Physical Footprint: Designator=h2R29 Old Footprint=RESC1608X55X30ML15T15 New Footprint=RESC1608X55X30ML15T15
Change Physical Footprint: Designator=h2R41 Old Footprint=RESC1608X55X30LL20T20 New Footprint=RESC1608X55X30LL20T20
Change Physical Footprint: Designator=h2Rs1 Old Footprint=RESC2013X50X30LL20T20 New Footprint=RESC2013X50X30LL20T20
Change Physical Footprint: Designator=h2U1 Old Footprint=VSSOP10 New Footprint=VSSOP10
Change Physical Footprint: Designator=h3C7 Old Footprint=0603_1.6x0.8x0.8mm_Reflow Soldering New Footprint=0603_1.6x0.8x0.8mm_Reflow Soldering
Change Physical Footprint: Designator=h3C25 Old Footprint=0603_1.6x0.8x0.8mm_Reflow Soldering New Footprint=0603_1.6x0.8x0.8mm_Reflow Soldering
Change Physical Footprint: Designator=h3C26 Old Footprint=0603_1.6x0.8x0.8mm_Reflow Soldering New Footprint=0603_1.6x0.8x0.8mm_Reflow Soldering
Change Physical Footprint: Designator=h3C27 Old Footprint=FP-C0603C-CF-MFG New Footprint=FP-C0603C-CF-MFG
Change Physical Footprint: Designator=h3C53 Old Footprint=FP-CGA3E-0_3-0_1-IPC_A New Footprint=FP-CGA3E-0_3-0_1-IPC_A
Change Physical Footprint: Designator=h3C54 Old Footprint=0603_1.6x0.8x0.8mm_Reflow Soldering New Footprint=0603_1.6x0.8x0.8mm_Reflow Soldering
Change Physical Footprint: Designator=h3C55 Old Footprint=0603_1.6x0.8x0.8mm_Reflow Soldering New Footprint=0603_1.6x0.8x0.8mm_Reflow Soldering
Change Physical Footprint: Designator=h3D1 Old Footprint=ONSC-SOT-23-3-318-08_V New Footprint=ONSC-SOT-23-3-318-08_V
Change Physical Footprint: Designator=h3Q1 Old Footprint=KTT0002A New Footprint=KTT0002A
Change Physical Footprint: Designator=h3Q2 Old Footprint=NXP-SOT23_N New Footprint=NXP-SOT23_N
Change Physical Footprint: Designator=h3R7 Old Footprint=RESC2013X50X30NL20T20 New Footprint=RESC2013X50X30NL20T20
Change Physical Footprint: Designator=h3R9 Old Footprint=RESC1609X50X30NL8T20 New Footprint=RESC1609X50X30NL8T20
Change Physical Footprint: Designator=h3R10 Old Footprint=RESC1609X50X30NL8T20 New Footprint=RESC1609X50X30NL8T20
Change Physical Footprint: Designator=h3R14 Old Footprint=FP-CRCW0603-e3-IPC_A New Footprint=FP-CRCW0603-e3-IPC_A
Change Physical Footprint: Designator=h3R20 Old Footprint=RESC1609X50X30NL8T20 New Footprint=RESC1609X50X30NL8T20
Change Physical Footprint: Designator=h3R28 Old Footprint=RESC1608X55X30LL20T20 New Footprint=RESC1608X55X30LL20T20
Change Physical Footprint: Designator=h3R29 Old Footprint=RESC1608X55X30ML15T15 New Footprint=RESC1608X55X30ML15T15
Change Physical Footprint: Designator=h3R41 Old Footprint=RESC1608X55X30LL20T20 New Footprint=RESC1608X55X30LL20T20
Change Physical Footprint: Designator=h3Rs1 Old Footprint=RESC2013X50X30LL20T20 New Footprint=RESC2013X50X30LL20T20
Change Physical Footprint: Designator=h3U1 Old Footprint=VSSOP10 New Footprint=VSSOP10
Change Physical Footprint: Designator=h4C7 Old Footprint=0603_1.6x0.8x0.8mm_Reflow Soldering New Footprint=0603_1.6x0.8x0.8mm_Reflow Soldering
Change Physical Footprint: Designator=h4C25 Old Footprint=0603_1.6x0.8x0.8mm_Reflow Soldering New Footprint=0603_1.6x0.8x0.8mm_Reflow Soldering
Change Physical Footprint: Designator=h4C26 Old Footprint=0603_1.6x0.8x0.8mm_Reflow Soldering New Footprint=0603_1.6x0.8x0.8mm_Reflow Soldering
Change Physical Footprint: Designator=h4C27 Old Footprint=FP-C0603C-CF-MFG New Footprint=FP-C0603C-CF-MFG
Change Physical Footprint: Designator=h4C53 Old Footprint=FP-CGA3E-0_3-0_1-IPC_A New Footprint=FP-CGA3E-0_3-0_1-IPC_A
Change Physical Footprint: Designator=h4C54 Old Footprint=0603_1.6x0.8x0.8mm_Reflow Soldering New Footprint=0603_1.6x0.8x0.8mm_Reflow Soldering
Change Physical Footprint: Designator=h4C55 Old Footprint=0603_1.6x0.8x0.8mm_Reflow Soldering New Footprint=0603_1.6x0.8x0.8mm_Reflow Soldering
Change Physical Footprint: Designator=h4D1 Old Footprint=ONSC-SOT-23-3-318-08_V New Footprint=ONSC-SOT-23-3-318-08_V
Change Physical Footprint: Designator=h4Q1 Old Footprint=KTT0002A New Footprint=KTT0002A
Change Physical Footprint: Designator=h4Q2 Old Footprint=NXP-SOT23_N New Footprint=NXP-SOT23_N
Change Physical Footprint: Designator=h4R7 Old Footprint=RESC2013X50X30NL20T20 New Footprint=RESC2013X50X30NL20T20
Change Physical Footprint: Designator=h4R9 Old Footprint=RESC1609X50X30NL8T20 New Footprint=RESC1609X50X30NL8T20
Change Physical Footprint: Designator=h4R10 Old Footprint=RESC1609X50X30NL8T20 New Footprint=RESC1609X50X30NL8T20
Change Physical Footprint: Designator=h4R14 Old Footprint=FP-CRCW0603-e3-IPC_A New Footprint=FP-CRCW0603-e3-IPC_A
Change Physical Footprint: Designator=h4R20 Old Footprint=RESC1609X50X30NL8T20 New Footprint=RESC1609X50X30NL8T20
Change Physical Footprint: Designator=h4R28 Old Footprint=RESC1608X55X30LL20T20 New Footprint=RESC1608X55X30LL20T20
Change Physical Footprint: Designator=h4R29 Old Footprint=RESC1608X55X30ML15T15 New Footprint=RESC1608X55X30ML15T15
Change Physical Footprint: Designator=h4R41 Old Footprint=RESC1608X55X30LL20T20 New Footprint=RESC1608X55X30LL20T20
Change Physical Footprint: Designator=h4Rs1 Old Footprint=RESC2013X50X30LL20T20 New Footprint=RESC2013X50X30LL20T20
Change Physical Footprint: Designator=h4U1 Old Footprint=VSSOP10 New Footprint=VSSOP10
Change Physical Footprint: Designator=J1 Old Footprint=JST-SM02B-GHS-TB_V New Footprint=JST-SM02B-GHS-TB_V
Change Physical Footprint: Designator=J2 Old Footprint=JST-SM02B-GHS-TB_V New Footprint=JST-SM02B-GHS-TB_V
Change Physical Footprint: Designator=J3 Old Footprint=JST-SM02B-GHS-TB_V New Footprint=JST-SM02B-GHS-TB_V
Change Physical Footprint: Designator=J4 Old Footprint=JST-SM02B-GHS-TB_V New Footprint=JST-SM02B-GHS-TB_V
Change Physical Footprint: Designator=J5 Old Footprint=JST-SM02B-GHS-TB_V New Footprint=JST-SM02B-GHS-TB_V
Change Physical Footprint: Designator=J6 Old Footprint=JST-SM02B-GHS-TB_V New Footprint=JST-SM02B-GHS-TB_V
Change Physical Footprint: Designator=J7 Old Footprint=JST-SM02B-GHS-TB_V New Footprint=JST-SM02B-GHS-TB_V
Change Physical Footprint: Designator=J8 Old Footprint=JST-SM02B-GHS-TB_V New Footprint=JST-SM02B-GHS-TB_V
Change Physical Footprint: Designator=L1 Old Footprint=PM3700-40-RC New Footprint=PM3700-40-RC
Change Physical Footprint: Designator=L1C46 Old Footprint=0603_1.6x0.8x0.8mm_Reflow Soldering New Footprint=0603_1.6x0.8x0.8mm_Reflow Soldering
Change Physical Footprint: Designator=L1C47 Old Footprint=0603_1.6x0.8x0.8mm_Reflow Soldering New Footprint=0603_1.6x0.8x0.8mm_Reflow Soldering
Change Physical Footprint: Designator=L1C56 Old Footprint=0603_1.6x0.8x0.8mm_Reflow Soldering New Footprint=0603_1.6x0.8x0.8mm_Reflow Soldering
Change Physical Footprint: Designator=L1C57 Old Footprint=0603_1.6x0.8x0.8mm_Reflow Soldering New Footprint=0603_1.6x0.8x0.8mm_Reflow Soldering
Change Physical Footprint: Designator=L1R42 Old Footprint=RESC1608X55X30LL20T20 New Footprint=RESC1608X55X30LL20T20
Change Physical Footprint: Designator=L1vD1 Old Footprint=SOD-523 New Footprint=SOD-523
Change Physical Footprint: Designator=L1vR1 Old Footprint=RESC0805(2012)_M New Footprint=RESC0805(2012)_M
Change Physical Footprint: Designator=L1vU1 Old Footprint=SOICN-8-CS New Footprint=SOICN-8-CS
Change Physical Footprint: Designator=L2C46 Old Footprint=0603_1.6x0.8x0.8mm_Reflow Soldering New Footprint=0603_1.6x0.8x0.8mm_Reflow Soldering
Change Physical Footprint: Designator=L2C47 Old Footprint=0603_1.6x0.8x0.8mm_Reflow Soldering New Footprint=0603_1.6x0.8x0.8mm_Reflow Soldering
Change Physical Footprint: Designator=L2C56 Old Footprint=0603_1.6x0.8x0.8mm_Reflow Soldering New Footprint=0603_1.6x0.8x0.8mm_Reflow Soldering
Change Physical Footprint: Designator=L2C57 Old Footprint=0603_1.6x0.8x0.8mm_Reflow Soldering New Footprint=0603_1.6x0.8x0.8mm_Reflow Soldering
Change Physical Footprint: Designator=L2R42 Old Footprint=RESC1608X55X30LL20T20 New Footprint=RESC1608X55X30LL20T20
Change Physical Footprint: Designator=L2vD1 Old Footprint=SOD-523 New Footprint=SOD-523
Change Physical Footprint: Designator=L2vR1 Old Footprint=RESC0805(2012)_M New Footprint=RESC0805(2012)_M
Change Physical Footprint: Designator=L2vU1 Old Footprint=SOICN-8-CS New Footprint=SOICN-8-CS
Change Physical Footprint: Designator=lC10 Old Footprint=CAPC0603(1608)100_L New Footprint=CAPC0603(1608)100_L
Change Physical Footprint: Designator=lR9 Old Footprint=RESC0603(1608)_N New Footprint=RESC0603(1608)_N
Change Physical Footprint: Designator=nC11 Old Footprint=CAPC0805(2012)145_N New Footprint=CAPC0805(2012)145_N
Change Physical Footprint: Designator=nFB1 Old Footprint=782422101HC New Footprint=782422101HC
Change Physical Footprint: Designator=nFB2 Old Footprint=782422101HC New Footprint=782422101HC
Change Physical Footprint: Designator=nFB3 Old Footprint=782422101HC New Footprint=782422101HC
Change Physical Footprint: Designator=nFB4 Old Footprint=782422101HC New Footprint=782422101HC
Change Physical Footprint: Designator=nR2 Old Footprint=RESC0603(1608)_N New Footprint=RESC0603(1608)_N
Change Physical Footprint: Designator=nR6 Old Footprint=RESC0603(1608)_N New Footprint=RESC0603(1608)_N
Change Physical Footprint: Designator=nR7 Old Footprint=RESC0603(1608)_N New Footprint=RESC0603(1608)_N
Change Physical Footprint: Designator=nU1 Old Footprint=64M1_P New Footprint=64M1_P
Change Physical Footprint: Designator=oC1 Old Footprint=CKG57NX7R2A106M500JH New Footprint=CKG57NX7R2A106M500JH
Change Physical Footprint: Designator=oC2 Old Footprint=CKG57NX7R2A106M500JH New Footprint=CKG57NX7R2A106M500JH
Change Physical Footprint: Designator=oH1 Old Footprint=WE-LED0603 New Footprint=WE-LED0603
Change Physical Footprint: Designator=oR2 Old Footprint=RESC0603(1608)_N New Footprint=RESC0603(1608)_N
Change Physical Footprint: Designator=Q3 Old Footprint=NXP-SOT23_N New Footprint=NXP-SOT23_N
Change Physical Footprint: Designator=Q4 Old Footprint=FP-T13-0592-MFG New Footprint=FP-T13-0592-MFG
Change Physical Footprint: Designator=Q5 Old Footprint=NXP-SOT23_N New Footprint=NXP-SOT23_N
Change Physical Footprint: Designator=R1 Old Footprint=RESC3216X70X50LL05T20 New Footprint=RESC3216X70X50LL05T20
Change Physical Footprint: Designator=R2 Old Footprint=RESC3216X70X50LL05T20 New Footprint=RESC3216X70X50LL05T20
Change Physical Footprint: Designator=R3 Old Footprint=RESC1609X50X30ML8T20 New Footprint=RESC1609X50X30ML8T20
Change Physical Footprint: Designator=R4 Old Footprint=RESC1608X55X30LL20T20 New Footprint=RESC1608X55X30LL20T20
Change Physical Footprint: Designator=R5 Old Footprint=RESC1608X55X25NL10T15 New Footprint=RESC1608X55X25NL10T15
Change Physical Footprint: Designator=R6 Old Footprint=RESC1608X55X25NL10T15 New Footprint=RESC1608X55X25NL10T15
Change Physical Footprint: Designator=R8 Old Footprint=RESC1608X55X25NL10T15 New Footprint=RESC1608X55X25NL10T15
Change Physical Footprint: Designator=R11 Old Footprint=RESC1608X55X30LL20T20 New Footprint=RESC1608X55X30LL20T20
Change Physical Footprint: Designator=R12 Old Footprint=RESC2013X60X35NL10T20 New Footprint=RESC2013X60X35NL10T20
Change Physical Footprint: Designator=R13 Old Footprint=RESC3116X65X40ML10T20 New Footprint=RESC3116X65X40ML10T20
Change Physical Footprint: Designator=R15 Old Footprint=RESC1609X50X30NL8T20 New Footprint=RESC1609X50X30NL8T20
Change Physical Footprint: Designator=R16 Old Footprint=RESC1608X55X30NL15T15 New Footprint=RESC1608X55X30NL15T15
Change Physical Footprint: Designator=R17 Old Footprint=RESC1609X50X30NL8T20 New Footprint=RESC1609X50X30NL8T20
Change Physical Footprint: Designator=R18 Old Footprint=RESC2013X60X35NL10T20 New Footprint=RESC2013X60X35NL10T20
Change Physical Footprint: Designator=R19 Old Footprint=RESC1609X50X30NL8T20 New Footprint=RESC1609X50X30NL8T20
Change Physical Footprint: Designator=R21 Old Footprint=RESC1608X55X25ML10T15 New Footprint=RESC1608X55X25ML10T15
Change Physical Footprint: Designator=R22 Old Footprint=RESC1608X55X25ML10T15 New Footprint=RESC1608X55X25ML10T15
Change Physical Footprint: Designator=R23 Old Footprint=RESC1608X55X25ML10T15 New Footprint=RESC1608X55X25ML10T15
Change Physical Footprint: Designator=R24 Old Footprint=RESC1608X55X30ML20T20 New Footprint=RESC1608X55X30ML20T20
Change Physical Footprint: Designator=R25 Old Footprint=RESC1608X55X30ML20T20 New Footprint=RESC1608X55X30ML20T20
Change Physical Footprint: Designator=R26 Old Footprint=RESC1608X55X30ML20T20 New Footprint=RESC1608X55X30ML20T20
Change Physical Footprint: Designator=R27 Old Footprint=RESC1608X55X30ML20T20 New Footprint=RESC1608X55X30ML20T20
Change Physical Footprint: Designator=R30 Old Footprint=RESC1609X55X30NL10T20 New Footprint=RESC1609X55X30NL10T20
Change Physical Footprint: Designator=R31 Old Footprint=RESC1609X50X30ML10T20 New Footprint=RESC1609X50X30ML10T20
Change Physical Footprint: Designator=R32 Old Footprint=RESC1609X55X30NL10T20 New Footprint=RESC1609X55X30NL10T20
Change Physical Footprint: Designator=R39 Old Footprint=RESC1608X55X30NL15T15 New Footprint=RESC1608X55X30NL15T15
Change Physical Footprint: Designator=R40 Old Footprint=RESC1608X55X30NL15T15 New Footprint=RESC1608X55X30NL15T15
Change Physical Footprint: Designator=tD1 Old Footprint=FAIR-SOD-523F-2_V New Footprint=FAIR-SOD-523F-2_V
Change Physical Footprint: Designator=tQ1 Old Footprint=ONSC-SOT-23-3-318-08_V New Footprint=ONSC-SOT-23-3-318-08_V
Change Physical Footprint: Designator=tQ2 Old Footprint=ONSC-SOT-323-3-419-04_V New Footprint=ONSC-SOT-323-3-419-04_V
Change Physical Footprint: Designator=tQ3 Old Footprint=ONSC-SOT-23-3-318-08_V New Footprint=ONSC-SOT-23-3-318-08_V
Change Physical Footprint: Designator=tR3 Old Footprint=RESC0603(1608)_N New Footprint=RESC0603(1608)_N
Change Physical Footprint: Designator=tR5 Old Footprint=RESC0603(1608)_L New Footprint=RESC0603(1608)_L
Change Physical Footprint: Designator=U2 Old Footprint=MTC16_N New Footprint=MTC16_N
Change Physical Footprint: Designator=U3 Old Footprint=MF05A_N New Footprint=MF05A_N
Change Physical Footprint: Designator=vF1 Old Footprint=65800001109 New Footprint=65800001109
Change Physical Footprint: Designator=vR3 Old Footprint=RESC1206(3216)_N New Footprint=RESC1206(3216)_N
