Change Component Footprint: Designator=U1 Old Footprint=SOP50P490X110-10N New Footprint=VSSOP10
Change Component Footprint: Designator=U1 Old Footprint=SOP50P490X110-10N New Footprint=VSSOP10
Change Component Footprint: Designator=U1 Old Footprint=SOP50P490X110-10N New Footprint=VSSOP10
Change Component Footprint: Designator=U1 Old Footprint=SOP50P490X110-10N New Footprint=VSSOP10
