Change Physical Footprint: Designator=*1 Old Footprint=AVO120-48S12P-6L New Footprint=AVO120-48S12P-6L
Change Physical Footprint: Designator=bH Old Footprint=WE-LED0603 New Footprint=WE-LED0603
Change Physical Footprint: Designator=C21 Old Footprint=0603_1.6x0.8x0.8mm_Reflow Soldering New Footprint=0603_1.6x0.8x0.8mm_Reflow Soldering
Change Physical Footprint: Designator=C24 Old Footprint=0603_1.6x0.8x0.8mm_Reflow Soldering New Footprint=0603_1.6x0.8x0.8mm_Reflow Soldering
Change Physical Footprint: Designator=C35 Old Footprint=0603_1.6x0.8x0.8mm_Reflow Soldering New Footprint=0603_1.6x0.8x0.8mm_Reflow Soldering
Change Physical Footprint: Designator=C40 Old Footprint=0603_1.6x0.8x0.8mm_Reflow Soldering New Footprint=0603_1.6x0.8x0.8mm_Reflow Soldering
Change Physical Footprint: Designator=D5 Old Footprint=0603 [1608] (high density) New Footprint=0603 [1608] (high density)
Change Physical Footprint: Designator=D7 Old Footprint=0603 [1608] (high density) New Footprint=0603 [1608] (high density)
Change Physical Footprint: Designator=E1C3 Old Footprint=1812_4.5x3.2x1.25mm New Footprint=1812_4.5x3.2x1.25mm
Change Physical Footprint: Designator=h2R10 Old Footprint=RESC1609X50X30NL8T20 New Footprint=RESC1609X50X30NL8T20
Change Physical Footprint: Designator=h3C55 Old Footprint=0603_1.6x0.8x0.8mm_Reflow Soldering New Footprint=0603_1.6x0.8x0.8mm_Reflow Soldering
Change Physical Footprint: Designator=h3Q1 Old Footprint=KTT0002A New Footprint=KTT0002A
Change Physical Footprint: Designator=h3R10 Old Footprint=RESC1609X50X30NL8T20 New Footprint=RESC1609X50X30NL8T20
Change Physical Footprint: Designator=h3Rs1 Old Footprint=RESC2013X50X30LL20T20 New Footprint=RESC2013X50X30LL20T20
Change Physical Footprint: Designator=h3Servo Old Footprint=XT30PW(female) New Footprint=XT30PW(female)
Change Physical Footprint: Designator=h4Servo Old Footprint=XT30PW(female) New Footprint=XT30PW(female)
Change Physical Footprint: Designator=L1C46 Old Footprint=0603_1.6x0.8x0.8mm_Reflow Soldering New Footprint=0603_1.6x0.8x0.8mm_Reflow Soldering
Change Physical Footprint: Designator=L1C56 Old Footprint=0603_1.6x0.8x0.8mm_Reflow Soldering New Footprint=0603_1.6x0.8x0.8mm_Reflow Soldering
Change Physical Footprint: Designator=L2LV net Old Footprint=XT30PW(female) New Footprint=XT30PW(female)
Change Physical Footprint: Designator=LED Old Footprint=JST BM04B-PASS-TF New Footprint=JST BM04B-PASS-TF
Change Physical Footprint: Designator=Mbed Old Footprint=Mbed smd New Footprint=Mbed smd
Change Physical Footprint: Designator=R2 Old Footprint=RESC3216X70X50LL05T20 New Footprint=RESC3216X70X50LL05T20
Change Physical Footprint: Designator=R5 Old Footprint=RESC1608X55X25NL10T15 New Footprint=RESC1608X55X25NL10T15
Change Physical Footprint: Designator=R6 Old Footprint=RESC1608X55X25NL10T15 New Footprint=RESC1608X55X25NL10T15
Change Physical Footprint: Designator=R8 Old Footprint=RESC1608X55X25NL10T15 New Footprint=RESC1608X55X25NL10T15
Change Physical Footprint: Designator=R13 Old Footprint=RESC3116X65X40ML10T20 New Footprint=RESC3116X65X40ML10T20
Change Physical Footprint: Designator=R23 Old Footprint=RESC1608X55X25ML10T15 New Footprint=RESC1608X55X25ML10T15
Change Physical Footprint: Designator=vF1 Old Footprint=65800001109 New Footprint=65800001109
