Change Component Parameter Comment in oR2 Old= New=200K 1% 0603(1608)
Change Component Parameter Description in Q4 Old=MOSFET P-CHAN 100V TO252 New=Trans MOSFET P-CH 100V 38A Automotive 3-Pin(2+Tab) TO-252AA
Change Component Parameter Comment in R12 Old= New=RC0805FR-0710KL
Change Component Parameter Comment in R17 Old= New=CRCW060310K0FKEA
Replace Symbol from oR2 RES in C:\Users\robbe\OneDrive\Documenten\MARCH\gitkraken\powerdistribution-altium-design\Schematics\On-Off.SchDoc with RES from Altium Content Vault
Replace Symbol from Q3 NXP-NMOS-GSD-3_B in C:\Users\robbe\OneDrive\Documenten\MARCH\gitkraken\powerdistribution-altium-design\Schematics\On-Off.SchDoc with NXP-NMOS-GSD-3_B from Altium Content Vault
Replace Symbol from Q4 fa973b6fe495df73f7671c1257699aa in C:\Users\robbe\OneDrive\Documenten\MARCH\gitkraken\powerdistribution-altium-design\Schematics\On-Off.SchDoc with fa973b6fe495df73f7671c1257699aa from Altium Content Vault
Replace Symbol from R12 RES-2 in C:\Users\robbe\OneDrive\Documenten\MARCH\gitkraken\powerdistribution-altium-design\Schematics\On-Off.SchDoc with RES-2 from Altium Content Vault
Replace Symbol from R16 RES in C:\Users\robbe\OneDrive\Documenten\MARCH\gitkraken\powerdistribution-altium-design\Schematics\On-Off.SchDoc with RES from Altium Content Vault
Replace Symbol from R17 RES-2 in C:\Users\robbe\OneDrive\Documenten\MARCH\gitkraken\powerdistribution-altium-design\Schematics\On-Off.SchDoc with RES-2 from Altium Content Vault
