Removed Pin From Net: NetName=HVon4 Pin=lT1-1
Removed Pin From Net: NetName=HVon3 Pin=lT2-1
Removed Pin From Net: NetName=HVon2 Pin=lT3-1
Removed Pin From Net: NetName=HVon1 Pin=lT4-1
Removed Pin From Net: NetName=HVon4 Pin=lU5-4
Removed Pin From Net: NetName=HVon3 Pin=lU5-5
Removed Pin From Net: NetName=HVon2 Pin=lU5-6
Removed Pin From Net: NetName=HVon1 Pin=lU5-7
Added Pin To Net: NetName=HVon1 Pin=lT1-1
Added Pin To Net: NetName=HVon2 Pin=lT2-1
Added Pin To Net: NetName=HVon3 Pin=lT3-1
Added Pin To Net: NetName=HVon4 Pin=lT4-1
Added Pin To Net: NetName=HVon1 Pin=lU5-4
Added Pin To Net: NetName=HVon2 Pin=lU5-5
Added Pin To Net: NetName=HVon3 Pin=lU5-6
Added Pin To Net: NetName=HVon4 Pin=lU5-7
