{
    "target_overrides": {
        "NUCLEO_F334R8": {
            "target.stdio_uart_tx": "PA_9",
            "target.stdio_uart_rx": "PA_10"
        },
        "NUCLEO_F303RE": {
            "platform.stdio-buffered-serial": 1,
            "target.stdio_uart_tx": "PB_10",
            "target.stdio_uart_rx": "PB_11"
        },
        "*": {
            "target.printf_lib": "minimal-printf",
            "platform.minimal-printf-enable-floating-point": true,
            "platform.minimal-printf-set-floating-point-max-decimals": 4,
            "platform.minimal-printf-enable-64-bit": false
        }
    }
}
