{
  "kind": "collectionType",
  "collectionName": "managers",
  "info": {
    "singularName": "manager",
    "pluralName": "managers",
    "displayName": "Manager"
  },
  "options": {
    "draftAndPublish": true
  },
  "pluginOptions": {},
  "attributes": {
    "name": {
      "type": "string"
    },
    "password": {
      "type": "password"
    }
  }
}
