2020-12-11T23:00:00.000Z,
BuyEnergy,DynamicAdjustmentOfCoolingIntensity,ShiftDelayTolerantWorkload,WorkloadRelocation,WorkloadHosting,
2020-12-11T06:00:00.000Z,
BuyEnergy,DischargeBattery,DynamicAdjustmentOfCoolingIntensity,ShiftDelayTolerantWorkload,ShiftDelayTolerantWorkload,ShiftDelayTolerantWorkload,WorkloadRelocation,WorkloadHosting,
2020-12-11T08:00:00.000Z,
BuyEnergy,ChargeBattery,DynamicAdjustmentOfCoolingIntensity,ShiftDelayTolerantWorkload,ShiftDelayTolerantWorkload,ShiftDelayTolerantWorkload,ShiftDelayTolerantWorkload,WorkloadRelocation,WorkloadHosting,
2020-12-11T15:00:00.000Z,
BuyEnergy,DynamicAdjustmentOfCoolingIntensity,ShiftDelayTolerantWorkload,WorkloadRelocation,WorkloadHosting,
2020-12-11T17:00:00.000Z,
BuyEnergy,DynamicAdjustmentOfCoolingIntensity,ShiftDelayTolerantWorkload,ShiftDelayTolerantWorkload,ShiftDelayTolerantWorkload,ShiftDelayTolerantWorkload,ShiftDelayTolerantWorkload,WorkloadRelocation,WorkloadHosting,
2020-12-11T00:00:00.000Z,
BuyEnergy,DischargeBattery,DynamicAdjustmentOfCoolingIntensity,ShiftDelayTolerantWorkload,ShiftDelayTolerantWorkload,ShiftDelayTolerantWorkload,ShiftDelayTolerantWorkload,WorkloadRelocation,WorkloadHosting,
2020-12-11T22:00:00.000Z,
BuyEnergy,DynamicAdjustmentOfCoolingIntensity,ShiftDelayTolerantWorkload,ShiftDelayTolerantWorkload,WorkloadRelocation,WorkloadHosting,
2020-12-11T14:00:00.000Z,
BuyEnergy,DynamicAdjustmentOfCoolingIntensity,ShiftDelayTolerantWorkload,WorkloadRelocation,WorkloadHosting,
2020-12-11T16:00:00.000Z,
BuyEnergy,DynamicAdjustmentOfCoolingIntensity,ShiftDelayTolerantWorkload,WorkloadRelocation,WorkloadHosting,
2020-12-11T07:00:00.000Z,
BuyEnergy,ChargeBattery,DynamicAdjustmentOfCoolingIntensity,ShiftDelayTolerantWorkload,ShiftDelayTolerantWorkload,ShiftDelayTolerantWorkload,WorkloadRelocation,WorkloadHosting,
2020-12-11T09:00:00.000Z,
BuyEnergy,ChargeBattery,DynamicAdjustmentOfCoolingIntensity,ShiftDelayTolerantWorkload,ShiftDelayTolerantWorkload,ShiftDelayTolerantWorkload,ShiftDelayTolerantWorkload,WorkloadRelocation,WorkloadHosting,
2020-12-11T01:00:00.000Z,
BuyEnergy,DischargeBattery,DynamicAdjustmentOfCoolingIntensity,ShiftDelayTolerantWorkload,ShiftDelayTolerantWorkload,ShiftDelayTolerantWorkload,ShiftDelayTolerantWorkload,WorkloadRelocation,WorkloadHosting,
2020-12-11T02:00:00.000Z,
BuyEnergy,DischargeBattery,DynamicAdjustmentOfCoolingIntensity,ShiftDelayTolerantWorkload,ShiftDelayTolerantWorkload,ShiftDelayTolerantWorkload,ShiftDelayTolerantWorkload,ShiftDelayTolerantWorkload,WorkloadRelocation,WorkloadHosting,
2020-12-11T04:00:00.000Z,
BuyEnergy,DischargeBattery,DynamicAdjustmentOfCoolingIntensity,ShiftDelayTolerantWorkload,ShiftDelayTolerantWorkload,WorkloadRelocation,WorkloadHosting,
2020-12-11T10:00:00.000Z,
BuyEnergy,ChargeBattery,DynamicAdjustmentOfCoolingIntensity,ShiftDelayTolerantWorkload,ShiftDelayTolerantWorkload,ShiftDelayTolerantWorkload,WorkloadRelocation,WorkloadHosting,
2020-12-11T12:00:00.000Z,
BuyEnergy,ChargeBattery,DynamicAdjustmentOfCoolingIntensity,ShiftDelayTolerantWorkload,WorkloadRelocation,WorkloadHosting,
2020-12-11T11:00:00.000Z,
BuyEnergy,ChargeBattery,DynamicAdjustmentOfCoolingIntensity,ShiftDelayTolerantWorkload,ShiftDelayTolerantWorkload,ShiftDelayTolerantWorkload,WorkloadRelocation,WorkloadHosting,
2020-12-11T19:00:00.000Z,
BuyEnergy,DynamicAdjustmentOfCoolingIntensity,ShiftDelayTolerantWorkload,WorkloadRelocation,WorkloadHosting,
2020-12-11T21:00:00.000Z,
BuyEnergy,DynamicAdjustmentOfCoolingIntensity,ShiftDelayTolerantWorkload,ShiftDelayTolerantWorkload,ShiftDelayTolerantWorkload,WorkloadRelocation,WorkloadHosting,
2020-12-11T18:00:00.000Z,
BuyEnergy,DynamicAdjustmentOfCoolingIntensity,ShiftDelayTolerantWorkload,ShiftDelayTolerantWorkload,ShiftDelayTolerantWorkload,WorkloadRelocation,WorkloadHosting,
2020-12-11T20:00:00.000Z,
BuyEnergy,DynamicAdjustmentOfCoolingIntensity,ShiftDelayTolerantWorkload,ShiftDelayTolerantWorkload,WorkloadRelocation,WorkloadHosting,
2020-12-11T03:00:00.000Z,
BuyEnergy,DischargeBattery,DynamicAdjustmentOfCoolingIntensity,ShiftDelayTolerantWorkload,ShiftDelayTolerantWorkload,ShiftDelayTolerantWorkload,ShiftDelayTolerantWorkload,ShiftDelayTolerantWorkload,WorkloadRelocation,WorkloadHosting,
2020-12-11T05:00:00.000Z,
BuyEnergy,DischargeBattery,DynamicAdjustmentOfCoolingIntensity,ShiftDelayTolerantWorkload,ShiftDelayTolerantWorkload,ShiftDelayTolerantWorkload,ShiftDelayTolerantWorkload,WorkloadRelocation,WorkloadHosting,
2020-12-11T13:00:00.000Z,
BuyEnergy,ChargeBattery,DynamicAdjustmentOfCoolingIntensity,ShiftDelayTolerantWorkload,ShiftDelayTolerantWorkload,ShiftDelayTolerantWorkload,WorkloadRelocation,WorkloadHosting,
2020-12-11T23:00:00.000Z,

2020-12-11T06:00:00.000Z,

2020-12-11T08:00:00.000Z,

2020-12-11T15:00:00.000Z,

2020-12-11T17:00:00.000Z,

2020-12-11T00:00:00.000Z,

2020-12-11T22:00:00.000Z,

2020-12-11T14:00:00.000Z,

2020-12-11T16:00:00.000Z,

2020-12-11T07:00:00.000Z,

2020-12-11T09:00:00.000Z,

2020-12-11T01:00:00.000Z,

2020-12-11T02:00:00.000Z,

2020-12-11T04:00:00.000Z,

2020-12-11T10:00:00.000Z,

2020-12-11T12:00:00.000Z,

2020-12-11T11:00:00.000Z,

2020-12-11T19:00:00.000Z,

2020-12-11T21:00:00.000Z,

2020-12-11T18:00:00.000Z,

2020-12-11T20:00:00.000Z,

2020-12-11T03:00:00.000Z,

2020-12-11T05:00:00.000Z,

2020-12-11T13:00:00.000Z,


