E_Total, Real_Time_Workload, Delay_Tolerant_Workload, Energy_Price, L_Price, T_Price, D_Price, DR_Signal, Baseline, Delay_Tolerant_Executed, Total Cooling, IT Cooling, TES, D_TES, R_TES, ESD, D_ESD, R_ESD, DC Demand, DC Thermal Generation(Adapted Heat), Adapted CO2, Adapted Server, Adapted Cooling, Adapted DC, Baseline Heat, Baseline CO2,  Relocated, Hosted, Y,,,,,,,,,,,,,,,,,,,,,,,
623.7793,561.4014,62.3779,0.22,0.28,0.23,0.35,720,726.8833,62.3779,103.1040165,103.1040165,75,0,0,1800,0,0,726.8833165,353.6467767,363.4416583,623.7793,103.1040165,726.8833165,353.6467767,363.4416583,0,0,1,0,0,0,0,0,0,0,0,0,0,0,0,0,0,0,0,0,0,0,0,0,0,0
657.465,591.7185,65.7465,0.22,0.28,0.23,0.35,720,766.1369,6.57465,98.89142975,98.89142975,75,0,0,1800,0,0,697.1845798,339.197604,348.5922899,598.29315,98.89142975,697.1845798,339.197604,348.5922899,0,0,0,0.1,0.1,0.1,0.2,0.3,0,0.1,0,0,0.1,0,0,0,0,0,0,0,0,0,0,0,0,0
643.8794,579.4915,64.3879,0.22,0.28,0.23,0.35,720,750.3059,6.43879,96.84798182,96.84798182,75,0,0,1800,0,0,682.7782718,332.1885776,341.3891359,585.93029,96.84798182,682.7782718,332.1885776,341.3891359,0,0,0,0,0,0.3,0,0.1,0,0.1,0.2,0.2,0,0.1,0,0,0,0,0,0,0,0,0,0,0,-2.78E-17
630.0046,567.0041,63.0005,0.22,0.28,0.23,0.35,720,734.1375,25.2002,97.88500826,97.88500826,75,0,0,1800,0,0,690.0893083,335.7455783,345.0446541,592.2043,97.88500826,690.0893083,335.7455783,345.0446541,0,0,0,0,0,0,0,0.1,0.1,0.1,0.4,0.1,0.1,0.1,0,0,0,0,0,0,0,0,0,0,0,2.78E-17
643.5399,579.1859,64.354,0.22,0.28,0.23,0.35,720,749.9101,19.3062,98.92431405,98.92431405,75,0,0,1800,0,0,697.416414,339.3103972,348.708207,598.4921,98.92431405,697.416414,339.3103972,348.708207,0,0,0,0,0,0,0.1,0,0,0.1,0.2,0.5,0.1,0,0,0,0,0,0,0,0,0,0,0,0,8.33E-17
619.6511,557.686,61.9651,0.22,0.28,0.23,0.35,720,722.0728,30.98255,97.30058678,97.30058678,75,0,0,1800,0,0,685.9691368,333.7410126,342.9845684,588.66855,97.30058678,685.9691368,333.7410126,342.9845684,0,0,0,0,0,0,0,0,0.1,0,0.3,0.1,0.4,0.1,0,0,0,0,0,0,0,0,0,0,0,8.33E-17
626.8737,564.1863,62.6874,0.22,0.22,0.23,0.35,720,730.4892,18.80622,96.3624,96.3624,75,0,0,1800,0,0,679.35492,330.523032,339.67746,582.99252,96.3624,679.35492,330.523032,339.67746,0,0,0,0,0,0,0,0,0.1,0.1,0.1,0,0.3,0.3,0.1,0,0,0,0,0,0,0,0,0,0,8.33E-17
657.7873,592.0086,65.7787,0.22,0.22,0.35,0.35,720,766.5126,32.88935,28.28891736,103.2889174,75,75,0,1800,0,0,653.1868674,0,326.5934337,624.89795,28.28891736,653.1868674,354.2809865,364.0934337,0,0,0,0,0,0,0,0,0,0,0.1,0.3,0.3,0,0.3,0,0,0,0,0,0,0,0,0,0,1.11E-16
644.1261,579.7135,64.4126,0.22,0.22,0.35,0.35,870,750.5933,96.6189,149.2904793,111.7904793,0,0,37.5,1800,0,0,825.6228793,575.1620162,412.8114397,676.3324,149.2904793,825.6228793,383.4413441,394.0614397,0,0,0,0,0,0,0,0,0,0,0.2,0.1,0.5,0.1,0.1,0,0,0,0,0,0,0,0,0,0,5.55E-17
667.8683,601.0815,66.7868,0.25,0.22,0.35,0.35,870,778.2598,86.82284,151.2031967,113.7031967,37.5,0,37.5,1800,0,0,839.1075367,585.002947,419.5537683,687.90434,151.2031967,839.1075367,390.0019647,400.8037683,0,0,0,0,0,0,0,0,0,0,0,0,0.3,0.2,0.3,0.2,0,0,0,0,0,0,0,0,0,-5.55E-17
626.4902,563.8412,62.649,0.26,0.22,0.35,0.35,870,730.0423,131.5629,114.9428264,114.9428264,75,0,0,1800,0,0,810.3469264,394.2538947,405.1734632,695.4041,114.9428264,810.3469264,394.2538947,405.1734632,0,0,0,0,0,0,0,0,0,0,0,0,0,0.4,0.2,0.4,0,0,0,0,0,0,0,0,0,-5.55E-17
659.4917,593.5425,65.9492,0.26,0.22,0.35,0.35,870,768.4986,98.9238,114.4572397,114.4572397,75,0,0,1800,0,0,806.9235397,392.5883321,403.4617698,692.4663,114.4572397,806.9235397,392.5883321,403.4617698,0,0,0,0,0,0,0,0,0,0,0,0,0,0.2,0,0.8,0,0,0,0,0,0,0,0,0,0
642.5394,578.2855,64.2539,0.26,0.22,0.35,0.35,870,748.7443,96.38085,111.5150992,111.5150992,75,0,0,1800,0,0,786.1814492,382.4967902,393.0907246,674.66635,111.5150992,786.1814492,382.4967902,393.0907246,0,0,0,0,0,0,0,0,0,0,0,0,0,0,0.5,0.3,0.2,0,0,0,0,0,0,0,0,0
618.9148,557.0233,61.8915,0.26,0.22,0.35,0.35,870,721.2147,160.9179,118.6679669,118.6679669,75,0,0,1800,0,0,836.6091669,407.0311266,418.3045835,717.9412,118.6679669,836.6091669,407.0311266,418.3045835,0,0,0,0,0,0,0,0,0,0,0,0,0,0,0,0.9,0.1,0,0,0,0,0,0,0,0,-2.78E-17
663.0247,596.7222,66.3025,0.25,0.22,0.31,0.35,870,772.6155,79.563,111.7826777,111.7826777,75,0,0,1800,0,0,788.0678777,383.4145845,394.0339388,676.2852,111.7826777,788.0678777,383.4145845,394.0339388,0,0,0,0,0,0,0,0,0,0,0,0,0,0,0,0,0.9,0,0.1,0,0,0,0,0,0,-2.78E-17
645.5794,581.0215,64.5579,0.22,0.27,0.31,0.35,770,752.2868,58.10211,105.6402661,105.6402661,75,0,0,1800,0,0,744.7638761,362.3461128,372.3819381,639.12361,105.6402661,744.7638761,362.3461128,372.3819381,0,0,0,0,0,0,0,0,0,0,0,0,0,0,0,0,0,0.9,0,0.1,0,0,0,0,0,-2.78E-17
631.8607,568.6746,63.1861,0.22,0.27,0.31,0.35,770,736.3004,56.86749,103.3953868,103.3953868,75,0,0,1800,0,0,728.9374768,354.6461766,364.4687384,625.54209,103.3953868,728.9374768,354.6461766,364.4687384,0,0,0,0,0,0,0,0,0,0,0,0,0,0,0,0,0,0,0.8,0.1,0.1,0,0,0,0,-5.55E-17
655.1592,589.6433,65.5159,0.22,0.27,0.31,0.35,770,763.4499,45.86113,105.0420545,105.0420545,75,0,0,1800,0,0,740.5464845,360.2942471,370.2732423,635.50443,105.0420545,740.5464845,360.2942471,370.2732423,0,0,0,0,0,0,0,0,0,0,0,0,0,0,0,0,0,0,0,0.5,0.2,0.2,0.1,0,0,-2.78E-17
649.1099,584.1989,64.911,0.22,0.27,0.31,0.35,770,756.4007,45.4377,104.0721653,104.0721653,75,0,0,1800,0,0,733.7087653,356.9675269,366.8543826,629.6366,104.0721653,733.7087653,356.9675269,366.8543826,0,0,0,0,0,0,0,0,0,0,0,0,0,0,0,0,0,0,0,0,0.4,0.1,0.2,0.2,0.1,-2.78E-17
618.5393,556.6854,61.8539,0.22,0.27,0.31,0.35,770,720.7772,74.22468,104.2826579,104.2826579,75,0,0,1800,0,0,735.1927379,357.6895164,367.5963689,630.91008,104.2826579,735.1927379,357.6895164,367.5963689,0,0,0,0,0,0,0,0,0,0,0,0,0,0,0,0,0,0,0,0,0,0.9,0.1,0,0,-2.78E-17
612.2027,550.9824,61.2203,0.22,0.27,0.31,0.35,770,713.3932,85.70842,105.2381521,105.2381521,75,0,0,1800,0,0,741.9289721,360.9668616,370.964486,636.69082,105.2381521,741.9289721,360.9668616,370.964486,0,0,0,0,0,0,0,0,0,0,0,0,0,0,0,0,0,0,0,0,0,0,1,0,0,0
609.8481,548.8633,60.9848,0.3,0.27,0.31,0.35,750,710.6495,67.08328,101.8093521,101.8093521,75,0,0,1800,0,0,717.7559321,349.2060776,358.877966,615.94658,101.8093521,717.7559321,349.2060776,358.877966,0,0,0,0,0,0,0,0,0,0,0,0,0,0,0,0,0,0,0,0,0,0,0,0.9,0.1,-2.78E-17
610.2099,549.1889,61.021,0.3,0.27,0.31,0.35,750,711.071,73.2252,102.8783636,102.8783636,75,0,0,1800,0,0,725.2924636,352.8727873,362.6462318,622.4141,102.8783636,725.2924636,352.8727873,362.6462318,0,0,0,0,0,0,0,0,0,0,0,0,0,0,0,0,0,0,0,0,0,0,0,0,1,0
610.3606,549.3245,61.0361,0.3,0.27,0.31,0.35,750,711.2466,61.0361,100.8860496,100.8860496,75,0,0,1800,0,0,711.2466496,346.0391501,355.6233248,610.3606,100.8860496,711.2466496,346.0391501,355.6233248,0,0,0,0,0,0,0,0,0,0,0,0,0,0,0,0,0,0,0,0,0,0,0,0,0,1
MAX_T,24,,,,,,,,,,,,,,,,,,,,,,,,,,,,,,,,,,,,,,,,,,,,,,,,,,
f_ESD,1,,,,,,,,,,,,,,,,,,,,,,,,,,,,,,,,,,,,,,,,,,,,,,,,,,
ESD_MAX,1800,,,,,,,,,,,,,,,,,,,,,,,,,,,,,,,,,,,,,,,,,,,,,,,,,,
f_TES,1,,,,,,,,,,,,,,,,,,,,,,,,,,,,,,,,,,,,,,,,,,,,,,,,,,
TES_MAX,75,,,,,,,,,,,,,,,,,,,,,,,,,,,,,,,,,,,,,,,,,,,,,,,,,,
TES_R,1,,,,,,,,,,,,,,,,,,,,,,,,,,,,,,,,,,,,,,,,,,,,,,,,,,
TES_D,1,,,,,,,,,,,,,,,,,,,,,,,,,,,,,,,,,,,,,,,,,,,,,,,,,,
ESD_R,1,,,,,,,,,,,,,,,,,,,,,,,,,,,,,,,,,,,,,,,,,,,,,,,,,,
ESD_D,1,,,,,,,,,,,,,,,,,,,,,,,,,,,,,,,,,,,,,,,,,,,,,,,,,,
MAX_DIS_TES,75,,,,,,,,,,,,,,,,,,,,,,,,,,,,,,,,,,,,,,,,,,,,,,,,,,
MAX_DIS_ESD,1000,,,,,,,,,,,,,,,,,,,,,,,,,,,,,,,,,,,,,,,,,,,,,,,,,,
DoD,0.4,,,,,,,,,,,,,,,,,,,,,,,,,,,,,,,,,,,,,,,,,,,,,,,,,,
MAX_IT,780,,,,,,,,,,,,,,,,,,,,,,,,,,,,,,,,,,,,,,,,,,,,,,,,,,
COP_C,6.05,,,,,,,,,,,,,,,,,,,,,,,,,,,,,,,,,,,,,,,,,,,,,,,,,,
COP_H,4.43,,,,,,,,,,,,,,,,,,,,,,,,,,,,,,,,,,,,,,,,,,,,,,,,,,
MAX_HOST,100,,,,,,,,,,,,,,,,,,,,,,,,,,,,,,,,,,,,,,,,,,,,,,,,,,
MAX_Relocate,100,,,,,,,,,,,,,,,,,,,,,,,,,,,,,,,,,,,,,,,,,,,,,,,,,,
relocateActive,0,,,,,,,,,,,,,,,,,,,,,,,,,,,,,,,,,,,,,,,,,,,,,,,,,,
TES_INIT,75,,,,,,,,,,,,,,,,,,,,,,,,,,,,,,,,,,,,,,,,,,,,,,,,,,
ESD_INIT,1800,,,,,,,,,,,,,,,,,,,,,,,,,,,,,,,,,,,,,,,,,,,,,,,,,,
ESD_FIN,1800,,,,,,,,,,,,,,,,,,,,,,,,,,,,,,,,,,,,,,,,,,,,,,,,,,
TES_FIN,75,,,,,,,,,,,,,,,,,,,,,,,,,,,,,,,,,,,,,,,,,,,,,,,,,,
WE,0,,,,,,,,,,,,,,,,,,,,,,,,,,,,,,,,,,,,,,,,,,,,,,,,,,
WF,1,,,,,,,,,,,,,,,,,,,,,,,,,,,,,,,,,,,,,,,,,,,,,,,,,,
WT,0,,,,,,,,,,,,,,,,,,,,,,,,,,,,,,,,,,,,,,,,,,,,,,,,,,
WL,0,,,,,,,,,,,,,,,,,,,,,,,,,,,,,,,,,,,,,,,,,,,,,,,,,,
E_D_Percentage,0.1,,,,,,,,,,,,,,,,,,,,,,,,,,,,,,,,,,,,,,,,,,,,,,,,,,
