E_Total, Real_Time_Workload, Delay_Tolerant_Workload, REN, Energy_Price, L_Price, T_Price, D_Price, DR_Signal, Baseline, Delay_Tolerant_Executed, Total Cooling, IT Cooling, TES, D_TES, R_TES, ESD, D_ESD, R_ESD, DC Demand, DC Thermal Generation(Adapted Heat), Adapted CO2, Adapted Server, Adapted Cooling, Adapted DC, Baseline Heat, Baseline CO2,  Relocated, Hosted, Y
782.58,547.806,234.774,1019.7255,0.22,0.28,0.23,0.35,1019.7255,1019.7255,187.81920000000002,170.2084,245.2084,75.0,75.0,0.0,1800.0,0.0,0.0,905.8336,0.0,452.9168,735.6252000000001,170.2084,905.8336,841.0648120000001,490.4168,0.0,0.0,0.8,0.1,0.1,0.0,0.0,0.0,0.0,0.0,0.0,0.0,0.0,0.0,0.0,0.0,0.0,0.0,0.0,0.0,0.0,0.0,0.0,0.0,0.0,-5.551115123125783E-17,
782.58,547.806,234.774,1019.7255,0.22,0.28,0.23,0.35,1019.7255,1019.7255,211.2966,290.53420000000006,253.03420000000003,0.0,0.0,37.5,1800.0,0.0,0.0,1049.6368000000002,1301.860959,524.8184000000001,759.1026,290.53420000000006,1049.6368000000002,867.9073060000001,506.06840000000005,0.0,0.0,0.0,0.8,0.0,0.2,0.0,0.0,0.0,0.0,0.0,0.0,0.0,0.0,0.0,0.0,0.0,0.0,0.0,0.0,0.0,0.0,0.0,0.0,0.0,-5.551115123125783E-17,
783.55,548.485,235.065,1020.9894,0.22,0.28,0.23,0.35,1020.9894,1020.9894,188.05199999999996,283.01233333333334,245.51233333333334,37.5,0.0,37.5,1800.0,0.0,0.0,1019.5493333333334,1263.160955,509.7746666666667,736.537,283.01233333333334,1019.5493333333334,842.1073033333333,491.0246666666667,0.0,0.0,0.0,0.0,0.7,0.1,0.0,0.0,0.1,0.1,0.0,0.0,0.0,0.0,0.0,0.0,0.0,0.0,0.0,0.0,0.0,0.0,0.0,0.0,0.0,2.7755575615628914E-17,
783.55,548.485,235.065,1020.9894,0.22,0.22,0.23,0.35,1020.9894,1020.9894,117.53250000000001,222.00583333333336,222.00583333333336,75.0,0.0,0.0,1800.0,0.0,0.0,888.0233333333334,761.4800083333333,444.0116666666667,666.0175,222.00583333333336,888.0233333333334,761.4800083333333,444.0116666666667,0.0,0.0,0.0,0.0,0.0,0.2,0.7,0.1,0.0,0.0,0.0,0.0,0.0,0.0,0.0,0.0,0.0,0.0,0.0,0.0,0.0,0.0,0.0,0.0,0.0,8.326672684688674E-17,
787.69,551.383,236.307,1026.3839,0.22,0.22,0.35,0.35,1026.3839,1026.3839,165.4149,238.93263333333334,238.93263333333334,75.0,0.0,0.0,1800.0,0.0,0.0,955.7305333333334,819.5389323333334,477.8652666666667,716.7979,238.93263333333334,955.7305333333334,819.5389323333334,477.8652666666667,0.0,0.0,0.0,0.0,0.0,0.0,0.0,0.5,0.3,0.2,0.0,0.0,0.0,0.0,0.0,0.0,0.0,0.0,0.0,0.0,0.0,0.0,0.0,0.0,0.0,0.0,
787.69,551.383,236.307,1026.3839,0.22,0.22,0.35,0.35,1026.3839,1026.3839,189.0456,246.80953333333335,246.80953333333335,75.0,0.0,0.0,1800.0,0.0,0.0,987.2381333333334,846.5566993333334,493.6190666666667,740.4286000000001,246.80953333333335,987.2381333333334,846.5566993333334,493.6190666666667,0.0,0.0,0.0,0.0,0.0,0.0,0.0,0.2,0.2,0.6,0.0,0.0,0.0,0.0,0.0,0.0,0.0,0.0,0.0,0.0,0.0,0.0,0.0,0.0,0.0,1.1102230246251565E-16,
791.8299999999999,554.281,237.549,1031.7785,0.25,0.22,0.35,0.35,1031.7785,1031.7785,190.03920000000002,248.10673333333332,248.10673333333332,75.0,0.0,0.0,1800.0,0.0,0.0,992.4269333333333,851.0060953333333,496.21346666666665,744.3202,248.10673333333332,992.4269333333333,851.0060953333333,496.21346666666665,0.0,0.0,0.0,0.0,0.0,0.0,0.0,0.0,0.2,0.5,0.0,0.2,0.1,0.0,0.0,0.0,0.0,0.0,0.0,0.0,0.0,0.0,0.0,0.0,0.0,2.7755575615628914E-17,
791.8299999999999,554.281,237.549,1031.7785,0.26,0.22,0.35,0.35,1031.7785,1031.7785,403.8333,319.3714333333333,319.3714333333333,75.0,0.0,0.0,1800.0,0.0,0.0,1277.4857333333332,1095.4440163333334,638.7428666666666,958.1143,319.3714333333333,1277.4857333333332,1095.4440163333334,638.7428666666666,0.0,0.0,0.0,0.0,0.0,0.0,0.0,0.0,0.0,0.3,0.4,0.0,0.0,0.2,0.0,0.0,0.0,0.1,0.0,0.0,0.0,0.0,0.0,0.0,0.0,-8.326672684688674E-17,
796.24,557.368,238.872,1037.5248,0.26,0.22,0.35,0.35,1037.5248,1037.5248,191.09760000000003,249.48853333333338,249.48853333333338,75.0,0.0,0.0,1800.0,0.0,0.0,997.9541333333335,855.7456693333335,498.97706666666676,748.4656000000001,249.48853333333338,997.9541333333335,855.7456693333335,498.97706666666676,0.0,0.0,0.0,0.0,0.0,0.0,0.0,0.0,0.0,0.0,0.4,0.1,0.1,0.3,0.0,0.1,0.0,0.0,0.0,0.0,0.0,0.0,0.0,0.0,0.0,2.7755575615628914E-17,
796.24,557.368,238.872,1037.5248,0.26,0.22,0.35,0.35,1037.5248,1037.5248,95.54880000000001,217.63893333333337,217.63893333333337,75.0,0.0,0.0,1800.0,0.0,0.0,870.5557333333335,746.5015413333334,435.27786666666674,652.9168000000001,217.63893333333337,870.5557333333335,746.5015413333334,435.27786666666674,0.0,0.0,0.0,0.0,0.0,0.0,0.0,0.0,0.0,0.0,0.0,0.1,0.4,0.1,0.3,0.0,0.0,0.0,0.1,0.0,0.0,0.0,0.0,0.0,0.0,2.7755575615628914E-17,
800.6800000000001,560.476,240.204,1043.3103,0.26,0.22,0.35,0.35,1043.3103,1043.3103,216.1836,258.8865333333333,258.8865333333333,75.0,0.0,0.0,1800.0,0.0,0.0,1035.5461333333333,887.9808093333332,517.7730666666666,776.6596,258.8865333333333,1035.5461333333333,887.9808093333332,517.7730666666666,0.0,0.0,0.0,0.0,0.0,0.0,0.0,0.0,0.0,0.0,0.0,0.0,0.3,0.2,0.4,0.1,0.0,0.0,0.0,0.0,0.0,0.0,0.0,0.0,0.0,-8.326672684688674E-17,
800.6800000000001,560.476,240.204,1043.3103,0.25,0.22,0.31,0.35,1043.3103,1043.3103,216.1836,258.8865333333333,258.8865333333333,75.0,0.0,0.0,1800.0,0.0,0.0,1035.5461333333333,887.9808093333332,517.7730666666666,776.6596,258.8865333333333,1035.5461333333333,887.9808093333332,517.7730666666666,0.0,0.0,0.0,0.0,0.0,0.0,0.0,0.0,0.0,0.0,0.0,0.0,0.0,0.1,0.9,0.0,0.0,0.0,0.0,0.0,0.0,0.0,0.0,0.0,0.0,0.0,
803.93,562.751,241.179,1047.5452,0.22,0.27,0.31,0.35,1047.5452,1047.5452,578.8296,380.52686666666665,380.52686666666665,75.0,0.0,0.0,1800.0,0.0,0.0,1522.1074666666666,1305.2071526666666,761.0537333333333,1141.5806,380.52686666666665,1522.1074666666666,1305.2071526666666,761.0537333333333,0.0,0.0,0.0,0.0,0.0,0.0,0.0,0.0,0.0,0.0,0.0,0.0,0.0,0.0,0.8,0.1,0.0,0.1,0.0,0.0,0.0,0.0,0.0,0.0,0.0,-5.551115123125783E-17,
803.93,562.751,241.179,1047.5452,0.22,0.27,0.31,0.35,1047.5452,1047.5452,217.0611,259.93736666666666,259.93736666666666,75.0,0.0,0.0,1800.0,0.0,0.0,1039.7494666666666,891.5851676666666,519.8747333333333,779.8121,259.93736666666666,1039.7494666666666,891.5851676666666,519.8747333333333,0.0,0.0,0.0,0.0,0.0,0.0,0.0,0.0,0.0,0.0,0.0,0.0,0.0,0.0,0.0,0.6,0.2,0.1,0.1,0.0,0.0,0.0,0.0,0.0,0.0,0.0,
805.83,564.081,241.749,1050.0209,0.22,0.27,0.31,0.35,1050.0209,1050.0209,145.0494,236.3768,236.3768,75.0,0.0,0.0,1800.0,0.0,0.0,945.5072,810.772424,472.7536,709.1304,236.3768,945.5072,810.772424,472.7536,0.0,0.0,0.0,0.0,0.0,0.0,0.0,0.0,0.0,0.0,0.0,0.0,0.0,0.0,0.0,0.0,0.4,0.2,0.1,0.1,0.2,0.0,0.0,0.0,0.0,-8.326672684688674E-17,
805.83,564.081,241.749,1050.0209,0.22,0.27,0.31,0.35,1050.0209,1050.0209,169.2243,244.4351,244.4351,75.0,0.0,0.0,1800.0,0.0,0.0,977.7404,838.412393,488.8702,733.3053,244.4351,977.7404,838.412393,488.8702,0.0,0.0,0.0,0.0,0.0,0.0,0.0,0.0,0.0,0.0,0.0,0.0,0.0,0.0,0.0,0.0,0.0,0.2,0.6,0.0,0.0,0.0,0.0,0.1,0.0,0.10000000000000006,
807.7,565.39,242.31,1052.4576,0.22,0.27,0.31,0.35,1052.4576,1052.4576,436.158,333.84933333333333,333.84933333333333,75.0,0.0,0.0,1800.0,0.0,0.0,1335.3973333333333,1145.1032133333333,667.6986666666667,1001.548,333.84933333333333,1335.3973333333333,1145.1032133333333,667.6986666666667,0.0,0.0,0.0,0.0,0.0,0.0,0.0,0.0,0.0,0.0,0.0,0.0,0.0,0.0,0.0,0.0,0.0,0.0,0.9,0.1,0.0,0.0,0.0,0.0,0.0,-2.7755575615628914E-17,
807.7,565.39,242.31,1052.4576,0.22,0.27,0.31,0.35,1052.4576,1052.4576,72.69300000000001,212.69433333333333,212.69433333333333,75.0,0.0,0.0,1800.0,0.0,0.0,850.7773333333333,729.5415633333333,425.38866666666667,638.083,212.69433333333333,850.7773333333333,729.5415633333333,425.38866666666667,0.0,0.0,0.0,0.0,0.0,0.0,0.0,0.0,0.0,0.0,0.0,0.0,0.0,0.0,0.0,0.0,0.0,0.0,0.0,0.1,0.8,0.0,0.1,0.0,0.0,-2.7755575615628914E-17,
808.8199999999999,566.174,242.646,1053.917,0.3,0.27,0.31,0.35,1053.917,1053.917,461.0274,342.40046666666666,342.40046666666666,75.0,0.0,0.0,1800.0,0.0,0.0,1369.6018666666666,1174.4336006666665,684.8009333333333,1027.2014,342.40046666666666,1369.6018666666666,1174.4336006666665,684.8009333333333,0.0,0.0,0.0,0.0,0.0,0.0,0.0,0.0,0.0,0.0,0.0,0.0,0.0,0.0,0.0,0.0,0.0,0.0,0.0,0.0,0.9,0.1,0.0,0.0,0.0,-2.7755575615628914E-17,
808.8199999999999,566.174,242.646,1053.917,0.3,0.27,0.31,0.35,1053.917,1053.917,169.85219999999998,245.34206666666668,245.34206666666668,75.0,0.0,0.0,1800.0,0.0,0.0,981.3682666666667,841.5232886666666,490.68413333333336,736.0262,245.34206666666668,981.3682666666667,841.5232886666666,490.68413333333336,0.0,0.0,0.0,0.0,0.0,0.0,0.0,0.0,0.0,0.0,0.0,0.0,0.0,0.0,0.0,0.0,0.0,0.0,0.0,0.0,0.0,0.6,0.2,0.1,0.1,0.0,
809.9399999999999,566.958,242.982,1055.3764,0.3,0.27,0.31,0.35,1055.3764,1055.3764,170.0874,245.68179999999998,245.68179999999998,75.0,0.0,0.0,1800.0,0.0,0.0,982.7271999999999,842.6885739999999,491.36359999999996,737.0454,245.68179999999998,982.7271999999999,842.6885739999999,491.36359999999996,0.0,0.0,0.0,0.0,0.0,0.0,0.0,0.0,0.0,0.0,0.0,0.0,0.0,0.0,0.0,0.0,0.0,0.0,0.0,0.0,0.0,0.0,0.4,0.2,0.1,0.29999999999999993,
809.9399999999999,566.958,242.982,1055.3764,-1.0E-5,-1.0E-5,-1.0E-5,-1.0E-5,1055.3764,1055.3764,97.1928,221.3836,221.3836,75.0,0.0,0.0,1800.0,0.0,0.0,885.5344,759.345748,442.7672,664.1508,221.3836,885.5344,759.345748,442.7672,0.0,0.0,0.0,0.0,0.0,0.0,0.0,0.0,0.0,0.0,0.0,0.0,0.0,0.0,0.0,0.0,0.0,0.0,0.0,0.0,0.0,0.0,0.0,0.0,0.0,1.0,
810.6500000000001,567.455,243.195,1056.3015,-1.0E-5,-1.0E-5,-1.0E-5,-1.0E-5,1056.3015,1056.3015,170.2365,245.89716666666666,245.89716666666666,75.0,0.0,0.0,1800.0,0.0,0.0,983.5886666666667,843.4272816666667,491.7943333333333,737.6915,245.89716666666666,983.5886666666667,843.4272816666667,491.7943333333333,0.0,0.0,0.0,0.0,0.0,0.0,0.0,0.0,0.0,0.0,0.0,0.0,0.0,0.0,0.0,0.0,0.0,0.0,0.0,0.0,0.0,0.0,0.0,0.0,0.5,0.5,
810.6500000000001,567.455,243.195,1056.3015,-1.0E-5,-1.0E-5,-1.0E-5,-1.0E-5,1056.3015,1056.3015,705.2655,424.24016666666665,424.24016666666665,75.0,0.0,0.0,1800.0,0.0,0.0,1696.9606666666666,1455.1437716666665,848.4803333333333,1272.7205,424.24016666666665,1696.9606666666666,1455.1437716666665,848.4803333333333,0.0,0.0,0.0,0.0,0.0,0.0,0.0,0.0,0.0,0.0,0.0,0.0,0.0,0.0,0.0,0.0,0.0,0.0,0.0,0.0,0.0,0.0,0.0,0.0,0.0,1.0,
MAX_T, 24.0,
f_ESD, 1.0,
ESD_MAX, 1800.0,
f_TES, 1.0,
TES_MAX, 75.0,
TES_R, 1.0,
TES_D, 1.0,
ESD_R, 1.0,
ESD_D, 1.0,
MAX_DIS_TES, 75.0,
MAX_DIS_ESD, 1000.0,
DoD, 0.4,
MAX_IT, 780.0,
COP_C, 3.0,
COP_H, 4.43,
MAX_HOST, 100.0,
MAX_Relocate, 100.0,
relocateActive, 0.0,
TES_INIT, 75.0,
ESD_INIT, 1800.0,
ESD_FIN, 1800.0,
TES_FIN, 75.0,
WE, 0.0,
WF, 0.0,
WT, 0.0,
WL, 0.0,
WREN, 1.0,
E_D_Percentage, 0.1


