E_Total, Real_Time_Workload, Delay_Tolerant_Workload, REN, Energy_Price, L_Price, T_Price, D_Price, DR_Signal, Baseline, Delay_Tolerant_Executed, Total Cooling, IT Cooling, TES, D_TES, R_TES, ESD, D_ESD, R_ESD, DC Demand, DC Thermal Generation(Adapted Heat), Adapted CO2, Adapted Server, Adapted Cooling, Adapted DC, Baseline Heat, Baseline CO2,  Relocated, Hosted, Y
676.7167,609.045,67.6717,0.0,0.1,0.105,0.1,0.1,788.5707,788.5707,67.6717,36.854,111.854,75.0,75.0,0.0,1800.0,0.0,0.0,713.5707,0.0,356.78535,676.7167,36.854,713.5707,383.65921999999995,394.28535,0.0,0.0,1.0,0.0,0.0,0.0,0.0,0.0,0.0,0.0,0.0,0.0,0.0,0.0,0.0,0.0,0.0,0.0,0.0,0.0,0.0,0.0,0.0,0.0,0.0,0.0,
665.6170999999999,599.0554,66.5617,0.0,0.1,0.105,0.1,0.1,775.6365,775.6365,13.31234,138.7178082644628,101.2178082644628,0.0,0.0,37.5,1800.0,0.0,0.0,751.0855482644627,520.765623520661,375.54277413223133,612.3677399999999,138.7178082644628,751.0855482644627,347.1770823471074,356.79277413223133,0.0,0.0,0.0,0.2,0.2,0.1,0.1,0.1,0.1,0.0,0.0,0.0,0.1,0.1,0.0,0.0,0.0,0.0,0.0,0.0,0.0,0.0,0.0,0.0,0.0,1.3877787807814457E-16,
664.1621,597.7459,66.4162,0.0,0.1,0.105,0.1,0.1,773.941,773.941,19.924860000000002,139.59434049586775,102.09434049586777,37.5,0.0,37.5,1800.0,0.0,0.0,757.2651004958677,525.2753818512397,378.63255024793386,617.67076,139.59434049586775,757.2651004958677,350.1835879008264,359.88255024793386,0.0,0.0,0.0,0.0,0.1,0.2,0.1,0.2,0.0,0.0,0.2,0.2,0.0,0.0,0.0,0.0,0.0,0.0,0.0,0.0,0.0,0.0,0.0,0.0,0.0,-5.551115123125783E-17,
667.9416,601.1474,66.7942,0.0,0.1,0.105,0.1,0.1,778.3451,778.3451,40.07652,105.98742479338841,105.98742479338841,75.0,0.0,0.0,1800.0,0.0,0.0,747.2113447933883,363.53686704132224,373.60567239669416,641.2239199999999,105.98742479338841,747.2113447933883,363.53686704132224,373.60567239669416,0.0,0.0,0.0,0.0,0.0,0.3,0.3,0.1,0.0,0.2,0.0,0.0,0.0,0.0,0.0,0.0,0.1,0.0,0.0,0.0,0.0,0.0,0.0,0.0,0.0,-8.326672684688674E-17,
662.394,596.1546,66.2394,0.0,0.1,0.105,0.1,0.1,771.8806,771.8806,39.74364,105.10714710743802,105.10714710743802,75.0,0.0,0.0,1800.0,0.0,0.0,741.005387107438,360.51751457851236,370.502693553719,635.89824,105.10714710743802,741.005387107438,360.51751457851236,370.502693553719,0.0,0.0,0.0,0.0,0.0,0.0,0.1,0.0,0.2,0.2,0.1,0.2,0.1,0.1,0.0,0.0,0.0,0.0,0.0,0.0,0.0,0.0,0.0,0.0,0.0,-1.1102230246251565E-16,
665.0781,598.5703,66.5078,0.0,0.1,0.105,0.1,0.1,775.0084,775.0084,39.904680000000006,105.53305454545455,105.53305454545455,75.0,0.0,0.0,1800.0,0.0,0.0,744.0080345454545,361.9783770909091,372.00401727272725,638.47498,105.53305454545455,744.0080345454545,361.9783770909091,372.00401727272725,0.0,0.0,0.0,0.0,0.0,0.0,0.0,0.2,0.0,0.0,0.3,0.4,0.0,0.0,0.0,0.1,0.0,0.0,0.0,0.0,0.0,0.0,0.0,0.0,0.0,-2.7755575615628914E-17,
666.8246,600.1421,66.6825,0.0,0.1,0.105,0.1,0.1,777.0435,777.0435,33.34125,104.70799173553719,104.70799173553719,75.0,0.0,0.0,1800.0,0.0,0.0,738.1913417355372,359.14841165289255,369.0956708677686,633.48335,104.70799173553719,738.1913417355372,359.14841165289255,369.0956708677686,0.0,0.0,0.0,0.0,0.0,0.0,0.0,0.0,0.2,0.1,0.1,0.2,0.2,0.1,0.0,0.1,0.0,0.0,0.0,0.0,0.0,0.0,0.0,0.0,0.0,5.551115123125783E-17,
671.4008,604.2607,67.1401,0.0,0.1,0.105,0.1,0.1,782.3762,782.3762,40.284060000000004,106.53632396694215,106.53632396694215,75.0,0.0,0.0,1800.0,0.0,0.0,751.0810839669422,365.4195912066115,375.5405419834711,644.54476,106.53632396694215,751.0810839669422,365.4195912066115,375.5405419834711,0.0,0.0,0.0,0.0,0.0,0.0,0.0,0.0,0.0,0.1,0.4,0.0,0.1,0.2,0.0,0.1,0.1,0.0,0.0,0.0,0.0,0.0,0.0,0.0,0.0,0.0,
700.3317,630.2985,70.0332,0.0,0.1,0.105,0.1,0.347,870.0,816.089,98.04647999999999,120.38759999999999,120.38759999999999,75.0,0.0,0.0,1800.0,0.0,0.0,848.73258,412.929468,424.36629,728.34498,120.38759999999999,848.73258,412.929468,424.36629,0.0,0.0,0.0,0.0,0.0,0.0,0.0,0.0,0.0,0.0,0.3,0.3,0.1,0.1,0.1,0.0,0.1,0.0,0.0,0.0,0.0,0.0,0.0,0.0,0.0,-8.326672684688674E-17,
690.8752,621.7877,69.0875,0.0,0.1,0.105,0.1,0.347,870.0,805.0695,103.63125,119.90395867768595,119.90395867768595,75.0,0.0,0.0,1800.0,0.0,0.0,845.322908677686,411.2705782644628,422.661454338843,725.41895,119.90395867768595,845.322908677686,411.2705782644628,422.661454338843,0.0,0.0,0.0,0.0,0.0,0.0,0.0,0.0,0.0,0.0,0.0,0.2,0.6,0.1,0.0,0.0,0.1,0.0,0.0,0.0,0.0,0.0,0.0,0.0,0.0,5.551115123125783E-17,
692.1043000000001,622.8939,69.2104,0.0,0.1,0.105,0.1,0.347,870.0,806.5018,110.73664000000002,121.26124628099176,121.26124628099176,75.0,0.0,0.0,1800.0,0.0,0.0,854.8917862809918,415.9260747438017,427.4458931404959,733.6305400000001,121.26124628099176,854.8917862809918,415.9260747438017,427.4458931404959,0.0,0.0,0.0,0.0,0.0,0.0,0.0,0.0,0.0,0.0,0.0,0.0,0.4,0.3,0.2,0.1,0.0,0.0,0.0,0.0,0.0,0.0,0.0,0.0,0.0,-2.7755575615628914E-17,
687.092,618.3828,68.7092,0.0,0.1,0.105,0.1,0.347,870.0,800.661,109.93472,120.38306115702478,120.38306115702478,75.0,0.0,0.0,1800.0,0.0,0.0,848.7005811570248,412.913899768595,424.3502905785124,728.31752,120.38306115702478,848.7005811570248,412.913899768595,424.3502905785124,0.0,0.0,0.0,0.0,0.0,0.0,0.0,0.0,0.0,0.0,0.0,0.0,0.0,0.6,0.3,0.0,0.1,0.0,0.0,0.0,0.0,0.0,0.0,0.0,0.0,2.7755575615628914E-17,
687.2014,618.4813,68.7201,0.0,0.1,0.105,0.1,0.347,870.0,800.7885,103.08015,119.26635537190083,119.26635537190083,75.0,0.0,0.0,1800.0,0.0,0.0,840.8278053719009,409.0835989256198,420.41390268595046,721.56145,119.26635537190083,840.8278053719009,409.0835989256198,420.41390268595046,0.0,0.0,0.0,0.0,0.0,0.0,0.0,0.0,0.0,0.0,0.0,0.0,0.0,0.0,0.9,0.1,0.0,0.0,0.0,0.0,0.0,0.0,0.0,0.0,0.0,-2.7755575615628914E-17,
698.905,629.0145,69.8905,0.0,0.1,0.105,0.1,0.347,870.0,814.4264,97.8467,120.14234710743803,120.14234710743803,75.0,0.0,0.0,1800.0,0.0,0.0,847.0035471074381,412.08825057851243,423.50177355371903,726.8612,120.14234710743803,847.0035471074381,412.08825057851243,423.50177355371903,0.0,0.0,0.0,0.0,0.0,0.0,0.0,0.0,0.0,0.0,0.0,0.0,0.0,0.0,0.0,0.9,0.1,0.0,0.0,0.0,0.0,0.0,0.0,0.0,0.0,-2.7755575615628914E-17,
685.1357,616.6221,68.5136,0.0,0.1,0.105,0.1,0.347,870.0,798.3813,109.62176,120.04030743801654,120.04030743801654,75.0,0.0,0.0,1800.0,0.0,0.0,846.2841674380165,411.7382545123967,423.14208371900827,726.24386,120.04030743801654,846.2841674380165,411.7382545123967,423.14208371900827,0.0,0.0,0.0,0.0,0.0,0.0,0.0,0.0,0.0,0.0,0.0,0.0,0.0,0.0,0.0,0.0,1.0,0.0,0.0,0.0,0.0,0.0,0.0,0.0,0.0,0.0,
675.7779,608.2001,67.5778,0.0,0.1,0.105,0.1,0.1,787.4767,787.4767,54.06224,109.46484958677686,109.46484958677686,75.0,0.0,0.0,1800.0,0.0,0.0,771.7271895867768,375.46443408264463,385.8635947933884,662.26234,109.46484958677686,771.7271895867768,375.46443408264463,385.8635947933884,0.0,0.0,0.0,0.0,0.0,0.0,0.0,0.0,0.0,0.0,0.0,0.0,0.0,0.0,0.0,0.0,0.0,0.8,0.2,0.0,0.0,0.0,0.0,0.0,0.0,-5.551115123125783E-17,
721.2163,649.0947,72.1216,0.0,0.1,0.105,0.1,0.1,840.4257,840.4257,79.33376000000001,120.40139834710743,120.40139834710743,75.0,0.0,0.0,1800.0,0.0,0.0,848.8298583471073,412.97679633057845,424.4149291735537,728.42846,120.40139834710743,848.8298583471073,412.97679633057845,424.4149291735537,0.0,0.0,0.0,0.0,0.0,0.0,0.0,0.0,0.0,0.0,0.0,0.0,0.0,0.0,0.0,0.0,0.0,0.0,0.9,0.0,0.1,0.0,0.0,0.0,0.0,-2.7755575615628914E-17,
677.6048999999999,609.8444,67.7605,0.0,0.1,0.105,0.1,0.1,789.6056,789.6056,67.7605,112.00080991735537,112.00080991735537,75.0,0.0,0.0,1800.0,0.0,0.0,789.6057099173553,384.1627780165289,394.80285495867764,677.6048999999999,112.00080991735537,789.6057099173553,384.1627780165289,394.80285495867764,0.0,0.0,0.0,0.0,0.0,0.0,0.0,0.0,0.0,0.0,0.0,0.0,0.0,0.0,0.0,0.0,0.0,0.0,0.0,1.0,0.0,0.0,0.0,0.0,0.0,0.0,
669.6,602.64,66.96,0.0,0.1,0.105,0.1,0.1,780.2776,780.2776,66.96,110.67768595041323,110.67768595041323,75.0,0.0,0.0,1800.0,0.0,0.0,780.2776859504132,379.62446280991736,390.1388429752066,669.6,110.67768595041323,780.2776859504132,379.62446280991736,390.1388429752066,0.0,0.0,0.0,0.0,0.0,0.0,0.0,0.0,0.0,0.0,0.0,0.0,0.0,0.0,0.0,0.0,0.0,0.0,0.0,0.0,0.9,0.1,0.0,0.0,0.0,-2.7755575615628914E-17,
707.2260000000001,636.5034,70.7226,0.0,0.1,0.105,0.1,0.1,824.1228,824.1228,63.65034,115.72789090909093,115.72789090909093,75.0,0.0,0.0,1800.0,0.0,0.0,815.881630909091,396.9466658181818,407.9408154545455,700.1537400000001,115.72789090909093,815.881630909091,396.9466658181818,407.9408154545455,0.0,0.0,0.0,0.0,0.0,0.0,0.0,0.0,0.0,0.0,0.0,0.0,0.0,0.0,0.0,0.0,0.0,0.0,0.0,0.0,0.0,0.8,0.0,0.1,0.1,-5.551115123125783E-17,
714.5552,643.0997,71.4555,0.0,0.1,0.105,0.1,0.1,832.6636,832.6636,71.4555,118.10829752066117,118.10829752066117,75.0,0.0,0.0,1800.0,0.0,0.0,832.6634975206612,405.11146049586773,416.3317487603306,714.5552,118.10829752066117,832.6634975206612,405.11146049586773,416.3317487603306,0.0,0.0,0.0,0.0,0.0,0.0,0.0,0.0,0.0,0.0,0.0,0.0,0.0,0.0,0.0,0.0,0.0,0.0,0.0,0.0,0.0,0.0,1.0,0.0,0.0,0.0,
669.5912000000001,602.6321,66.9591,0.0,0.1,0.105,0.1,0.1,780.2675,780.2675,66.9591,110.6762314049587,110.6762314049587,75.0,0.0,0.0,1800.0,0.0,0.0,780.2674314049588,379.6194737190083,390.1337157024794,669.5912000000001,110.6762314049587,780.2674314049588,379.6194737190083,390.1337157024794,0.0,0.0,0.0,0.0,0.0,0.0,0.0,0.0,0.0,0.0,0.0,0.0,0.0,0.0,0.0,0.0,0.0,0.0,0.0,0.0,0.0,0.0,0.0,0.9,0.1,-2.7755575615628914E-17,
700.7854,630.7069,70.0785,0.0,0.1,0.105,0.1,0.1,816.6178,816.6178,77.08635000000001,116.99061983471076,116.99061983471076,75.0,0.0,0.0,1800.0,0.0,0.0,824.7838698347108,401.27782603305786,412.3919349173554,707.7932500000001,116.99061983471076,824.7838698347108,401.27782603305786,412.3919349173554,0.0,0.0,0.0,0.0,0.0,0.0,0.0,0.0,0.0,0.0,0.0,0.0,0.0,0.0,0.0,0.0,0.0,0.0,0.0,0.0,0.0,0.0,0.0,0.0,0.9,0.09999999999999998,
695.6734,626.1061,69.5673,0.0,0.1,0.105,0.1,0.1,810.6608,810.6608,76.52402999999998,116.13721157024794,116.13721157024794,75.0,0.0,0.0,1800.0,0.0,0.0,818.7673415702479,398.3506356859504,409.38367078512397,702.63013,116.13721157024794,818.7673415702479,398.3506356859504,409.38367078512397,0.0,0.0,0.0,0.0,0.0,0.0,0.0,0.0,0.0,0.0,0.0,0.0,0.0,0.0,0.0,0.0,0.0,0.0,0.0,0.0,0.0,0.0,0.0,0.0,0.0,1.0,
MAX_T, 24.0,
f_ESD, 1.0,
ESD_MAX, 1800.0,
f_TES, 1.0,
TES_MAX, 75.0,
TES_R, 1.0,
TES_D, 1.0,
ESD_R, 1.0,
ESD_D, 1.0,
MAX_DIS_TES, 75.0,
MAX_DIS_ESD, 1000.0,
DoD, 0.4,
MAX_IT, 780.0,
COP_C, 6.05,
COP_H, 4.43,
MAX_HOST, 100.0,
MAX_Relocate, 100.0,
relocateActive, 0.0,
TES_INIT, 75.0,
ESD_INIT, 1800.0,
ESD_FIN, 1800.0,
TES_FIN, 75.0,
WE, 0.0,
WF, 1.0,
WT, 0.0,
WL, 0.0,
WREN, 0.0,
E_D_Percentage, 0.1


