2021-09-03T18:00:00.000Z,
SellEnergy,ShiftDelayTolerantWorkload,WorkloadRelocation,WorkloadHosting,
2021-09-03T20:00:00.000Z,
SellEnergy,ShiftDelayTolerantWorkload,WorkloadRelocation,WorkloadHosting,
2021-09-03T10:00:00.000Z,
SellEnergy,WorkloadRelocation,WorkloadHosting,
2021-09-03T12:00:00.000Z,
SellEnergy,WorkloadRelocation,WorkloadHosting,
2021-09-03T03:00:00.000Z,
SellEnergy,WorkloadRelocation,WorkloadHosting,
2021-09-03T05:00:00.000Z,
BuyEnergy,DynamicAdjustmentOfCoolingIntensity,WorkloadRelocation,WorkloadHosting,
2021-09-03T19:00:00.000Z,
BuyEnergy,DynamicAdjustmentOfCoolingIntensity,ShiftDelayTolerantWorkload,WorkloadRelocation,WorkloadHosting,
2021-09-03T21:00:00.000Z,
BuyEnergy,DynamicAdjustmentOfCoolingIntensity,ShiftDelayTolerantWorkload,WorkloadRelocation,WorkloadHosting,
2021-09-03T02:00:00.000Z,
SellEnergy,WorkloadRelocation,WorkloadHosting,
2021-09-03T04:00:00.000Z,
SellEnergy,WorkloadRelocation,WorkloadHosting,
2021-09-03T13:00:00.000Z,
BuyEnergy,DynamicAdjustmentOfCoolingIntensity,ShiftDelayTolerantWorkload,WorkloadRelocation,WorkloadHosting,
2021-09-03T11:00:00.000Z,
BuyEnergy,DynamicAdjustmentOfCoolingIntensity,WorkloadRelocation,WorkloadHosting,
2021-09-03T22:00:00.000Z,
BuyEnergy,DynamicAdjustmentOfCoolingIntensity,WorkloadRelocation,WorkloadHosting,
2021-09-03T06:00:00.000Z,
SellEnergy,WorkloadRelocation,WorkloadHosting,
2021-09-03T08:00:00.000Z,
SellEnergy,WorkloadRelocation,WorkloadHosting,
2021-09-03T14:00:00.000Z,
SellEnergy,ShiftDelayTolerantWorkload,WorkloadRelocation,WorkloadHosting,
2021-09-03T16:00:00.000Z,
BuyEnergy,DynamicAdjustmentOfCoolingIntensity,ShiftDelayTolerantWorkload,WorkloadRelocation,WorkloadHosting,
2021-09-03T01:00:00.000Z,
BuyEnergy,DynamicAdjustmentOfCoolingIntensity,WorkloadRelocation,WorkloadHosting,
2021-09-03T00:00:00.000Z,
BuyEnergy,DynamicAdjustmentOfCoolingIntensity,ShiftDelayTolerantWorkload,WorkloadRelocation,WorkloadHosting,
2021-09-03T15:00:00.000Z,
BuyEnergy,DynamicAdjustmentOfCoolingIntensity,ShiftDelayTolerantWorkload,WorkloadRelocation,WorkloadHosting,
2021-09-03T23:00:00.000Z,
SellEnergy,WorkloadRelocation,WorkloadHosting,
2021-09-03T07:00:00.000Z,
BuyEnergy,DynamicAdjustmentOfCoolingIntensity,WorkloadRelocation,WorkloadHosting,
2021-09-03T09:00:00.000Z,
SellEnergy,WorkloadRelocation,WorkloadHosting,
2021-09-03T17:00:00.000Z,
SellEnergy,WorkloadRelocation,WorkloadHosting,
2021-09-03T18:00:00.000Z,

2021-09-03T20:00:00.000Z,

2021-09-03T10:00:00.000Z,

2021-09-03T12:00:00.000Z,

2021-09-03T03:00:00.000Z,

2021-09-03T05:00:00.000Z,

2021-09-03T19:00:00.000Z,

2021-09-03T21:00:00.000Z,

2021-09-03T02:00:00.000Z,

2021-09-03T04:00:00.000Z,

2021-09-03T13:00:00.000Z,

2021-09-03T11:00:00.000Z,

2021-09-03T22:00:00.000Z,

2021-09-03T06:00:00.000Z,

2021-09-03T08:00:00.000Z,

2021-09-03T14:00:00.000Z,

2021-09-03T16:00:00.000Z,

2021-09-03T01:00:00.000Z,

2021-09-03T00:00:00.000Z,

2021-09-03T15:00:00.000Z,

2021-09-03T23:00:00.000Z,

2021-09-03T07:00:00.000Z,

2021-09-03T09:00:00.000Z,

2021-09-03T17:00:00.000Z,


