2021-09-07T06:00:00.000Z,
BuyEnergy,DischargeBattery,DynamicAdjustmentOfCoolingIntensity,ShiftDelayTolerantWorkload,ShiftDelayTolerantWorkload,ShiftDelayTolerantWorkload,ShiftDelayTolerantWorkload,ShiftDelayTolerantWorkload,ShiftDelayTolerantWorkload,WorkloadRelocation,WorkloadHosting,
2021-09-07T08:00:00.000Z,
BuyEnergy,ChargeBattery,DynamicAdjustmentOfCoolingIntensity,ShiftDelayTolerantWorkload,ShiftDelayTolerantWorkload,ShiftDelayTolerantWorkload,ShiftDelayTolerantWorkload,WorkloadRelocation,WorkloadHosting,
2021-09-07T14:00:00.000Z,
BuyEnergy,DynamicAdjustmentOfCoolingIntensity,ShiftDelayTolerantWorkload,WorkloadRelocation,WorkloadHosting,
2021-09-07T16:00:00.000Z,
BuyEnergy,DynamicAdjustmentOfCoolingIntensity,ShiftDelayTolerantWorkload,WorkloadRelocation,WorkloadHosting,
2021-09-07T00:00:00.000Z,
BuyEnergy,DischargeBattery,DynamicAdjustmentOfCoolingIntensity,ShiftDelayTolerantWorkload,ShiftDelayTolerantWorkload,ShiftDelayTolerantWorkload,ShiftDelayTolerantWorkload,ShiftDelayTolerantWorkload,WorkloadRelocation,WorkloadHosting,
2021-09-07T15:00:00.000Z,
BuyEnergy,DynamicAdjustmentOfCoolingIntensity,ShiftDelayTolerantWorkload,WorkloadRelocation,WorkloadHosting,
2021-09-07T23:00:00.000Z,
BuyEnergy,DynamicAdjustmentOfCoolingIntensity,ShiftDelayTolerantWorkload,WorkloadRelocation,WorkloadHosting,
2021-09-07T22:00:00.000Z,
BuyEnergy,DynamicAdjustmentOfCoolingIntensity,ShiftDelayTolerantWorkload,ShiftDelayTolerantWorkload,WorkloadRelocation,WorkloadHosting,
2021-09-07T07:00:00.000Z,
BuyEnergy,ChargeBattery,DynamicAdjustmentOfCoolingIntensity,ShiftDelayTolerantWorkload,ShiftDelayTolerantWorkload,ShiftDelayTolerantWorkload,ShiftDelayTolerantWorkload,WorkloadRelocation,WorkloadHosting,
2021-09-07T09:00:00.000Z,
BuyEnergy,ChargeBattery,DynamicAdjustmentOfCoolingIntensity,ShiftDelayTolerantWorkload,ShiftDelayTolerantWorkload,WorkloadRelocation,WorkloadHosting,
2021-09-07T17:00:00.000Z,
BuyEnergy,DynamicAdjustmentOfCoolingIntensity,ShiftDelayTolerantWorkload,ShiftDelayTolerantWorkload,ShiftDelayTolerantWorkload,ShiftDelayTolerantWorkload,WorkloadRelocation,WorkloadHosting,
2021-09-07T01:00:00.000Z,
BuyEnergy,DischargeBattery,DynamicAdjustmentOfCoolingIntensity,ShiftDelayTolerantWorkload,ShiftDelayTolerantWorkload,ShiftDelayTolerantWorkload,ShiftDelayTolerantWorkload,ShiftDelayTolerantWorkload,ShiftDelayTolerantWorkload,WorkloadRelocation,WorkloadHosting,
2021-09-07T10:00:00.000Z,
BuyEnergy,ChargeBattery,DynamicAdjustmentOfCoolingIntensity,ShiftDelayTolerantWorkload,ShiftDelayTolerantWorkload,ShiftDelayTolerantWorkload,WorkloadRelocation,WorkloadHosting,
2021-09-07T12:00:00.000Z,
BuyEnergy,ChargeBattery,DynamicAdjustmentOfCoolingIntensity,ShiftDelayTolerantWorkload,WorkloadRelocation,WorkloadHosting,
2021-09-07T19:00:00.000Z,
BuyEnergy,DynamicAdjustmentOfCoolingIntensity,ShiftDelayTolerantWorkload,ShiftDelayTolerantWorkload,ShiftDelayTolerantWorkload,ShiftDelayTolerantWorkload,WorkloadRelocation,WorkloadHosting,
2021-09-07T21:00:00.000Z,
BuyEnergy,DynamicAdjustmentOfCoolingIntensity,ShiftDelayTolerantWorkload,ShiftDelayTolerantWorkload,ShiftDelayTolerantWorkload,WorkloadRelocation,WorkloadHosting,
2021-09-07T02:00:00.000Z,
BuyEnergy,DischargeBattery,DynamicAdjustmentOfCoolingIntensity,ShiftDelayTolerantWorkload,ShiftDelayTolerantWorkload,ShiftDelayTolerantWorkload,ShiftDelayTolerantWorkload,WorkloadRelocation,WorkloadHosting,
2021-09-07T04:00:00.000Z,
BuyEnergy,DischargeBattery,DynamicAdjustmentOfCoolingIntensity,ShiftDelayTolerantWorkload,ShiftDelayTolerantWorkload,ShiftDelayTolerantWorkload,ShiftDelayTolerantWorkload,ShiftDelayTolerantWorkload,WorkloadRelocation,WorkloadHosting,
2021-09-07T18:00:00.000Z,
BuyEnergy,DynamicAdjustmentOfCoolingIntensity,ShiftDelayTolerantWorkload,ShiftDelayTolerantWorkload,ShiftDelayTolerantWorkload,ShiftDelayTolerantWorkload,WorkloadRelocation,WorkloadHosting,
2021-09-07T20:00:00.000Z,
BuyEnergy,DynamicAdjustmentOfCoolingIntensity,ShiftDelayTolerantWorkload,ShiftDelayTolerantWorkload,WorkloadRelocation,WorkloadHosting,
2021-09-07T13:00:00.000Z,
BuyEnergy,ChargeBattery,DynamicAdjustmentOfCoolingIntensity,ShiftDelayTolerantWorkload,WorkloadRelocation,WorkloadHosting,
2021-09-07T11:00:00.000Z,
BuyEnergy,ChargeBattery,DynamicAdjustmentOfCoolingIntensity,ShiftDelayTolerantWorkload,ShiftDelayTolerantWorkload,WorkloadRelocation,WorkloadHosting,
2021-09-07T03:00:00.000Z,
BuyEnergy,DischargeBattery,DynamicAdjustmentOfCoolingIntensity,ShiftDelayTolerantWorkload,ShiftDelayTolerantWorkload,ShiftDelayTolerantWorkload,WorkloadRelocation,WorkloadHosting,
2021-09-07T05:00:00.000Z,
BuyEnergy,DischargeBattery,DynamicAdjustmentOfCoolingIntensity,ShiftDelayTolerantWorkload,ShiftDelayTolerantWorkload,ShiftDelayTolerantWorkload,WorkloadRelocation,WorkloadHosting,
2021-09-07T06:00:00.000Z,

2021-09-07T08:00:00.000Z,

2021-09-07T14:00:00.000Z,

2021-09-07T16:00:00.000Z,

2021-09-07T00:00:00.000Z,

2021-09-07T15:00:00.000Z,

2021-09-07T23:00:00.000Z,

2021-09-07T22:00:00.000Z,

2021-09-07T07:00:00.000Z,

2021-09-07T09:00:00.000Z,

2021-09-07T17:00:00.000Z,

2021-09-07T01:00:00.000Z,

2021-09-07T10:00:00.000Z,

2021-09-07T12:00:00.000Z,

2021-09-07T19:00:00.000Z,

2021-09-07T21:00:00.000Z,

2021-09-07T02:00:00.000Z,

2021-09-07T04:00:00.000Z,

2021-09-07T18:00:00.000Z,

2021-09-07T20:00:00.000Z,

2021-09-07T13:00:00.000Z,

2021-09-07T11:00:00.000Z,

2021-09-07T03:00:00.000Z,

2021-09-07T05:00:00.000Z,


