2020-09-21T03:00:00.000Z,
BuyEnergy,SellFlexibility,DynamicAdjustmentOfCoolingIntensity,WorkloadRelocation,WorkloadHosting,
2020-09-21T11:00:00.000Z,
BuyEnergy,SellFlexibility,DynamicAdjustmentOfCoolingIntensity,WorkloadRelocation,WorkloadHosting,
2020-09-21T13:00:00.000Z,
BuyEnergy,SellFlexibility,DynamicAdjustmentOfCoolingIntensity,WorkloadRelocation,WorkloadHosting,
2020-09-21T05:00:00.000Z,
BuyEnergy,SellFlexibility,DischargeTes,DynamicAdjustmentOfCoolingIntensity,WorkloadRelocation,WorkloadHosting,
2020-09-21T10:00:00.000Z,
BuyEnergy,SellFlexibility,ChargeTes,DynamicAdjustmentOfCoolingIntensity,WorkloadRelocation,WorkloadHosting,
2020-09-21T12:00:00.000Z,
BuyEnergy,SellFlexibility,DynamicAdjustmentOfCoolingIntensity,WorkloadRelocation,WorkloadHosting,
2020-09-21T21:00:00.000Z,
BuyEnergy,SellFlexibility,DynamicAdjustmentOfCoolingIntensity,WorkloadRelocation,WorkloadHosting,
2020-09-21T02:00:00.000Z,
BuyEnergy,SellFlexibility,DynamicAdjustmentOfCoolingIntensity,WorkloadRelocation,WorkloadHosting,
2020-09-21T04:00:00.000Z,
BuyEnergy,SellFlexibility,DynamicAdjustmentOfCoolingIntensity,WorkloadRelocation,WorkloadHosting,
2020-09-21T19:00:00.000Z,
BuyEnergy,SellFlexibility,DynamicAdjustmentOfCoolingIntensity,WorkloadRelocation,WorkloadHosting,
2020-09-21T16:00:00.000Z,
BuyEnergy,SellFlexibility,DynamicAdjustmentOfCoolingIntensity,WorkloadRelocation,WorkloadHosting,
2020-09-21T22:00:00.000Z,
BuyEnergy,SellFlexibility,DynamicAdjustmentOfCoolingIntensity,WorkloadRelocation,WorkloadHosting,
2020-09-21T07:00:00.000Z,
BuyEnergy,SellFlexibility,DischargeTes,DynamicAdjustmentOfCoolingIntensity,WorkloadRelocation,WorkloadHosting,
2020-09-21T09:00:00.000Z,
BuyEnergy,SellFlexibility,ChargeTes,DynamicAdjustmentOfCoolingIntensity,WorkloadRelocation,WorkloadHosting,
2020-09-21T01:00:00.000Z,
BuyEnergy,SellFlexibility,DynamicAdjustmentOfCoolingIntensity,WorkloadRelocation,WorkloadHosting,
2020-09-21T06:00:00.000Z,
BuyEnergy,SellFlexibility,DischargeTes,DynamicAdjustmentOfCoolingIntensity,WorkloadRelocation,WorkloadHosting,
2020-09-21T08:00:00.000Z,
BuyEnergy,SellFlexibility,ChargeTes,DynamicAdjustmentOfCoolingIntensity,WorkloadRelocation,WorkloadHosting,
2020-09-21T14:00:00.000Z,
BuyEnergy,SellFlexibility,DynamicAdjustmentOfCoolingIntensity,WorkloadRelocation,WorkloadHosting,
2020-09-21T15:00:00.000Z,
BuyEnergy,SellFlexibility,DynamicAdjustmentOfCoolingIntensity,WorkloadRelocation,WorkloadHosting,
2020-09-21T17:00:00.000Z,
BuyEnergy,SellFlexibility,DynamicAdjustmentOfCoolingIntensity,WorkloadRelocation,WorkloadHosting,
2020-09-21T00:00:00.000Z,
BuyEnergy,SellFlexibility,DynamicAdjustmentOfCoolingIntensity,WorkloadRelocation,WorkloadHosting,
2020-09-21T23:00:00.000Z,
BuyEnergy,SellFlexibility,DynamicAdjustmentOfCoolingIntensity,WorkloadRelocation,WorkloadHosting,
2020-09-21T18:00:00.000Z,
BuyEnergy,SellFlexibility,DynamicAdjustmentOfCoolingIntensity,WorkloadRelocation,WorkloadHosting,
2020-09-21T20:00:00.000Z,
BuyEnergy,SellFlexibility,DynamicAdjustmentOfCoolingIntensity,WorkloadRelocation,WorkloadHosting,
2020-09-21T03:00:00.000Z,

2020-09-21T11:00:00.000Z,

2020-09-21T13:00:00.000Z,

2020-09-21T05:00:00.000Z,

2020-09-21T10:00:00.000Z,

2020-09-21T12:00:00.000Z,

2020-09-21T21:00:00.000Z,

2020-09-21T02:00:00.000Z,

2020-09-21T04:00:00.000Z,

2020-09-21T19:00:00.000Z,

2020-09-21T16:00:00.000Z,

2020-09-21T22:00:00.000Z,

2020-09-21T07:00:00.000Z,

2020-09-21T09:00:00.000Z,

2020-09-21T01:00:00.000Z,

2020-09-21T06:00:00.000Z,

2020-09-21T08:00:00.000Z,

2020-09-21T14:00:00.000Z,

2020-09-21T15:00:00.000Z,

2020-09-21T17:00:00.000Z,

2020-09-21T00:00:00.000Z,

2020-09-21T23:00:00.000Z,

2020-09-21T18:00:00.000Z,

2020-09-21T20:00:00.000Z,


