﻿Energy Value,,,
1024.077576,,,
1021.510606,,,
1020.39,,,
1019.725455,,,
1020.989394,,,
1026.383939,,,
1031.778485,,,
1037.524848,,,
1043.310303,,,
1047.545152,,,
1050.020909,,,
1052.457576,,,
1053.91697,,,
1055.376364,,,
1056.301515,,,
1056.900909,,,
1057.343939,,,
1057.161515,,,
1056.979091,,,
1057.565455,,,
1058.412424,,,
1060.171515,,,
1063.715758,,,
1067.26,,,
