﻿Energy Value,,,,,,
235.776,,,,,,
235.185,,,,,,
234.927,,,,,,
234.774,,,,,,
235.065,,,,,,
236.307,,,,,,
237.549,,,,,,
238.872,,,,,,
240.204,,,,,,
241.179,,,,,,
241.749,,,,,,
242.31,,,,,,
242.646,,,,,,
242.982,,,,,,
243.195,,,,,,
243.333,,,,,,
243.435,,,,,,
243.393,,,,,,
243.351,,,,,,
243.486,,,,,,
243.681,,,,,,
244.086,,,,,,
244.902,,,,,,
245.718,,,,,,
