E_Total, Real_Time_Workload, Delay_Tolerant_Workload, REN, Energy_Price, L_Price, T_Price, D_Price, DR_Signal, Baseline, Delay_Tolerant_Executed, Total Cooling, IT Cooling, TES, D_TES, R_TES, ESD, D_ESD, R_ESD, DC Demand, DC Thermal Generation(Adapted Heat), Adapted CO2, Adapted Server, Adapted Cooling, Adapted DC, Baseline Heat, Baseline CO2,  Relocated, Hosted, Y
209.19,209.19,0.0,0.0,0.22,0.28,0.23,0.35,243.7669,243.7669,0.0,47.00898876404494,47.00898876404494,75.0,0.0,0.0,0.0,0.0,0.0,256.19898876404494,161.24083146067414,128.09949438202247,209.19,47.00898876404494,256.19898876404494,161.24083146067414,128.09949438202247,0.0,0.0,1.0,0.0,0.0,0.0,0.0,0.0,0.0,0.0,0.0,0.0,0.0,0.0,0.0,0.0,0.0,0.0,0.0,0.0,0.0,0.0,0.0,0.0,0.0,0.0,
209.68,209.68,0.0,0.0,0.22,0.28,0.23,0.35,244.3379,244.3379,0.0,47.119101123595506,47.119101123595506,75.0,0.0,0.0,0.0,0.0,0.0,256.7991011235955,161.61851685393256,128.39955056179775,209.68,47.119101123595506,256.7991011235955,161.61851685393256,128.39955056179775,0.0,0.0,0.0,1.0,0.0,0.0,0.0,0.0,0.0,0.0,0.0,0.0,0.0,0.0,0.0,0.0,0.0,0.0,0.0,0.0,0.0,0.0,0.0,0.0,0.0,0.0,
210.12,210.12,0.0,0.0,0.22,0.28,0.23,0.35,244.8506,244.8506,0.0,47.21797752808989,47.21797752808989,75.0,0.0,0.0,0.0,0.0,0.0,257.3379775280899,161.95766292134832,128.66898876404494,210.12,47.21797752808989,257.3379775280899,161.95766292134832,128.66898876404494,0.0,0.0,0.0,0.0,1.0,0.0,0.0,0.0,0.0,0.0,0.0,0.0,0.0,0.0,0.0,0.0,0.0,0.0,0.0,0.0,0.0,0.0,0.0,0.0,0.0,0.0,
210.89,210.89,0.0,0.0,0.22,0.28,0.23,0.35,245.7479,245.7479,0.0,47.39101123595505,47.39101123595505,75.0,0.0,0.0,0.0,0.0,0.0,258.281011235955,162.55116853932583,129.1405056179775,210.89,47.39101123595505,258.281011235955,162.55116853932583,129.1405056179775,0.0,0.0,0.0,0.0,0.0,1.0,0.0,0.0,0.0,0.0,0.0,0.0,0.0,0.0,0.0,0.0,0.0,0.0,0.0,0.0,0.0,0.0,0.0,0.0,0.0,0.0,
208.88,208.88,0.0,0.47,0.22,0.28,0.23,0.35,243.4056,243.4056,0.0,46.939325842696626,46.939325842696626,75.0,0.0,0.0,0.0,0.0,0.0,255.81932584269663,161.0018876404494,127.90966292134831,208.88,46.939325842696626,255.81932584269663,161.0018876404494,127.90966292134831,0.0,0.0,0.0,0.0,0.0,0.0,1.0,0.0,0.0,0.0,0.0,0.0,0.0,0.0,0.0,0.0,0.0,0.0,0.0,0.0,0.0,0.0,0.0,0.0,0.0,0.0,
210.26,210.26,0.0,1.38,0.22,0.28,0.23,0.35,219.0,245.0137,0.0,22.249438202247184,47.249438202247184,75.0,25.0,0.0,0.0,0.0,0.0,232.50943820224717,0.0,116.25471910112358,210.26,22.249438202247184,232.50943820224717,162.06557303370784,128.75471910112358,0.0,0.0,0.0,0.0,0.0,0.0,0.0,1.0,0.0,0.0,0.0,0.0,0.0,0.0,0.0,0.0,0.0,0.0,0.0,0.0,0.0,0.0,0.0,0.0,0.0,0.0,
210.2,210.2,0.0,1.58,0.22,0.22,0.23,0.35,219.0,244.9438,0.0,22.23595505617977,47.23595505617977,50.0,25.0,0.0,0.0,0.0,0.0,232.43595505617975,0.0,116.21797752808988,210.2,22.23595505617977,232.43595505617975,162.01932584269662,128.71797752808988,0.0,0.0,0.0,0.0,0.0,0.0,0.0,0.0,1.0,0.0,0.0,0.0,0.0,0.0,0.0,0.0,0.0,0.0,0.0,0.0,0.0,0.0,0.0,0.0,0.0,0.0,
211.18,211.18,0.0,2.17,0.22,0.22,0.35,0.35,219.0,246.0858,0.0,22.4561797752809,47.4561797752809,25.0,25.0,0.0,0.0,0.0,0.0,233.6361797752809,0.0,116.81808988764045,211.18,22.4561797752809,233.6361797752809,162.77469662921348,129.31808988764044,0.0,0.0,0.0,0.0,0.0,0.0,0.0,0.0,0.0,1.0,0.0,0.0,0.0,0.0,0.0,0.0,0.0,0.0,0.0,0.0,0.0,0.0,0.0,0.0,0.0,0.0,
209.05,209.05,0.0,2.29,0.22,0.22,0.35,0.35,270.0,243.6037,0.0,71.97752808988764,46.97752808988764,0.0,0.0,25.0,0.0,0.0,0.0,281.02752808988765,322.2658426966292,140.51376404494383,209.05,71.97752808988764,281.02752808988765,161.1329213483146,128.01376404494383,0.0,0.0,0.0,0.0,0.0,0.0,0.0,0.0,0.0,0.0,1.0,0.0,0.0,0.0,0.0,0.0,0.0,0.0,0.0,0.0,0.0,0.0,0.0,0.0,0.0,0.0,
209.38,209.38,0.0,2.47,0.25,0.22,0.35,0.35,270.0,243.9883,0.0,72.05168539325842,47.051685393258424,25.0,0.0,25.0,0.0,0.0,0.0,281.4316853932584,322.77456179775277,140.7158426966292,209.38,72.05168539325842,281.4316853932584,161.38728089887638,128.2158426966292,0.0,0.0,0.0,0.0,0.0,0.0,0.0,0.0,0.0,0.0,0.0,1.0,0.0,0.0,0.0,0.0,0.0,0.0,0.0,0.0,0.0,0.0,0.0,0.0,0.0,0.0,
209.81,209.81,0.0,2.16,0.26,0.22,0.35,0.35,270.0,244.4893,0.0,72.14831460674156,47.14831460674157,50.0,0.0,25.0,0.0,0.0,0.0,281.95831460674157,323.43743820224717,140.97915730337078,209.81,72.14831460674156,281.95831460674157,161.71871910112358,128.47915730337078,0.0,0.0,0.0,0.0,0.0,0.0,0.0,0.0,0.0,0.0,0.0,0.0,1.0,0.0,0.0,0.0,0.0,0.0,0.0,0.0,0.0,0.0,0.0,0.0,0.0,0.0,
209.66,209.66,0.0,2.18,0.26,0.22,0.35,0.35,244.3145,244.3145,0.0,47.114606741573034,47.114606741573034,75.0,0.0,0.0,0.0,0.0,0.0,256.77460674157305,161.60310112359548,128.38730337078653,209.66,47.114606741573034,256.77460674157305,161.60310112359548,128.38730337078653,0.0,0.0,0.0,0.0,0.0,0.0,0.0,0.0,0.0,0.0,0.0,0.0,0.0,1.0,0.0,0.0,0.0,0.0,0.0,0.0,0.0,0.0,0.0,0.0,0.0,0.0,
208.57,208.57,0.0,2.35,0.26,0.22,0.35,0.35,243.0444,243.0444,0.0,46.86966292134831,46.86966292134831,75.0,0.0,0.0,0.0,0.0,0.0,255.43966292134832,160.7629438202247,127.71983146067416,208.57,46.86966292134831,255.43966292134832,160.7629438202247,127.71983146067416,0.0,0.0,0.0,0.0,0.0,0.0,0.0,0.0,0.0,0.0,0.0,0.0,0.0,0.0,1.0,0.0,0.0,0.0,0.0,0.0,0.0,0.0,0.0,0.0,0.0,0.0,
209.26,209.26,0.0,2.14,0.26,0.22,0.35,0.35,243.8484,243.8484,0.0,47.024719101123594,47.024719101123594,75.0,0.0,0.0,0.0,0.0,0.0,256.2847191011236,161.29478651685392,128.1423595505618,209.26,47.024719101123594,256.2847191011236,161.29478651685392,128.1423595505618,0.0,0.0,0.0,0.0,0.0,0.0,0.0,0.0,0.0,0.0,0.0,0.0,0.0,0.0,0.0,1.0,0.0,0.0,0.0,0.0,0.0,0.0,0.0,0.0,0.0,0.0,
209.43,209.43,0.0,1.96,0.25,0.22,0.31,0.35,244.0465,244.0465,0.0,47.0629213483146,47.0629213483146,75.0,0.0,0.0,0.0,0.0,0.0,256.4929213483146,161.4258202247191,128.2464606741573,209.43,47.0629213483146,256.4929213483146,161.4258202247191,128.2464606741573,0.0,0.0,0.0,0.0,0.0,0.0,0.0,0.0,0.0,0.0,0.0,0.0,0.0,0.0,0.0,0.0,1.0,0.0,0.0,0.0,0.0,0.0,0.0,0.0,0.0,0.0,
210.72,210.72,0.0,1.86,0.22,0.27,0.31,0.35,245.5498,245.5498,0.0,47.352808988764046,47.352808988764046,75.0,0.0,0.0,0.0,0.0,0.0,258.07280898876405,162.42013483146067,129.03640449438203,210.72,47.352808988764046,258.07280898876405,162.42013483146067,129.03640449438203,0.0,0.0,0.0,0.0,0.0,0.0,0.0,0.0,0.0,0.0,0.0,0.0,0.0,0.0,0.0,0.0,0.0,1.0,0.0,0.0,0.0,0.0,0.0,0.0,0.0,0.0,
210.12,210.12,0.0,1.16,0.22,0.27,0.31,0.35,244.8506,244.8506,0.0,47.21797752808989,47.21797752808989,75.0,0.0,0.0,0.0,0.0,0.0,257.3379775280899,161.95766292134832,128.66898876404494,210.12,47.21797752808989,257.3379775280899,161.95766292134832,128.66898876404494,0.0,0.0,0.0,0.0,0.0,0.0,0.0,0.0,0.0,0.0,0.0,0.0,0.0,0.0,0.0,0.0,0.0,0.0,1.0,0.0,0.0,0.0,0.0,0.0,0.0,0.0,
210.84,210.84,0.0,0.15,0.22,0.27,0.31,0.35,245.6896,245.6896,0.0,47.379775280898876,47.379775280898876,75.0,0.0,0.0,0.0,0.0,0.0,258.2197752808989,162.51262921348314,129.10988764044944,210.84,47.379775280898876,258.2197752808989,162.51262921348314,129.10988764044944,0.0,0.0,0.0,0.0,0.0,0.0,0.0,0.0,0.0,0.0,0.0,0.0,0.0,0.0,0.0,0.0,0.0,0.0,0.0,1.0,0.0,0.0,0.0,0.0,0.0,0.0,
210.57,210.57,0.0,0.0,0.22,0.27,0.31,0.35,245.375,245.375,0.0,47.3191011235955,47.3191011235955,75.0,0.0,0.0,0.0,0.0,0.0,257.8891011235955,162.30451685393257,128.94455056179774,210.57,47.3191011235955,257.8891011235955,162.30451685393257,128.94455056179774,0.0,0.0,0.0,0.0,0.0,0.0,0.0,0.0,0.0,0.0,0.0,0.0,0.0,0.0,0.0,0.0,0.0,0.0,0.0,0.0,1.0,0.0,0.0,0.0,0.0,0.0,
210.19,210.19,0.0,0.0,0.22,0.27,0.31,0.35,244.9321,244.9321,0.0,47.23370786516854,47.23370786516854,75.0,0.0,0.0,0.0,0.0,0.0,257.4237078651685,162.01161797752806,128.71185393258426,210.19,47.23370786516854,257.4237078651685,162.01161797752806,128.71185393258426,0.0,0.0,0.0,0.0,0.0,0.0,0.0,0.0,0.0,0.0,0.0,0.0,0.0,0.0,0.0,0.0,0.0,0.0,0.0,0.0,0.0,1.0,0.0,0.0,0.0,0.0,
209.72,209.72,0.0,0.0,0.22,0.27,0.31,0.35,244.3845,244.3845,0.0,47.12808988764045,47.12808988764045,75.0,0.0,0.0,0.0,0.0,0.0,256.84808988764047,161.64934831460673,128.42404494382023,209.72,47.12808988764045,256.84808988764047,161.64934831460673,128.42404494382023,0.0,0.0,0.0,0.0,0.0,0.0,0.0,0.0,0.0,0.0,0.0,0.0,0.0,0.0,0.0,0.0,0.0,0.0,0.0,0.0,0.0,0.0,1.0,0.0,0.0,0.0,
210.29,210.29,0.0,0.0,0.3,0.27,0.31,0.35,245.0487,245.0487,0.0,47.2561797752809,47.2561797752809,75.0,0.0,0.0,0.0,0.0,0.0,257.5461797752809,162.08869662921347,128.77308988764045,210.29,47.2561797752809,257.5461797752809,162.08869662921347,128.77308988764045,0.0,0.0,0.0,0.0,0.0,0.0,0.0,0.0,0.0,0.0,0.0,0.0,0.0,0.0,0.0,0.0,0.0,0.0,0.0,0.0,0.0,0.0,0.0,1.0,0.0,0.0,
210.16,210.16,0.0,0.0,0.3,0.27,0.31,0.35,244.8972,244.8972,0.0,47.226966292134826,47.226966292134826,75.0,0.0,0.0,0.0,0.0,0.0,257.38696629213484,161.98849438202245,128.69348314606742,210.16,47.226966292134826,257.38696629213484,161.98849438202245,128.69348314606742,0.0,0.0,0.0,0.0,0.0,0.0,0.0,0.0,0.0,0.0,0.0,0.0,0.0,0.0,0.0,0.0,0.0,0.0,0.0,0.0,0.0,0.0,0.0,0.0,1.0,0.0,
211.76,211.76,0.0,0.0,0.3,0.27,0.31,0.35,246.7617,246.7617,0.0,47.58651685393258,47.58651685393258,75.0,0.0,0.0,0.0,0.0,0.0,259.3465168539326,163.22175280898875,129.6732584269663,211.76,47.58651685393258,259.3465168539326,163.22175280898875,129.6732584269663,0.0,0.0,0.0,0.0,0.0,0.0,0.0,0.0,0.0,0.0,0.0,0.0,0.0,0.0,0.0,0.0,0.0,0.0,0.0,0.0,0.0,0.0,0.0,0.0,0.0,1.0,
MAX_T, 24.0,
f_ESD, 0.0,
ESD_MAX, 0.0,
f_TES, 1.0,
TES_MAX, 75.0,
TES_R, 1.0,
TES_D, 1.0,
ESD_R, 0.0,
ESD_D, 0.0,
MAX_DIS_TES, 25.0,
MAX_DIS_ESD, 0.0,
DoD, 0.0,
MAX_IT, 580.0,
COP_C, 4.45,
COP_H, 4.43,
MAX_HOST, 0.0,
MAX_Relocate, 0.0,
relocateActive, 0.0,
TES_INIT, 75.0,
ESD_INIT, 0.0,
ESD_FIN, 0.0,
TES_FIN, 75.0,
WE, 0.0,
WF, 1.0,
WT, 0.0,
WL, 0.0,
WREN, 0.0,
E_D_Percentage, 0.0


