E_Total, Real_Time_Workload, Delay_Tolerant_Workload, REN, Energy_Price, L_Price, T_Price, D_Price, DR_Signal, Baseline, Delay_Tolerant_Executed, Total Cooling, IT Cooling, TES, D_TES, R_TES, ESD, D_ESD, R_ESD, DC Demand, DC Thermal Generation(Adapted Heat), Adapted CO2, Adapted Server, Adapted Cooling, Adapted DC, Baseline Heat, Baseline CO2,  Relocated, Hosted, Y
3.2222,2.9,0.3222,0.0,0.22,0.28,0.23,0.35,4.0,4.1402,0.03222,0.8353903133903134,0.8353903133903134,2.0,0.0,0.0,60.0,0.0,0.0,3.7676103133903136,1.8796282051282054,1.8838051566951568,2.93222,0.8353903133903134,3.7676103133903136,1.8796282051282054,1.8838051566951568,0.0,0.0,0.1,0.1,0.0,0.0,0.3,0.1,0.3,0.1,0.0,0.0,0.0,0.0,0.0,0.0,0.0,0.0,0.0,0.0,0.0,0.0,0.0,0.0,0.0,2.7755575615628914E-17,
3.2222,2.9,0.3222,0.0,0.22,0.28,0.23,0.35,4.0,4.1402,0.06444,0.8445698005698006,0.8445698005698006,2.0,0.0,0.0,60.0,0.0,0.0,3.8090098005698003,1.9002820512820513,1.9045049002849002,2.9644399999999997,0.8445698005698006,3.8090098005698003,1.9002820512820513,1.9045049002849002,0.0,0.0,0.0,0.1,0.2,0.0,0.0,0.0,0.6,0.0,0.0,0.0,0.0,0.0,0.1,0.0,0.0,0.0,0.0,0.0,0.0,0.0,0.0,0.0,0.0,-2.7755575615628914E-17,
3.2222,2.9,0.3222,0.0,0.22,0.28,0.23,0.35,4.0,4.1402,0.06444,0.8445698005698006,0.8445698005698006,2.0,0.0,0.0,60.0,0.0,0.0,3.8090098005698003,1.9002820512820513,1.9045049002849002,2.9644399999999997,0.8445698005698006,3.8090098005698003,1.9002820512820513,1.9045049002849002,0.0,0.0,0.0,0.0,0.0,0.1,0.1,0.1,0.0,0.7,0.0,0.0,0.0,0.0,0.0,0.0,0.0,0.0,0.0,0.0,0.0,0.0,0.0,0.0,0.0,1.1102230246251565E-16,
3.2222,2.9,0.3222,0.0,0.22,0.28,0.23,0.35,4.0,4.1402,0.06444,0.8445698005698006,0.8445698005698006,2.0,0.0,0.0,60.0,0.0,0.0,3.8090098005698003,1.9002820512820513,1.9045049002849002,2.9644399999999997,0.8445698005698006,3.8090098005698003,1.9002820512820513,1.9045049002849002,0.0,0.0,0.0,0.0,0.0,0.1,0.0,0.0,0.1,0.3,0.2,0.1,0.0,0.2,0.0,0.0,0.0,0.0,0.0,0.0,0.0,0.0,0.0,0.0,0.0,-2.7755575615628914E-17,
3.2222,2.9,0.3222,0.47,0.22,0.28,0.23,0.35,4.0,4.1402,0.12888,0.862928774928775,0.862928774928775,2.0,0.0,0.0,60.0,0.0,0.0,3.891808774928775,1.9415897435897438,1.9459043874643875,3.02888,0.862928774928775,3.891808774928775,1.9415897435897438,1.9459043874643875,0.0,0.0,0.0,0.0,0.0,0.0,0.0,0.1,0.0,0.1,0.1,0.1,0.3,0.0,0.1,0.1,0.0,0.1,0.0,0.0,0.0,0.0,0.0,0.0,0.0,8.326672684688674E-17,
3.2222,2.9,0.3222,1.38,0.22,0.28,0.23,0.35,4.0,4.1402,0.09666,0.8537492877492878,0.8537492877492878,2.0,0.0,0.0,60.0,0.0,0.0,3.8504092877492875,1.9209358974358974,1.9252046438746437,2.99666,0.8537492877492878,3.8504092877492875,1.9209358974358974,1.9252046438746437,0.0,0.0,0.0,0.0,0.0,0.0,0.0,0.0,0.0,0.1,0.5,0.1,0.3,0.0,0.0,0.0,0.0,0.0,0.0,0.0,0.0,0.0,0.0,0.0,0.0,5.551115123125783E-17,
3.2222,2.9,0.3222,1.58,0.22,0.22,0.23,0.35,4.0,4.1402,0.32220000000000004,0.9180056980056981,0.9180056980056981,2.0,0.0,0.0,60.0,0.0,0.0,4.140205698005698,2.065512820512821,2.070102849002849,3.2222,0.9180056980056981,4.140205698005698,2.065512820512821,2.070102849002849,0.0,0.0,0.0,0.0,0.0,0.0,0.0,0.0,0.0,0.1,0.5,0.2,0.0,0.0,0.2,0.0,0.0,0.0,0.0,0.0,0.0,0.0,0.0,0.0,0.0,0.0,
3.2222,2.9,0.3222,2.17,0.22,0.22,0.35,0.35,4.0,4.1402,0.48330000000000006,0.963903133903134,0.963903133903134,2.0,0.0,0.0,60.0,0.0,0.0,4.347203133903134,2.1687820512820517,2.173601566951567,3.3833,0.963903133903134,4.347203133903134,2.1687820512820517,2.173601566951567,0.0,0.0,0.0,0.0,0.0,0.0,0.0,0.0,0.0,0.1,0.1,0.6,0.0,0.1,0.1,0.0,0.0,0.0,0.0,0.0,0.0,0.0,0.0,0.0,0.0,5.551115123125783E-17,
3.2222,2.9,0.3222,2.29,0.22,0.22,0.35,0.35,4.0,4.1402,0.48330000000000006,0.963903133903134,0.963903133903134,2.0,0.0,0.0,60.0,0.0,0.0,4.347203133903134,2.1687820512820517,2.173601566951567,3.3833,0.963903133903134,4.347203133903134,2.1687820512820517,2.173601566951567,0.0,0.0,0.0,0.0,0.0,0.0,0.0,0.0,0.0,0.0,0.1,0.6,0.1,0.2,0.0,0.0,0.0,0.0,0.0,0.0,0.0,0.0,0.0,0.0,0.0,2.7755575615628914E-17,
3.2222,2.9,0.3222,2.47,0.25,0.22,0.35,0.35,4.0,4.1402,0.7410599999999998,1.0373390313390312,1.0373390313390312,2.0,0.0,0.0,60.0,0.0,0.0,4.678399031339031,2.3340128205128203,2.3391995156695153,3.6410599999999995,1.0373390313390312,4.678399031339031,2.3340128205128203,2.3391995156695153,0.0,0.0,0.0,0.0,0.0,0.0,0.0,0.0,0.0,0.0,0.0,0.6,0.2,0.1,0.1,0.0,0.0,0.0,0.0,0.0,0.0,0.0,0.0,0.0,0.0,0.0,
3.2222,2.9,0.3222,2.16,0.26,0.22,0.35,0.35,4.0,4.1402,0.4833,0.9639031339031339,0.9639031339031339,2.0,0.0,0.0,60.0,0.0,0.0,4.347203133903133,2.1687820512820513,2.1736015669515667,3.3832999999999998,0.9639031339031339,4.347203133903133,2.1687820512820513,2.1736015669515667,0.0,0.0,0.0,0.0,0.0,0.0,0.0,0.0,0.0,0.0,0.0,0.0,0.6,0.2,0.2,0.0,0.0,0.0,0.0,0.0,0.0,0.0,0.0,0.0,0.0,0.0,
3.2222,2.9,0.3222,2.18,0.26,0.22,0.35,0.35,4.0,4.1402,0.45108,0.9547236467236468,0.9547236467236468,2.0,0.0,0.0,60.0,0.0,0.0,4.305803646723647,2.1481282051282053,2.1529018233618236,3.35108,0.9547236467236468,4.305803646723647,2.1481282051282053,2.1529018233618236,0.0,0.0,0.0,0.0,0.0,0.0,0.0,0.0,0.0,0.0,0.0,0.0,0.0,0.6,0.3,0.1,0.0,0.0,0.0,0.0,0.0,0.0,0.0,0.0,0.0,2.7755575615628914E-17,
3.2222,2.9,0.3222,2.35,0.26,0.22,0.35,0.35,4.0,4.1402,0.61218,1.0006210826210826,1.0006210826210826,2.0,0.0,0.0,60.0,0.0,0.0,4.512801082621083,2.251397435897436,2.2564005413105415,3.51218,1.0006210826210826,4.512801082621083,2.251397435897436,2.2564005413105415,0.0,0.0,0.0,0.0,0.0,0.0,0.0,0.0,0.0,0.0,0.0,0.0,0.0,0.0,0.8,0.2,0.0,0.0,0.0,0.0,0.0,0.0,0.0,0.0,0.0,-5.551115123125783E-17,
3.2222,2.9,0.3222,2.14,0.26,0.22,0.35,0.35,4.0,4.1402,0.41886,0.9455441595441596,0.9455441595441596,2.0,0.0,0.0,60.0,0.0,0.0,4.26440415954416,2.127474358974359,2.13220207977208,3.31886,0.9455441595441596,4.26440415954416,2.127474358974359,2.13220207977208,0.0,0.0,0.0,0.0,0.0,0.0,0.0,0.0,0.0,0.0,0.0,0.0,0.0,0.0,0.0,0.9,0.1,0.0,0.0,0.0,0.0,0.0,0.0,0.0,0.0,-2.7755575615628914E-17,
3.2222,2.9,0.3222,1.96,0.25,0.22,0.31,0.35,4.0,4.1402,0.35441999999999996,0.9271851851851851,0.9271851851851851,2.0,0.0,0.0,60.0,0.0,0.0,4.181605185185185,2.0861666666666667,2.0908025925925924,3.2544199999999996,0.9271851851851851,4.181605185185185,2.0861666666666667,2.0908025925925924,0.0,0.0,0.0,0.0,0.0,0.0,0.0,0.0,0.0,0.0,0.0,0.0,0.0,0.0,0.0,0.0,1.0,0.0,0.0,0.0,0.0,0.0,0.0,0.0,0.0,0.0,
3.2222,2.9,0.3222,1.86,0.22,0.27,0.31,0.35,6.0,4.1402,0.35441999999999996,0.9271851851851851,0.9271851851851851,2.0,0.0,0.0,60.0,0.0,0.0,4.181605185185185,2.0861666666666667,2.0908025925925924,3.2544199999999996,0.9271851851851851,4.181605185185185,2.0861666666666667,2.0908025925925924,0.0,0.0,0.0,0.0,0.0,0.0,0.0,0.0,0.0,0.0,0.0,0.0,0.0,0.0,0.0,0.0,0.0,1.0,0.0,0.0,0.0,0.0,0.0,0.0,0.0,0.0,
3.2222,2.9,0.3222,1.16,0.22,0.27,0.31,0.35,6.0,4.1402,0.06444,0.8445698005698006,0.8445698005698006,2.0,0.0,0.0,60.0,0.0,0.0,3.8090098005698003,1.9002820512820513,1.9045049002849002,2.9644399999999997,0.8445698005698006,3.8090098005698003,1.9002820512820513,1.9045049002849002,0.0,0.0,0.0,0.0,0.0,0.0,0.0,0.0,0.0,0.0,0.0,0.0,0.0,0.0,0.0,0.0,0.0,0.0,0.2,0.0,0.1,0.0,0.3,0.2,0.1,0.10000000000000006,
3.2222,2.9,0.3222,0.15,0.22,0.27,0.31,0.35,6.0,4.1402,0.0,0.8262108262108262,0.8262108262108262,2.0,0.0,0.0,60.0,0.0,0.0,3.726210826210826,1.858974358974359,1.863105413105413,2.9,0.8262108262108262,3.726210826210826,1.858974358974359,1.863105413105413,0.0,0.0,0.0,0.0,0.0,0.0,0.0,0.0,0.0,0.0,0.0,0.0,0.0,0.0,0.0,0.0,0.0,0.0,0.0,0.0,0.0,0.1,0.8,0.0,0.0,0.09999999999999998,
3.2222,2.9,0.3222,0.0,0.22,0.27,0.31,0.35,6.0,4.1402,0.03222,0.8353903133903134,0.8353903133903134,2.0,0.0,0.0,60.0,0.0,0.0,3.7676103133903136,1.8796282051282054,1.8838051566951568,2.93222,0.8353903133903134,3.7676103133903136,1.8796282051282054,1.8838051566951568,0.0,0.0,0.0,0.0,0.0,0.0,0.0,0.0,0.0,0.0,0.0,0.0,0.0,0.0,0.0,0.0,0.0,0.0,0.0,0.0,0.0,0.0,0.4,0.4,0.1,0.09999999999999995,
2.7444,2.47,0.2744,0.0,0.22,0.27,0.31,0.35,6.0,3.5263,0.02744,0.7115213675213676,0.7115213675213676,2.0,0.0,0.0,60.0,0.0,0.0,3.2089613675213675,1.6009230769230771,1.6044806837606838,2.49744,0.7115213675213676,3.2089613675213675,1.6009230769230771,1.6044806837606838,0.0,0.0,0.0,0.0,0.0,0.0,0.0,0.0,0.0,0.0,0.0,0.0,0.0,0.0,0.0,0.0,0.0,0.0,0.0,0.0,0.0,0.0,0.1,0.2,0.5,0.19999999999999996,
1.6111,1.45,0.1611,0.0,0.22,0.27,0.31,0.35,4.0,2.0701,0.30609,0.5003105413105413,0.5003105413105413,2.0,0.0,0.0,60.0,0.0,0.0,2.2564005413105415,1.125698717948718,1.1282002706552707,1.75609,0.5003105413105413,2.2564005413105415,1.125698717948718,1.1282002706552707,0.0,0.0,0.0,0.0,0.0,0.0,0.0,0.0,0.0,0.0,0.0,0.0,0.0,0.0,0.0,0.0,0.0,0.0,0.0,0.0,0.0,0.0,0.3,0.1,0.4,0.19999999999999996,
1.6111,1.45,0.1611,0.0,0.3,0.27,0.31,0.35,4.0,2.0701,0.25776,0.48654131054131056,0.48654131054131056,2.0,0.0,0.0,60.0,0.0,0.0,2.1943013105413103,1.0947179487179488,1.0971506552706551,1.70776,0.48654131054131056,2.1943013105413103,1.0947179487179488,1.0971506552706551,0.0,0.0,0.0,0.0,0.0,0.0,0.0,0.0,0.0,0.0,0.0,0.0,0.0,0.0,0.0,0.0,0.0,0.0,0.0,0.0,0.0,0.0,0.0,0.7,0.1,0.20000000000000004,
1.6111,1.45,0.1611,0.0,0.3,0.27,0.31,0.35,4.0,2.0701,0.28998,0.4957207977207978,0.4957207977207978,2.0,0.0,0.0,60.0,0.0,0.0,2.235700797720798,1.115371794871795,1.117850398860399,1.73998,0.4957207977207978,2.235700797720798,1.115371794871795,1.117850398860399,0.0,0.0,0.0,0.0,0.0,0.0,0.0,0.0,0.0,0.0,0.0,0.0,0.0,0.0,0.0,0.0,0.0,0.0,0.0,0.0,0.0,0.0,0.0,0.0,0.6,0.4,
1.6111,1.45,0.1611,0.0,0.3,0.27,0.31,0.35,4.0,2.0701,0.37053,0.5186695156695157,0.5186695156695157,2.0,0.0,0.0,60.0,0.0,0.0,2.339199515669516,1.1670064102564104,1.169599757834758,1.82053,0.5186695156695157,2.339199515669516,1.1670064102564104,1.169599757834758,0.0,0.0,0.0,0.0,0.0,0.0,0.0,0.0,0.0,0.0,0.0,0.0,0.0,0.0,0.0,0.0,0.0,0.0,0.0,0.0,0.0,0.0,0.0,0.0,0.0,1.0,
MAX_T, 24.0,
f_ESD, 1.0,
ESD_MAX, 60.0,
f_TES, 1.0,
TES_MAX, 2.0,
TES_R, 1.0,
TES_D, 1.0,
ESD_R, 1.0,
ESD_D, 1.0,
MAX_DIS_TES, 2.0,
MAX_DIS_ESD, 2.0,
DoD, 0.4,
MAX_IT, 10.0,
COP_C, 3.51,
COP_H, 3.25,
MAX_HOST, 4.0,
MAX_Relocate, 4.0,
relocateActive, 0.0,
TES_INIT, 2.0,
ESD_INIT, 60.0,
ESD_FIN, 60.0,
TES_FIN, 2.0,
WE, 0.0,
WF, 0.0,
WT, 0.0,
WL, 0.0,
WREN, 1.0,
E_D_Percentage, 0.1


