2020-07-13T05:00:00.000Z,
BuyEnergy,SellHeat,DynamicAdjustmentOfCoolingIntensity,ShiftDelayTolerantWorkload,ShiftDelayTolerantWorkload,ShiftDelayTolerantWorkload,ShiftDelayTolerantWorkload,WorkloadRelocation,WorkloadHosting,
2020-07-13T03:00:00.000Z,
BuyEnergy,SellHeat,DynamicAdjustmentOfCoolingIntensity,ShiftDelayTolerantWorkload,ShiftDelayTolerantWorkload,ShiftDelayTolerantWorkload,ShiftDelayTolerantWorkload,WorkloadRelocation,WorkloadHosting,
2020-07-13T00:00:00.000Z,
BuyEnergy,SellHeat,DynamicAdjustmentOfCoolingIntensity,ShiftDelayTolerantWorkload,ShiftDelayTolerantWorkload,WorkloadRelocation,WorkloadHosting,
2020-07-13T23:00:00.000Z,
BuyEnergy,SellHeat,DynamicAdjustmentOfCoolingIntensity,ShiftDelayTolerantWorkload,WorkloadRelocation,WorkloadHosting,
2020-07-13T06:00:00.000Z,
BuyEnergy,BuyHeat,DischargeTes,DynamicAdjustmentOfCoolingIntensity,ShiftDelayTolerantWorkload,ShiftDelayTolerantWorkload,WorkloadRelocation,WorkloadHosting,
2020-07-13T08:00:00.000Z,
BuyEnergy,SellHeat,ChargeTes,DynamicAdjustmentOfCoolingIntensity,ShiftDelayTolerantWorkload,WorkloadRelocation,WorkloadHosting,
2020-07-13T15:00:00.000Z,
BuyEnergy,SellHeat,DynamicAdjustmentOfCoolingIntensity,ShiftDelayTolerantWorkload,ShiftDelayTolerantWorkload,ShiftDelayTolerantWorkload,WorkloadRelocation,WorkloadHosting,
2020-07-13T17:00:00.000Z,
BuyEnergy,SellHeat,DynamicAdjustmentOfCoolingIntensity,ShiftDelayTolerantWorkload,WorkloadRelocation,WorkloadHosting,
2020-07-13T22:00:00.000Z,
BuyEnergy,SellHeat,DynamicAdjustmentOfCoolingIntensity,ShiftDelayTolerantWorkload,ShiftDelayTolerantWorkload,WorkloadRelocation,WorkloadHosting,
2020-07-13T14:00:00.000Z,
BuyEnergy,SellHeat,DynamicAdjustmentOfCoolingIntensity,ShiftDelayTolerantWorkload,ShiftDelayTolerantWorkload,WorkloadRelocation,WorkloadHosting,
2020-07-13T16:00:00.000Z,
BuyEnergy,SellHeat,DynamicAdjustmentOfCoolingIntensity,ShiftDelayTolerantWorkload,ShiftDelayTolerantWorkload,WorkloadRelocation,WorkloadHosting,
2020-07-13T01:00:00.000Z,
BuyEnergy,SellHeat,DynamicAdjustmentOfCoolingIntensity,ShiftDelayTolerantWorkload,ShiftDelayTolerantWorkload,WorkloadRelocation,WorkloadHosting,
2020-07-13T07:00:00.000Z,
BuyEnergy,SellHeat,ChargeTes,DynamicAdjustmentOfCoolingIntensity,ShiftDelayTolerantWorkload,ShiftDelayTolerantWorkload,ShiftDelayTolerantWorkload,ShiftDelayTolerantWorkload,WorkloadRelocation,WorkloadHosting,
2020-07-13T09:00:00.000Z,
BuyEnergy,SellHeat,DynamicAdjustmentOfCoolingIntensity,ShiftDelayTolerantWorkload,WorkloadRelocation,WorkloadHosting,
2020-07-13T02:00:00.000Z,
BuyEnergy,SellHeat,DynamicAdjustmentOfCoolingIntensity,ShiftDelayTolerantWorkload,WorkloadRelocation,WorkloadHosting,
2020-07-13T04:00:00.000Z,
BuyEnergy,SellHeat,DynamicAdjustmentOfCoolingIntensity,ShiftDelayTolerantWorkload,ShiftDelayTolerantWorkload,ShiftDelayTolerantWorkload,ShiftDelayTolerantWorkload,ShiftDelayTolerantWorkload,ShiftDelayTolerantWorkload,WorkloadRelocation,WorkloadHosting,
2020-07-13T19:00:00.000Z,
BuyEnergy,SellHeat,DynamicAdjustmentOfCoolingIntensity,ShiftDelayTolerantWorkload,WorkloadRelocation,WorkloadHosting,
2020-07-13T11:00:00.000Z,
BuyEnergy,SellHeat,DynamicAdjustmentOfCoolingIntensity,ShiftDelayTolerantWorkload,WorkloadRelocation,WorkloadHosting,
2020-07-13T13:00:00.000Z,
BuyEnergy,SellHeat,DynamicAdjustmentOfCoolingIntensity,ShiftDelayTolerantWorkload,WorkloadRelocation,WorkloadHosting,
2020-07-13T21:00:00.000Z,
BuyEnergy,SellHeat,DynamicAdjustmentOfCoolingIntensity,ShiftDelayTolerantWorkload,ShiftDelayTolerantWorkload,WorkloadRelocation,WorkloadHosting,
2020-07-13T10:00:00.000Z,
BuyEnergy,SellHeat,DynamicAdjustmentOfCoolingIntensity,ShiftDelayTolerantWorkload,ShiftDelayTolerantWorkload,WorkloadRelocation,WorkloadHosting,
2020-07-13T12:00:00.000Z,
BuyEnergy,SellHeat,DynamicAdjustmentOfCoolingIntensity,ShiftDelayTolerantWorkload,ShiftDelayTolerantWorkload,WorkloadRelocation,WorkloadHosting,
2020-07-13T18:00:00.000Z,
BuyEnergy,SellHeat,DynamicAdjustmentOfCoolingIntensity,ShiftDelayTolerantWorkload,ShiftDelayTolerantWorkload,WorkloadRelocation,WorkloadHosting,
2020-07-13T20:00:00.000Z,
BuyEnergy,SellHeat,DynamicAdjustmentOfCoolingIntensity,ShiftDelayTolerantWorkload,ShiftDelayTolerantWorkload,WorkloadRelocation,WorkloadHosting,
2020-07-13T05:00:00.000Z,
BuyEnergy,SellHeat,
2020-07-13T03:00:00.000Z,
BuyEnergy,SellHeat,
2020-07-13T00:00:00.000Z,
BuyEnergy,SellHeat,
2020-07-13T23:00:00.000Z,
BuyEnergy,SellHeat,
2020-07-13T06:00:00.000Z,

2020-07-13T08:00:00.000Z,
BuyEnergy,SellHeat,
2020-07-13T15:00:00.000Z,
BuyEnergy,SellHeat,
2020-07-13T17:00:00.000Z,
BuyEnergy,SellHeat,
2020-07-13T22:00:00.000Z,
BuyEnergy,SellHeat,
2020-07-13T14:00:00.000Z,
BuyEnergy,SellHeat,
2020-07-13T16:00:00.000Z,
BuyEnergy,SellHeat,
2020-07-13T01:00:00.000Z,
BuyEnergy,SellHeat,
2020-07-13T07:00:00.000Z,
BuyEnergy,SellHeat,
2020-07-13T09:00:00.000Z,
BuyEnergy,SellHeat,
2020-07-13T02:00:00.000Z,
BuyEnergy,SellHeat,
2020-07-13T04:00:00.000Z,
BuyEnergy,SellHeat,
2020-07-13T19:00:00.000Z,
BuyEnergy,SellHeat,
2020-07-13T11:00:00.000Z,
BuyEnergy,SellHeat,
2020-07-13T13:00:00.000Z,
BuyEnergy,SellHeat,
2020-07-13T21:00:00.000Z,
BuyEnergy,SellHeat,
2020-07-13T10:00:00.000Z,
BuyEnergy,SellHeat,
2020-07-13T12:00:00.000Z,
BuyEnergy,SellHeat,
2020-07-13T18:00:00.000Z,
BuyEnergy,SellHeat,
2020-07-13T20:00:00.000Z,
BuyEnergy,SellHeat,

