2020-10-09T01:00:00.000Z,
BuyEnergy,SellFlexibility,ChargeTes,DynamicAdjustmentOfCoolingIntensity,ShiftDelayTolerantWorkload,ShiftDelayTolerantWorkload,ShiftDelayTolerantWorkload,ShiftDelayTolerantWorkload,ShiftDelayTolerantWorkload,ShiftDelayTolerantWorkload,ShiftDelayTolerantWorkload,WorkloadRelocation,WorkloadHosting,
2020-10-09T07:00:00.000Z,
BuyEnergy,SellFlexibility,DynamicAdjustmentOfCoolingIntensity,ShiftDelayTolerantWorkload,ShiftDelayTolerantWorkload,ShiftDelayTolerantWorkload,ShiftDelayTolerantWorkload,ShiftDelayTolerantWorkload,ShiftDelayTolerantWorkload,WorkloadRelocation,WorkloadHosting,
2020-10-09T09:00:00.000Z,
BuyEnergy,SellFlexibility,DynamicAdjustmentOfCoolingIntensity,ShiftDelayTolerantWorkload,ShiftDelayTolerantWorkload,ShiftDelayTolerantWorkload,ShiftDelayTolerantWorkload,ShiftDelayTolerantWorkload,WorkloadRelocation,WorkloadHosting,
2020-10-09T00:00:00.000Z,
BuyEnergy,SellFlexibility,DischargeTes,DynamicAdjustmentOfCoolingIntensity,ShiftDelayTolerantWorkload,WorkloadRelocation,WorkloadHosting,
2020-10-09T23:00:00.000Z,
BuyEnergy,SellFlexibility,DynamicAdjustmentOfCoolingIntensity,ShiftDelayTolerantWorkload,WorkloadRelocation,WorkloadHosting,
2020-10-09T06:00:00.000Z,
BuyEnergy,SellFlexibility,DynamicAdjustmentOfCoolingIntensity,ShiftDelayTolerantWorkload,ShiftDelayTolerantWorkload,ShiftDelayTolerantWorkload,ShiftDelayTolerantWorkload,ShiftDelayTolerantWorkload,WorkloadRelocation,WorkloadHosting,
2020-10-09T08:00:00.000Z,
BuyEnergy,SellFlexibility,DynamicAdjustmentOfCoolingIntensity,ShiftDelayTolerantWorkload,ShiftDelayTolerantWorkload,ShiftDelayTolerantWorkload,ShiftDelayTolerantWorkload,ShiftDelayTolerantWorkload,ShiftDelayTolerantWorkload,WorkloadRelocation,WorkloadHosting,
2020-10-09T15:00:00.000Z,
BuyEnergy,SellFlexibility,DynamicAdjustmentOfCoolingIntensity,ShiftDelayTolerantWorkload,ShiftDelayTolerantWorkload,WorkloadRelocation,WorkloadHosting,
2020-10-09T17:00:00.000Z,
BuyEnergy,SellFlexibility,DynamicAdjustmentOfCoolingIntensity,ShiftDelayTolerantWorkload,ShiftDelayTolerantWorkload,WorkloadRelocation,WorkloadHosting,
2020-10-09T10:00:00.000Z,
BuyEnergy,SellFlexibility,DynamicAdjustmentOfCoolingIntensity,ShiftDelayTolerantWorkload,ShiftDelayTolerantWorkload,WorkloadRelocation,WorkloadHosting,
2020-10-09T12:00:00.000Z,
BuyEnergy,SellFlexibility,DynamicAdjustmentOfCoolingIntensity,ShiftDelayTolerantWorkload,ShiftDelayTolerantWorkload,ShiftDelayTolerantWorkload,WorkloadRelocation,WorkloadHosting,
2020-10-09T18:00:00.000Z,
BuyEnergy,SellFlexibility,DynamicAdjustmentOfCoolingIntensity,ShiftDelayTolerantWorkload,ShiftDelayTolerantWorkload,ShiftDelayTolerantWorkload,WorkloadRelocation,WorkloadHosting,
2020-10-09T20:00:00.000Z,
BuyEnergy,SellFlexibility,DynamicAdjustmentOfCoolingIntensity,ShiftDelayTolerantWorkload,ShiftDelayTolerantWorkload,WorkloadRelocation,WorkloadHosting,
2020-10-09T05:00:00.000Z,
BuyEnergy,SellFlexibility,DynamicAdjustmentOfCoolingIntensity,ShiftDelayTolerantWorkload,ShiftDelayTolerantWorkload,ShiftDelayTolerantWorkload,ShiftDelayTolerantWorkload,ShiftDelayTolerantWorkload,WorkloadRelocation,WorkloadHosting,
2020-10-09T03:00:00.000Z,
BuyEnergy,SellFlexibility,DynamicAdjustmentOfCoolingIntensity,ShiftDelayTolerantWorkload,ShiftDelayTolerantWorkload,ShiftDelayTolerantWorkload,ShiftDelayTolerantWorkload,ShiftDelayTolerantWorkload,WorkloadRelocation,WorkloadHosting,
2020-10-09T02:00:00.000Z,
BuyEnergy,SellFlexibility,ChargeTes,DynamicAdjustmentOfCoolingIntensity,ShiftDelayTolerantWorkload,ShiftDelayTolerantWorkload,ShiftDelayTolerantWorkload,ShiftDelayTolerantWorkload,ShiftDelayTolerantWorkload,WorkloadRelocation,WorkloadHosting,
2020-10-09T04:00:00.000Z,
BuyEnergy,SellFlexibility,DynamicAdjustmentOfCoolingIntensity,ShiftDelayTolerantWorkload,ShiftDelayTolerantWorkload,ShiftDelayTolerantWorkload,ShiftDelayTolerantWorkload,ShiftDelayTolerantWorkload,ShiftDelayTolerantWorkload,ShiftDelayTolerantWorkload,WorkloadRelocation,WorkloadHosting,
2020-10-09T19:00:00.000Z,
BuyEnergy,SellFlexibility,DynamicAdjustmentOfCoolingIntensity,ShiftDelayTolerantWorkload,WorkloadRelocation,WorkloadHosting,
2020-10-09T11:00:00.000Z,
BuyEnergy,SellFlexibility,DynamicAdjustmentOfCoolingIntensity,ShiftDelayTolerantWorkload,ShiftDelayTolerantWorkload,ShiftDelayTolerantWorkload,ShiftDelayTolerantWorkload,WorkloadRelocation,WorkloadHosting,
2020-10-09T13:00:00.000Z,
BuyEnergy,SellFlexibility,DynamicAdjustmentOfCoolingIntensity,ShiftDelayTolerantWorkload,ShiftDelayTolerantWorkload,WorkloadRelocation,WorkloadHosting,
2020-10-09T21:00:00.000Z,
BuyEnergy,SellFlexibility,DynamicAdjustmentOfCoolingIntensity,ShiftDelayTolerantWorkload,ShiftDelayTolerantWorkload,WorkloadRelocation,WorkloadHosting,
2020-10-09T22:00:00.000Z,
BuyEnergy,SellFlexibility,DynamicAdjustmentOfCoolingIntensity,ShiftDelayTolerantWorkload,ShiftDelayTolerantWorkload,WorkloadRelocation,WorkloadHosting,
2020-10-09T14:00:00.000Z,
BuyEnergy,SellFlexibility,DynamicAdjustmentOfCoolingIntensity,ShiftDelayTolerantWorkload,WorkloadRelocation,WorkloadHosting,
2020-10-09T16:00:00.000Z,
BuyEnergy,SellFlexibility,DynamicAdjustmentOfCoolingIntensity,ShiftDelayTolerantWorkload,ShiftDelayTolerantWorkload,ShiftDelayTolerantWorkload,WorkloadRelocation,WorkloadHosting,
2020-10-09T01:00:00.000Z,

2020-10-09T07:00:00.000Z,

2020-10-09T09:00:00.000Z,

2020-10-09T00:00:00.000Z,

2020-10-09T23:00:00.000Z,

2020-10-09T06:00:00.000Z,

2020-10-09T08:00:00.000Z,

2020-10-09T15:00:00.000Z,

2020-10-09T17:00:00.000Z,

2020-10-09T10:00:00.000Z,

2020-10-09T12:00:00.000Z,

2020-10-09T18:00:00.000Z,

2020-10-09T20:00:00.000Z,

2020-10-09T05:00:00.000Z,

2020-10-09T03:00:00.000Z,

2020-10-09T02:00:00.000Z,

2020-10-09T04:00:00.000Z,

2020-10-09T19:00:00.000Z,

2020-10-09T11:00:00.000Z,

2020-10-09T13:00:00.000Z,

2020-10-09T21:00:00.000Z,

2020-10-09T22:00:00.000Z,

2020-10-09T14:00:00.000Z,

2020-10-09T16:00:00.000Z,


