﻿Energy Value,,,,,,
550.144,,,,,,
548.765,,,,,,
548.163,,,,,,
547.806,,,,,,
548.485,,,,,,
551.383,,,,,,
554.281,,,,,,
557.368,,,,,,
560.476,,,,,,
562.751,,,,,,
564.081,,,,,,
565.39,,,,,,
566.174,,,,,,
566.958,,,,,,
567.455,,,,,,
567.777,,,,,,
568.015,,,,,,
567.917,,,,,,
567.819,,,,,,
568.134,,,,,,
568.589,,,,,,
569.534,,,,,,
571.438,,,,,,
573.342,,,,,,
