2020-07-11T10:00:00.000Z,
BuyEnergy,SellFlexibility,DynamicAdjustmentOfCoolingIntensity,ShiftDelayTolerantWorkload,ShiftDelayTolerantWorkload,ShiftDelayTolerantWorkload,ShiftDelayTolerantWorkload,WorkloadRelocation,WorkloadHosting,
2020-07-11T12:00:00.000Z,
BuyEnergy,SellFlexibility,DynamicAdjustmentOfCoolingIntensity,ShiftDelayTolerantWorkload,ShiftDelayTolerantWorkload,ShiftDelayTolerantWorkload,WorkloadRelocation,WorkloadHosting,
2020-07-11T21:00:00.000Z,
BuyEnergy,SellFlexibility,DynamicAdjustmentOfCoolingIntensity,ShiftDelayTolerantWorkload,ShiftDelayTolerantWorkload,WorkloadRelocation,WorkloadHosting,
2020-07-11T02:00:00.000Z,
BuyEnergy,SellFlexibility,DynamicAdjustmentOfCoolingIntensity,ShiftDelayTolerantWorkload,ShiftDelayTolerantWorkload,ShiftDelayTolerantWorkload,ShiftDelayTolerantWorkload,ShiftDelayTolerantWorkload,ShiftDelayTolerantWorkload,WorkloadRelocation,WorkloadHosting,
2020-07-11T04:00:00.000Z,
BuyEnergy,SellFlexibility,DynamicAdjustmentOfCoolingIntensity,ShiftDelayTolerantWorkload,ShiftDelayTolerantWorkload,ShiftDelayTolerantWorkload,ShiftDelayTolerantWorkload,ShiftDelayTolerantWorkload,ShiftDelayTolerantWorkload,ShiftDelayTolerantWorkload,ShiftDelayTolerantWorkload,WorkloadRelocation,WorkloadHosting,
2020-07-11T19:00:00.000Z,
BuyEnergy,SellFlexibility,DynamicAdjustmentOfCoolingIntensity,ShiftDelayTolerantWorkload,ShiftDelayTolerantWorkload,ShiftDelayTolerantWorkload,WorkloadRelocation,WorkloadHosting,
2020-07-11T18:00:00.000Z,
BuyEnergy,SellFlexibility,DynamicAdjustmentOfCoolingIntensity,ShiftDelayTolerantWorkload,ShiftDelayTolerantWorkload,WorkloadRelocation,WorkloadHosting,
2020-07-11T20:00:00.000Z,
BuyEnergy,SellFlexibility,DynamicAdjustmentOfCoolingIntensity,ShiftDelayTolerantWorkload,WorkloadRelocation,WorkloadHosting,
2020-07-11T03:00:00.000Z,
BuyEnergy,SellFlexibility,DynamicAdjustmentOfCoolingIntensity,ShiftDelayTolerantWorkload,ShiftDelayTolerantWorkload,ShiftDelayTolerantWorkload,ShiftDelayTolerantWorkload,ShiftDelayTolerantWorkload,ShiftDelayTolerantWorkload,WorkloadRelocation,WorkloadHosting,
2020-07-11T11:00:00.000Z,
BuyEnergy,SellFlexibility,DynamicAdjustmentOfCoolingIntensity,ShiftDelayTolerantWorkload,ShiftDelayTolerantWorkload,ShiftDelayTolerantWorkload,WorkloadRelocation,WorkloadHosting,
2020-07-11T13:00:00.000Z,
BuyEnergy,SellFlexibility,DynamicAdjustmentOfCoolingIntensity,ShiftDelayTolerantWorkload,WorkloadRelocation,WorkloadHosting,
2020-07-11T05:00:00.000Z,
BuyEnergy,SellFlexibility,DynamicAdjustmentOfCoolingIntensity,ShiftDelayTolerantWorkload,ShiftDelayTolerantWorkload,ShiftDelayTolerantWorkload,ShiftDelayTolerantWorkload,ShiftDelayTolerantWorkload,WorkloadRelocation,WorkloadHosting,
2020-07-11T06:00:00.000Z,
BuyEnergy,SellFlexibility,ChargeTes,DynamicAdjustmentOfCoolingIntensity,ShiftDelayTolerantWorkload,ShiftDelayTolerantWorkload,ShiftDelayTolerantWorkload,ShiftDelayTolerantWorkload,WorkloadRelocation,WorkloadHosting,
2020-07-11T08:00:00.000Z,
BuyEnergy,SellFlexibility,ChargeTes,DynamicAdjustmentOfCoolingIntensity,ShiftDelayTolerantWorkload,ShiftDelayTolerantWorkload,ShiftDelayTolerantWorkload,ShiftDelayTolerantWorkload,ShiftDelayTolerantWorkload,WorkloadRelocation,WorkloadHosting,
2020-07-11T14:00:00.000Z,
BuyEnergy,SellFlexibility,DynamicAdjustmentOfCoolingIntensity,ShiftDelayTolerantWorkload,WorkloadRelocation,WorkloadHosting,
2020-07-11T15:00:00.000Z,
BuyEnergy,SellFlexibility,DynamicAdjustmentOfCoolingIntensity,ShiftDelayTolerantWorkload,ShiftDelayTolerantWorkload,ShiftDelayTolerantWorkload,WorkloadRelocation,WorkloadHosting,
2020-07-11T17:00:00.000Z,
BuyEnergy,SellFlexibility,DynamicAdjustmentOfCoolingIntensity,ShiftDelayTolerantWorkload,ShiftDelayTolerantWorkload,ShiftDelayTolerantWorkload,ShiftDelayTolerantWorkload,WorkloadRelocation,WorkloadHosting,
2020-07-11T00:00:00.000Z,
BuyEnergy,SellFlexibility,DynamicAdjustmentOfCoolingIntensity,ShiftDelayTolerantWorkload,ShiftDelayTolerantWorkload,ShiftDelayTolerantWorkload,WorkloadRelocation,WorkloadHosting,
2020-07-11T23:00:00.000Z,
BuyEnergy,SellFlexibility,DynamicAdjustmentOfCoolingIntensity,ShiftDelayTolerantWorkload,WorkloadRelocation,WorkloadHosting,
2020-07-11T16:00:00.000Z,
BuyEnergy,SellFlexibility,DynamicAdjustmentOfCoolingIntensity,ShiftDelayTolerantWorkload,ShiftDelayTolerantWorkload,WorkloadRelocation,WorkloadHosting,
2020-07-11T22:00:00.000Z,
BuyEnergy,SellFlexibility,DynamicAdjustmentOfCoolingIntensity,ShiftDelayTolerantWorkload,WorkloadRelocation,WorkloadHosting,
2020-07-11T07:00:00.000Z,
BuyEnergy,SellFlexibility,DischargeTes,DynamicAdjustmentOfCoolingIntensity,ShiftDelayTolerantWorkload,ShiftDelayTolerantWorkload,ShiftDelayTolerantWorkload,ShiftDelayTolerantWorkload,WorkloadRelocation,WorkloadHosting,
2020-07-11T09:00:00.000Z,
BuyEnergy,SellFlexibility,ChargeTes,DynamicAdjustmentOfCoolingIntensity,ShiftDelayTolerantWorkload,ShiftDelayTolerantWorkload,ShiftDelayTolerantWorkload,WorkloadRelocation,WorkloadHosting,
2020-07-11T01:00:00.000Z,
BuyEnergy,SellFlexibility,DynamicAdjustmentOfCoolingIntensity,ShiftDelayTolerantWorkload,ShiftDelayTolerantWorkload,ShiftDelayTolerantWorkload,ShiftDelayTolerantWorkload,ShiftDelayTolerantWorkload,WorkloadRelocation,WorkloadHosting,
2020-07-11T10:00:00.000Z,

2020-07-11T12:00:00.000Z,

2020-07-11T21:00:00.000Z,

2020-07-11T02:00:00.000Z,

2020-07-11T04:00:00.000Z,

2020-07-11T19:00:00.000Z,

2020-07-11T18:00:00.000Z,

2020-07-11T20:00:00.000Z,

2020-07-11T03:00:00.000Z,

2020-07-11T11:00:00.000Z,

2020-07-11T13:00:00.000Z,

2020-07-11T05:00:00.000Z,

2020-07-11T06:00:00.000Z,

2020-07-11T08:00:00.000Z,

2020-07-11T14:00:00.000Z,

2020-07-11T15:00:00.000Z,

2020-07-11T17:00:00.000Z,

2020-07-11T00:00:00.000Z,

2020-07-11T23:00:00.000Z,

2020-07-11T16:00:00.000Z,

2020-07-11T22:00:00.000Z,

2020-07-11T07:00:00.000Z,

2020-07-11T09:00:00.000Z,

2020-07-11T01:00:00.000Z,


