E_Total, Real_Time_Workload, Delay_Tolerant_Workload, REN, Energy_Price, L_Price, T_Price, D_Price, DR_Signal, Baseline, Delay_Tolerant_Executed, Total Cooling, IT Cooling, TES, D_TES, R_TES, ESD, D_ESD, R_ESD, DC Demand, DC Thermal Generation(Adapted Heat), Adapted CO2, Adapted Server, Adapted Cooling, Adapted DC, Baseline Heat, Baseline CO2,  Relocated, Hosted, Y
785.9200000000001,550.144,235.776,1024.0776,0.22,0.28,0.23,0.35,1024.0776,1024.0776,212.19840000000002,179.11413333333334,254.11413333333334,75.0,75.0,0.0,1800.0,0.0,0.0,941.4565333333334,0.0,470.7282666666667,762.3424,179.11413333333334,941.4565333333334,871.6114773333334,508.2282666666667,0.0,0.0,0.9,0.0,0.0,0.1,0.0,0.0,0.0,0.0,0.0,0.0,0.0,0.0,0.0,0.0,0.0,0.0,0.0,0.0,0.0,0.0,0.0,0.0,0.0,-2.7755575615628914E-17,
783.95,548.765,235.185,1021.5106,0.22,0.28,0.23,0.35,1021.5106,1021.5106,211.6665,290.9771666666667,253.47716666666668,0.0,0.0,37.5,1800.0,0.0,0.0,1051.4086666666667,1304.1400225,525.7043333333334,760.4315,290.9771666666667,1051.4086666666667,869.4266816666667,506.95433333333335,0.0,0.0,0.0,0.9,0.1,0.0,0.0,0.0,0.0,0.0,0.0,0.0,0.0,0.0,0.0,0.0,0.0,0.0,0.0,0.0,0.0,0.0,0.0,0.0,0.0,-2.7755575615628914E-17,
783.09,548.163,234.927,1020.39,0.22,0.28,0.23,0.35,1020.39,1020.39,117.4635,259.3755,221.8755,37.5,0.0,37.5,1800.0,0.0,0.0,925.002,1141.5494475,462.501,665.6265,259.3755,925.002,761.032965,443.751,0.0,0.0,0.0,0.0,0.4,0.3,0.1,0.0,0.1,0.0,0.1,0.0,0.0,0.0,0.0,0.0,0.0,0.0,0.0,0.0,0.0,0.0,0.0,0.0,0.0,-2.7755575615628914E-17,
782.58,547.806,234.774,1019.7255,0.22,0.28,0.23,0.35,1019.7255,1019.7255,211.2966,253.03420000000003,253.03420000000003,75.0,0.0,0.0,1800.0,0.0,0.0,1012.1368000000001,867.9073060000001,506.06840000000005,759.1026,253.03420000000003,1012.1368000000001,867.9073060000001,506.06840000000005,0.0,0.0,0.0,0.0,0.0,0.5,0.3,0.1,0.0,0.0,0.1,0.0,0.0,0.0,0.0,0.0,0.0,0.0,0.0,0.0,0.0,0.0,0.0,0.0,0.0,0.0,
783.55,548.485,235.065,1020.9894,0.22,0.28,0.23,0.35,1020.9894,1020.9894,117.5325,222.00583333333336,222.00583333333336,75.0,0.0,0.0,1800.0,0.0,0.0,888.0233333333334,761.4800083333333,444.0116666666667,666.0175,222.00583333333336,888.0233333333334,761.4800083333333,444.0116666666667,0.0,0.0,0.0,0.0,0.0,0.0,0.1,0.4,0.3,0.1,0.1,0.0,0.0,0.0,0.0,0.0,0.0,0.0,0.0,0.0,0.0,0.0,0.0,0.0,0.0,0.0,
787.69,551.383,236.307,1026.3839,0.22,0.28,0.23,0.35,1026.3839,1026.3839,189.0456,246.80953333333335,246.80953333333335,75.0,0.0,0.0,1800.0,0.0,0.0,987.2381333333334,846.5566993333334,493.6190666666667,740.4286000000001,246.80953333333335,987.2381333333334,846.5566993333334,493.6190666666667,0.0,0.0,0.0,0.0,0.0,0.0,0.0,0.3,0.7,0.0,0.0,0.0,0.0,0.0,0.0,0.0,0.0,0.0,0.0,0.0,0.0,0.0,0.0,0.0,0.0,0.0,
791.8299999999999,554.281,237.549,1031.7785,0.22,0.22,0.23,0.35,1031.7785,1031.7785,427.58820000000003,327.28973333333334,327.28973333333334,75.0,0.0,0.0,1800.0,0.0,0.0,1309.1589333333334,1122.6037853333332,654.5794666666667,981.8692,327.28973333333334,1309.1589333333334,1122.6037853333332,654.5794666666667,0.0,0.0,0.0,0.0,0.0,0.0,0.0,0.0,0.7,0.3,0.0,0.0,0.0,0.0,0.0,0.0,0.0,0.0,0.0,0.0,0.0,0.0,0.0,0.0,0.0,5.551115123125783E-17,
796.24,557.368,238.872,1037.5248,0.22,0.22,0.35,0.35,1037.5248,1037.5248,214.9848,257.45093333333335,257.45093333333335,75.0,0.0,0.0,1800.0,0.0,0.0,1029.8037333333334,883.0567013333334,514.9018666666667,772.3528000000001,257.45093333333335,1029.8037333333334,883.0567013333334,514.9018666666667,0.0,0.0,0.0,0.0,0.0,0.0,0.0,0.0,0.0,0.5,0.4,0.0,0.1,0.0,0.0,0.0,0.0,0.0,0.0,0.0,0.0,0.0,0.0,0.0,0.0,-2.7755575615628914E-17,
800.6800000000001,560.476,240.204,1043.3103,0.22,0.22,0.35,0.35,1043.3103,1043.3103,336.28560000000004,298.92053333333337,298.92053333333337,75.0,0.0,0.0,1800.0,0.0,0.0,1195.6821333333335,1025.2974293333334,597.8410666666667,896.7616,298.92053333333337,1195.6821333333335,1025.2974293333334,597.8410666666667,0.0,0.0,0.0,0.0,0.0,0.0,0.0,0.0,0.0,0.0,0.7,0.3,0.0,0.0,0.0,0.0,0.0,0.0,0.0,0.0,0.0,0.0,0.0,0.0,0.0,5.551115123125783E-17,
803.93,562.751,241.179,1047.5452,0.25,0.22,0.35,0.35,1047.5452,1047.5452,217.0611,259.93736666666666,259.93736666666666,75.0,0.0,0.0,1800.0,0.0,0.0,1039.7494666666666,891.5851676666666,519.8747333333333,779.8121,259.93736666666666,1039.7494666666666,891.5851676666666,519.8747333333333,0.0,0.0,0.0,0.0,0.0,0.0,0.0,0.0,0.0,0.0,0.0,0.6,0.2,0.2,0.0,0.0,0.0,0.0,0.0,0.0,0.0,0.0,0.0,0.0,0.0,0.0,
805.83,564.081,241.749,1050.0209,0.26,0.22,0.35,0.35,1050.0209,1050.0209,169.2243,244.4351,244.4351,75.0,0.0,0.0,1800.0,0.0,0.0,977.7404,838.412393,488.8702,733.3053,244.4351,977.7404,838.412393,488.8702,0.0,0.0,0.0,0.0,0.0,0.0,0.0,0.0,0.0,0.0,0.0,0.0,0.4,0.1,0.0,0.1,0.4,0.0,0.0,0.0,0.0,0.0,0.0,0.0,0.0,0.0,
807.7,565.39,242.31,1052.4576,0.26,0.22,0.35,0.35,1052.4576,1052.4576,193.848,253.07933333333335,253.07933333333335,75.0,0.0,0.0,1800.0,0.0,0.0,1012.3173333333334,868.0621133333334,506.1586666666667,759.238,253.07933333333335,1012.3173333333334,868.0621133333334,506.1586666666667,0.0,0.0,0.0,0.0,0.0,0.0,0.0,0.0,0.0,0.0,0.0,0.0,0.0,0.5,0.1,0.0,0.2,0.0,0.1,0.1,0.0,0.0,0.0,0.0,0.0,0.0,
808.8199999999999,566.174,242.646,1053.917,0.26,0.22,0.35,0.35,1053.917,1053.917,169.85219999999998,245.34206666666668,245.34206666666668,75.0,0.0,0.0,1800.0,0.0,0.0,981.3682666666667,841.5232886666666,490.68413333333336,736.0262,245.34206666666668,981.3682666666667,841.5232886666666,490.68413333333336,0.0,0.0,0.0,0.0,0.0,0.0,0.0,0.0,0.0,0.0,0.0,0.0,0.0,0.0,0.6,0.2,0.0,0.0,0.1,0.1,0.0,0.0,0.0,0.0,0.0,0.0,
809.9399999999999,566.958,242.982,1055.3764,0.26,0.22,0.35,0.35,1055.3764,1055.3764,145.7892,237.5824,237.5824,75.0,0.0,0.0,1800.0,0.0,0.0,950.3296,814.907632,475.1648,712.7472,237.5824,950.3296,814.907632,475.1648,0.0,0.0,0.0,0.0,0.0,0.0,0.0,0.0,0.0,0.0,0.0,0.0,0.0,0.0,0.0,0.3,0.1,0.1,0.3,0.0,0.2,0.0,0.0,0.0,0.0,0.0,
810.6500000000001,567.455,243.195,1056.3015,0.25,0.22,0.31,0.35,1056.3015,1056.3015,170.2365,245.89716666666666,245.89716666666666,75.0,0.0,0.0,1800.0,0.0,0.0,983.5886666666667,843.4272816666667,491.7943333333333,737.6915,245.89716666666666,983.5886666666667,843.4272816666667,491.7943333333333,0.0,0.0,0.0,0.0,0.0,0.0,0.0,0.0,0.0,0.0,0.0,0.0,0.0,0.0,0.0,0.0,0.0,0.1,0.8,0.0,0.0,0.0,0.1,0.0,0.0,-2.7755575615628914E-17,
811.11,567.777,243.333,1300.0,0.22,0.27,0.31,0.35,1300.0,1056.9009,218.99970000000002,262.25890000000004,262.25890000000004,75.0,0.0,0.0,1800.0,0.0,0.0,1049.0356000000002,899.5480270000002,524.5178000000001,786.7767000000001,262.25890000000004,1049.0356000000002,899.5480270000002,524.5178000000001,0.0,0.0,0.0,0.0,0.0,0.0,0.0,0.0,0.0,0.0,0.0,0.0,0.0,0.0,0.0,0.0,0.0,0.7,0.2,0.0,0.0,0.0,0.0,0.1,0.0,2.7755575615628914E-17,
811.45,568.015,243.435,1300.0,0.22,0.27,0.31,0.35,1300.0,1057.3439,608.5875000000001,392.2008333333333,392.2008333333333,75.0,0.0,0.0,1800.0,0.0,0.0,1568.8033333333333,1345.2488583333334,784.4016666666666,1176.6025,392.2008333333333,1568.8033333333333,1345.2488583333334,784.4016666666666,0.0,0.0,0.0,0.0,0.0,0.0,0.0,0.0,0.0,0.0,0.0,0.0,0.0,0.0,0.0,0.0,0.0,0.0,1.0,0.0,0.0,0.0,0.0,0.0,0.0,0.0,
811.3100000000001,567.917,243.393,1300.0,0.22,0.27,0.31,0.35,1300.0,1057.1615,146.0358,237.98426666666668,237.98426666666668,75.0,0.0,0.0,1800.0,0.0,0.0,951.9370666666667,816.2860346666666,475.96853333333337,713.9528,237.98426666666668,951.9370666666667,816.2860346666666,475.96853333333337,0.0,0.0,0.0,0.0,0.0,0.0,0.0,0.0,0.0,0.0,0.0,0.0,0.0,0.0,0.0,0.0,0.0,0.0,0.0,0.4,0.4,0.1,0.0,0.1,0.0,-5.551115123125783E-17,
811.17,567.819,243.351,1300.0,0.22,0.27,0.31,0.35,1300.0,1056.9791,146.0106,237.94320000000002,237.94320000000002,75.0,0.0,0.0,1800.0,0.0,0.0,951.7728000000001,816.145176,475.88640000000004,713.8296,237.94320000000002,951.7728000000001,816.145176,475.88640000000004,0.0,0.0,0.0,0.0,0.0,0.0,0.0,0.0,0.0,0.0,0.0,0.0,0.0,0.0,0.0,0.0,0.0,0.0,0.0,0.0,0.0,0.1,0.0,0.3,0.2,0.4,
811.62,568.134,243.486,1300.0,0.22,0.27,0.31,0.35,1300.0,1057.5655,194.7888,254.3076,254.3076,75.0,0.0,0.0,1800.0,0.0,0.0,1017.2304,872.275068,508.6152,762.9228,254.3076,1017.2304,872.275068,508.6152,0.0,0.0,0.0,0.0,0.0,0.0,0.0,0.0,0.0,0.0,0.0,0.0,0.0,0.0,0.0,0.0,0.0,0.0,0.0,0.0,0.0,0.6,0.4,0.0,0.0,0.0,
812.2700000000001,568.589,243.681,1058.4124,0.22,0.27,0.31,0.35,1058.4124,1058.4124,170.57670000000002,246.38856666666666,246.38856666666666,75.0,0.0,0.0,1800.0,0.0,0.0,985.5542666666666,845.1127836666667,492.7771333333333,739.1657,246.38856666666666,985.5542666666666,845.1127836666667,492.7771333333333,0.0,0.0,0.0,0.0,0.0,0.0,0.0,0.0,0.0,0.0,0.0,0.0,0.0,0.0,0.0,0.0,0.0,0.0,0.0,0.0,0.0,0.0,0.2,0.8,0.0,0.0,
813.62,569.534,244.086,1060.1715,0.3,0.27,0.31,0.35,1060.1715,1060.1715,536.9892000000001,368.8410666666667,368.8410666666667,75.0,0.0,0.0,1800.0,0.0,0.0,1475.3642666666667,1265.1248586666668,737.6821333333334,1106.5232,368.8410666666667,1475.3642666666667,1265.1248586666668,737.6821333333334,0.0,0.0,0.0,0.0,0.0,0.0,0.0,0.0,0.0,0.0,0.0,0.0,0.0,0.0,0.0,0.0,0.0,0.0,0.0,0.0,0.0,0.0,0.0,0.9,0.1,-2.7755575615628914E-17,
816.3399999999999,571.438,244.902,1063.7158,0.3,0.27,0.31,0.35,1063.7158,1063.7158,171.4314,247.62313333333336,247.62313333333336,75.0,0.0,0.0,1800.0,0.0,0.0,990.4925333333334,849.3473473333333,495.2462666666667,742.8694,247.62313333333336,990.4925333333334,849.3473473333333,495.2462666666667,0.0,0.0,0.0,0.0,0.0,0.0,0.0,0.0,0.0,0.0,0.0,0.0,0.0,0.0,0.0,0.0,0.0,0.0,0.0,0.0,0.0,0.0,0.0,0.0,0.4,0.6,
819.06,573.342,245.718,1067.26,0.3,0.27,0.31,0.35,1067.26,1067.26,491.4359999999999,354.92599999999993,354.92599999999993,75.0,0.0,0.0,1800.0,0.0,0.0,1419.7039999999997,1217.3961799999997,709.8519999999999,1064.7779999999998,354.92599999999993,1419.7039999999997,1217.3961799999997,709.8519999999999,0.0,0.0,0.0,0.0,0.0,0.0,0.0,0.0,0.0,0.0,0.0,0.0,0.0,0.0,0.0,0.0,0.0,0.0,0.0,0.0,0.0,0.0,0.0,0.0,0.0,1.0,
MAX_T, 24.0,
f_ESD, 1.0,
ESD_MAX, 1800.0,
f_TES, 1.0,
TES_MAX, 75.0,
TES_R, 1.0,
TES_D, 1.0,
ESD_R, 1.0,
ESD_D, 1.0,
MAX_DIS_TES, 75.0,
MAX_DIS_ESD, 1000.0,
DoD, 0.4,
MAX_IT, 780.0,
COP_C, 3.0,
COP_H, 4.43,
MAX_HOST, 100.0,
MAX_Relocate, 100.0,
relocateActive, 0.0,
TES_INIT, 75.0,
ESD_INIT, 1800.0,
ESD_FIN, 1800.0,
TES_FIN, 75.0,
WE, 0.0,
WF, 0.0,
WT, 0.0,
WL, 0.0,
WREN, 1.0,
E_D_Percentage, 0.1


