E_Total, Real_Time_Workload, Delay_Tolerant_Workload, REN, Energy_Price, L_Price, T_Price, D_Price, DR_Signal, Baseline, Delay_Tolerant_Executed, Total Cooling, IT Cooling, TES, D_TES, R_TES, ESD, D_ESD, R_ESD, DC Demand, DC Thermal Generation(Adapted Heat), Adapted CO2, Adapted Server, Adapted Cooling, Adapted DC, Baseline Heat, Baseline CO2,  Relocated, Hosted, Y
623.7792999999999,561.4014,62.3779,0.0,0.22,0.28,0.23,0.35,720.0,726.8833,56.14011,102.07297685950414,102.07297685950414,75.0,0.0,0.0,1800.0,0.0,0.0,719.6144868595042,350.11031062809917,359.8072434297521,617.54151,102.07297685950414,719.6144868595042,350.11031062809917,359.8072434297521,0.0,0.0,0.9,0.0,0.0,0.0,0.1,0.0,0.0,0.0,0.0,0.0,0.0,0.0,0.0,0.0,0.0,0.0,0.0,0.0,0.0,0.0,0.0,0.0,0.0,-2.7755575615628914E-17,
657.4649999999999,591.7185,65.7465,0.0,0.22,0.28,0.23,0.35,720.0,766.1369,13.1493,99.97814876033058,99.97814876033058,75.0,0.0,0.0,1800.0,0.0,0.0,704.8459487603305,342.9250502479339,352.4229743801653,604.8678,99.97814876033058,704.8459487603305,342.9250502479339,352.4229743801653,0.0,0.0,0.0,0.2,0.0,0.1,0.0,0.3,0.1,0.0,0.0,0.2,0.1,0.0,0.0,0.0,0.0,0.0,0.0,0.0,0.0,0.0,0.0,0.0,0.0,2.7755575615628914E-17,
643.8794,579.4915,64.3879,0.0,0.22,0.28,0.23,0.35,720.0,750.3059,6.438790000000001,96.84798181818182,96.84798181818182,75.0,0.0,0.0,1800.0,0.0,0.0,682.7782718181818,332.1885776363636,341.3891359090909,585.93029,96.84798181818182,682.7782718181818,332.1885776363636,341.3891359090909,0.0,0.0,0.0,0.0,0.1,0.0,0.1,0.1,0.4,0.0,0.1,0.0,0.1,0.0,0.1,0.0,0.0,0.0,0.0,0.0,0.0,0.0,0.0,0.0,0.0,2.7755575615628914E-17,
630.0046,567.0041,63.0005,0.0,0.22,0.28,0.23,0.35,720.0,734.1375,12.600100000000001,95.80234710743802,95.80234710743802,75.0,0.0,0.0,1800.0,0.0,0.0,675.406547107438,328.6020505785124,337.703273553719,579.6042,95.80234710743802,675.406547107438,328.6020505785124,337.703273553719,0.0,0.0,0.0,0.0,0.0,0.1,0.0,0.0,0.0,0.2,0.5,0.2,0.0,0.0,0.0,0.0,0.0,0.0,0.0,0.0,0.0,0.0,0.0,0.0,0.0,-5.551115123125783E-17,
643.5399,579.1859,64.354,0.0,0.22,0.28,0.23,0.35,720.0,749.9101,12.870800000000001,97.86061157024794,97.86061157024794,75.0,0.0,0.0,1800.0,0.0,0.0,689.9173115702479,335.6618976859504,344.95865578512394,592.0567,97.86061157024794,689.9173115702479,335.6618976859504,344.95865578512394,0.0,0.0,0.0,0.0,0.0,0.0,0.0,0.1,0.1,0.1,0.2,0.1,0.1,0.0,0.3,0.0,0.0,0.0,0.0,0.0,0.0,0.0,0.0,0.0,0.0,5.551115123125783E-17,
619.6511,557.686,61.9651,0.0,0.22,0.28,0.23,0.35,720.0,722.0728,37.17906,98.32480330578514,98.32480330578514,75.0,0.0,0.0,1800.0,0.0,0.0,693.1898633057853,337.254075338843,346.5949316528926,594.8650600000001,98.32480330578514,693.1898633057853,337.254075338843,346.5949316528926,0.0,0.0,0.0,0.0,0.0,0.0,0.0,0.1,0.0,0.1,0.2,0.1,0.2,0.3,0.0,0.0,0.0,0.0,0.0,0.0,0.0,0.0,0.0,0.0,0.0,1.1102230246251565E-16,
626.8737,564.1863,62.6874,0.0,0.22,0.22,0.23,0.35,720.0,730.4892,37.61244,99.47086611570248,99.47086611570248,75.0,0.0,0.0,1800.0,0.0,0.0,701.2696061157025,341.18507077685945,350.63480305785123,601.79874,99.47086611570248,701.2696061157025,341.18507077685945,350.63480305785123,0.0,0.0,0.0,0.0,0.0,0.0,0.0,0.0,0.0,0.2,0.1,0.1,0.2,0.3,0.1,0.0,0.0,0.0,0.0,0.0,0.0,0.0,0.0,0.0,0.0,8.326672684688674E-17,
657.7873,592.0086,65.7787,0.0,0.22,0.22,0.35,0.35,720.0,766.5126,39.467220000000005,29.37616859504132,104.37616859504132,75.0,75.0,0.0,1800.0,0.0,0.0,660.8519885950413,0.0,330.4259942975207,631.47582,29.37616859504132,660.8519885950413,358.0102582809917,367.9259942975207,0.0,0.0,0.0,0.0,0.0,0.0,0.0,0.0,0.0,0.0,0.2,0.2,0.2,0.1,0.1,0.1,0.0,0.1,0.0,0.0,0.0,0.0,0.0,0.0,0.0,2.7755575615628914E-17,
644.1261,579.7135,64.4126,0.0,0.22,0.22,0.35,0.35,870.0,750.5933,103.06016,140.35515041322313,112.85515041322313,0.0,0.0,27.5,1800.0,0.0,0.0,823.128810413223,529.027326753719,411.5644052066115,682.77366,140.35515041322313,823.128810413223,387.09316591735535,397.8144052066115,0.0,0.0,0.0,0.0,0.0,0.0,0.0,0.0,0.0,0.0,0.3,0.1,0.2,0.2,0.1,0.1,0.0,0.0,0.0,0.0,0.0,0.0,0.0,0.0,0.0,-5.551115123125783E-17,
667.8683,601.0815,66.7868,0.0,0.25,0.22,0.35,0.35,870.0,778.2598,73.46548,138.99536859504133,111.49536859504131,27.5,0.0,27.5,1800.0,0.0,0.0,813.5423485950413,522.6531228506886,406.77117429752064,674.54698,138.99536859504133,813.5423485950413,382.4291142809917,393.02117429752064,0.0,0.0,0.0,0.0,0.0,0.0,0.0,0.0,0.0,0.0,0.0,0.1,0.4,0.4,0.1,0.0,0.0,0.0,0.0,0.0,0.0,0.0,0.0,0.0,0.0,-2.7755575615628914E-17,
626.4902,563.8412,62.649,0.0,0.26,0.22,0.35,0.35,870.0,730.0423,119.03310000000002,112.87178512396693,112.87178512396693,55.0,0.0,0.0,1800.0,0.0,0.0,795.7460851239669,387.1502229752066,397.8730425619834,682.8743,112.87178512396693,795.7460851239669,387.1502229752066,397.8730425619834,0.0,0.0,0.0,0.0,0.0,0.0,0.0,0.0,0.0,0.0,0.0,0.0,0.4,0.1,0.2,0.3,0.0,0.0,0.0,0.0,0.0,0.0,0.0,0.0,0.0,0.0,
659.4917,593.5425,65.9492,0.0,0.26,0.22,0.35,0.35,870.0,768.4986,105.51872000000002,115.5473090909091,115.5473090909091,55.0,0.0,0.0,1800.0,0.0,0.0,814.6085290909091,396.3272701818182,407.30426454545454,699.06122,115.5473090909091,814.6085290909091,396.3272701818182,407.30426454545454,0.0,0.0,0.0,0.0,0.0,0.0,0.0,0.0,0.0,0.0,0.0,0.0,0.0,0.2,0.3,0.3,0.2,0.0,0.0,0.0,0.0,0.0,0.0,0.0,0.0,0.0,
642.5394,578.2855,64.2539,0.0,0.26,0.22,0.35,0.35,870.0,748.7443,115.65701999999999,114.70124297520661,114.70124297520661,55.0,0.0,0.0,1800.0,0.0,0.0,808.6437629752065,393.4252634049586,404.32188148760326,693.94252,114.70124297520661,808.6437629752065,393.4252634049586,404.32188148760326,0.0,0.0,0.0,0.0,0.0,0.0,0.0,0.0,0.0,0.0,0.0,0.0,0.0,0.0,0.5,0.4,0.1,0.0,0.0,0.0,0.0,0.0,0.0,0.0,0.0,-2.7755575615628914E-17,
618.9147999999999,557.0233,61.8915,0.0,0.26,0.22,0.35,0.35,870.0,721.2147,136.1613,114.57596694214875,114.57596694214875,55.0,0.0,0.0,1800.0,0.0,0.0,807.7605669421487,392.9955666115702,403.88028347107434,693.1845999999999,114.57596694214875,807.7605669421487,392.9955666115702,403.88028347107434,0.0,0.0,0.0,0.0,0.0,0.0,0.0,0.0,0.0,0.0,0.0,0.0,0.0,0.0,0.0,1.0,0.0,0.0,0.0,0.0,0.0,0.0,0.0,0.0,0.0,0.0,
663.0247,596.7222,66.3025,0.0,0.25,0.22,0.31,0.35,870.0,772.6155,86.19324999999999,112.87858677685952,112.87858677685952,55.0,0.0,0.0,1800.0,0.0,0.0,795.7940367768596,387.1735526446281,397.8970183884298,682.9154500000001,112.87858677685952,795.7940367768596,387.1735526446281,397.8970183884298,0.0,0.0,0.0,0.0,0.0,0.0,0.0,0.0,0.0,0.0,0.0,0.0,0.0,0.0,0.0,0.0,1.0,0.0,0.0,0.0,0.0,0.0,0.0,0.0,0.0,0.0,
645.5794,581.0215,64.5579,0.0,0.22,0.27,0.31,0.35,770.0,752.2868,51.64632,104.57319338842974,104.57319338842974,55.0,0.0,0.0,1800.0,0.0,0.0,737.2410133884297,358.68605332231397,368.62050669421484,632.6678199999999,104.57319338842974,737.2410133884297,358.68605332231397,368.62050669421484,0.0,0.0,0.0,0.0,0.0,0.0,0.0,0.0,0.0,0.0,0.0,0.0,0.0,0.0,0.0,0.0,0.0,0.7,0.1,0.2,0.0,0.0,0.0,0.0,0.0,2.7755575615628914E-17,
631.8607000000001,568.6746,63.1861,0.0,0.22,0.27,0.31,0.35,770.0,736.3004,56.867490000000004,103.39538677685951,103.39538677685951,55.0,0.0,0.0,1800.0,0.0,0.0,728.9374767768595,354.6461766446281,364.46873838842976,625.54209,103.39538677685951,728.9374767768595,354.6461766446281,364.46873838842976,0.0,0.0,0.0,0.0,0.0,0.0,0.0,0.0,0.0,0.0,0.0,0.0,0.0,0.0,0.0,0.0,0.0,0.0,0.8,0.0,0.1,0.1,0.0,0.0,0.0,-5.551115123125783E-17,
655.1591999999999,589.6433,65.5159,0.0,0.22,0.27,0.31,0.35,770.0,763.4499,52.41272,106.12496198347108,106.12496198347108,55.0,0.0,0.0,1800.0,0.0,0.0,748.180981983471,364.00861960330576,374.0904909917355,642.05602,106.12496198347108,748.180981983471,364.00861960330576,374.0904909917355,0.0,0.0,0.0,0.0,0.0,0.0,0.0,0.0,0.0,0.0,0.0,0.0,0.0,0.0,0.0,0.0,0.0,0.0,0.0,0.6,0.4,0.0,0.0,0.0,0.0,0.0,
649.1098999999999,584.1989,64.911,0.0,0.22,0.27,0.31,0.35,770.0,756.4007,71.40209999999999,108.36380165289256,108.36380165289256,55.0,0.0,0.0,1800.0,0.0,0.0,763.9648016528926,371.68783966942146,381.9824008264463,655.601,108.36380165289256,763.9648016528926,371.68783966942146,381.9824008264463,0.0,0.0,0.0,0.0,0.0,0.0,0.0,0.0,0.0,0.0,0.0,0.0,0.0,0.0,0.0,0.0,0.0,0.0,0.0,0.0,0.6,0.3,0.1,0.0,0.0,2.7755575615628914E-17,
618.5392999999999,556.6854,61.8539,0.0,0.22,0.27,0.31,0.35,770.0,720.7772,61.85390000000001,102.23790082644626,102.23790082644626,55.0,0.0,0.0,1800.0,0.0,0.0,720.7772008264462,350.6759998347107,360.3886004132231,618.5392999999999,102.23790082644626,720.7772008264462,350.6759998347107,360.3886004132231,0.0,0.0,0.0,0.0,0.0,0.0,0.0,0.0,0.0,0.0,0.0,0.0,0.0,0.0,0.0,0.0,0.0,0.0,0.0,0.0,0.0,0.6,0.1,0.2,0.1,2.7755575615628914E-17,
612.2026999999999,550.9824,61.2203,0.0,0.22,0.27,0.31,0.35,770.0,713.3932,67.34233,102.20243471074382,102.20243471074382,55.0,0.0,0.0,1800.0,0.0,0.0,720.5271647107438,350.55435105785125,360.2635823553719,618.32473,102.20243471074382,720.5271647107438,350.55435105785125,360.2635823553719,0.0,0.0,0.0,0.0,0.0,0.0,0.0,0.0,0.0,0.0,0.0,0.0,0.0,0.0,0.0,0.0,0.0,0.0,0.0,0.0,0.0,0.0,0.9,0.0,0.1,-2.7755575615628914E-17,
609.8480999999999,548.8633,60.9848,0.0,0.3,0.27,0.31,0.35,750.0,710.6495,67.08328,101.80935206611571,101.80935206611571,55.0,0.0,0.0,1800.0,0.0,0.0,717.7559320661157,349.20607758677687,358.8779660330579,615.94658,101.80935206611571,717.7559320661157,349.20607758677687,358.8779660330579,0.0,0.0,0.0,0.0,0.0,0.0,0.0,0.0,0.0,0.0,0.0,0.0,0.0,0.0,0.0,0.0,0.0,0.0,0.0,0.0,0.0,0.0,0.0,0.9,0.0,0.09999999999999998,
610.2099,549.1889,61.021,0.0,0.3,0.27,0.31,0.35,750.0,711.071,73.2252,102.87836363636363,102.87836363636363,55.0,0.0,0.0,1800.0,0.0,0.0,725.2924636363635,352.87278727272724,362.6462318181818,622.4141,102.87836363636363,725.2924636363635,352.87278727272724,362.6462318181818,0.0,0.0,0.0,0.0,0.0,0.0,0.0,0.0,0.0,0.0,0.0,0.0,0.0,0.0,0.0,0.0,0.0,0.0,0.0,0.0,0.0,0.0,0.0,0.0,1.0,0.0,
610.3606,549.3245,61.0361,0.0,0.3,0.27,0.31,0.35,750.0,711.2466,67.13971000000001,101.89491074380165,101.89491074380165,55.0,0.0,0.0,1800.0,0.0,0.0,718.3591207438017,349.49954385123965,359.17956037190083,616.46421,101.89491074380165,718.3591207438017,349.49954385123965,359.17956037190083,0.0,0.0,0.0,0.0,0.0,0.0,0.0,0.0,0.0,0.0,0.0,0.0,0.0,0.0,0.0,0.0,0.0,0.0,0.0,0.0,0.0,0.0,0.0,0.0,0.0,1.0,
MAX_T, 24.0,
f_ESD, 1.0,
ESD_MAX, 1800.0,
f_TES, 1.0,
TES_MAX, 75.0,
TES_R, 1.0,
TES_D, 1.0,
ESD_R, 1.0,
ESD_D, 1.0,
MAX_DIS_TES, 75.0,
MAX_DIS_ESD, 1000.0,
DoD, 0.4,
MAX_IT, 780.0,
COP_C, 6.05,
COP_H, 4.43,
MAX_HOST, 100.0,
MAX_Relocate, 100.0,
relocateActive, 0.0,
TES_INIT, 75.0,
ESD_INIT, 1800.0,
ESD_FIN, 1800.0,
TES_FIN, 75.0,
WE, 0.0,
WF, 1.0,
WT, 0.0,
WL, 0.0,
WREN, 0.0,
E_D_Percentage, 0.1


