E_Total, Real_Time_Workload, Delay_Tolerant_Workload, REN, Energy_Price, L_Price, T_Price, D_Price, DR_Signal, Baseline, Delay_Tolerant_Executed, Total Cooling, IT Cooling, TES, D_TES, R_TES, ESD, D_ESD, R_ESD, DC Demand, DC Thermal Generation(Adapted Heat), Adapted CO2, Adapted Server, Adapted Cooling, Adapted DC, Baseline Heat, Baseline CO2,  Relocated, Hosted, Y
676.7167,609.045,67.6717,0.0,0.1,0.105,0.1,0.1,788.5707,788.5707,67.6717,36.854,111.854,75.0,75.0,0.0,1800.0,0.0,0.0,713.5707,0.0,356.78535,676.7167,36.854,713.5707,383.65921999999995,394.28535,0.0,0.0,1.0,0.0,0.0,0.0,0.0,0.0,0.0,0.0,0.0,0.0,0.0,0.0,0.0,0.0,0.0,0.0,0.0,0.0,0.0,0.0,0.0,0.0,0.0,0.0,
665.6170999999999,599.0554,66.5617,0.0,0.1,0.105,0.1,0.1,775.6365,775.6365,19.96851,139.81800165289258,102.31800165289256,0.0,0.0,37.5,1800.0,0.0,0.0,758.8419116528926,526.4261185041322,379.4209558264463,619.02391,139.81800165289258,758.8419116528926,350.95074566942145,360.6709558264463,0.0,0.0,0.0,0.3,0.0,0.1,0.3,0.1,0.1,0.0,0.0,0.0,0.0,0.1,0.0,0.0,0.0,0.0,0.0,0.0,0.0,0.0,0.0,0.0,0.0,-2.7755575615628914E-17,
664.1621,597.7459,66.4162,0.0,0.1,0.105,0.1,0.1,773.941,773.941,0.0,136.30097520661155,98.80097520661157,37.5,0.0,37.5,1800.0,0.0,0.0,734.0468752066115,508.3310174380165,367.02343760330575,597.7459,136.30097520661155,734.0468752066115,338.88734495867766,348.2734376033058,0.0,0.0,0.0,0.0,0.0,0.4,0.0,0.0,0.0,0.0,0.0,0.5,0.1,0.0,0.0,0.0,0.0,0.0,0.0,0.0,0.0,0.0,0.0,0.0,0.0,-2.7755575615628914E-17,
667.9416,601.1474,66.7942,0.0,0.1,0.105,0.1,0.1,778.3451,778.3451,33.3971,104.88338842975206,104.88338842975206,75.0,0.0,0.0,1800.0,0.0,0.0,739.427888429752,359.75002231404955,369.713944214876,634.5445,104.88338842975206,739.427888429752,359.75002231404955,369.713944214876,0.0,0.0,0.0,0.0,0.0,0.0,0.1,0.2,0.1,0.2,0.2,0.1,0.0,0.1,0.0,0.0,0.0,0.0,0.0,0.0,0.0,0.0,0.0,0.0,0.0,-5.551115123125783E-17,
662.394,596.1546,66.2394,0.0,0.1,0.105,0.1,0.1,771.8806,771.8806,39.74364,105.10714710743802,105.10714710743802,75.0,0.0,0.0,1800.0,0.0,0.0,741.005387107438,360.51751457851236,370.502693553719,635.89824,105.10714710743802,741.005387107438,360.51751457851236,370.502693553719,0.0,0.0,0.0,0.0,0.0,0.0,0.2,0.1,0.2,0.1,0.2,0.0,0.1,0.1,0.0,0.0,0.0,0.0,0.0,0.0,0.0,0.0,0.0,0.0,0.0,0.0,
665.0781,598.5703,66.5078,0.0,0.1,0.105,0.1,0.1,775.0084,775.0084,33.2539,104.43375206611572,104.43375206611572,75.0,0.0,0.0,1800.0,0.0,0.0,736.2579520661158,358.20776958677686,368.1289760330579,631.8242,104.43375206611572,736.2579520661158,358.20776958677686,368.1289760330579,0.0,0.0,0.0,0.0,0.0,0.0,0.0,0.1,0.2,0.1,0.4,0.1,0.1,0.0,0.0,0.0,0.0,0.0,0.0,0.0,0.0,0.0,0.0,0.0,0.0,-5.551115123125783E-17,
666.8246,600.1421,66.6825,0.0,0.1,0.105,0.1,0.1,777.0435,777.0435,46.67775,106.91237190082646,106.91237190082646,75.0,0.0,0.0,1800.0,0.0,0.0,753.7322219008265,366.7094356198347,376.86611095041326,646.8198500000001,106.91237190082646,753.7322219008265,366.7094356198347,376.86611095041326,0.0,0.0,0.0,0.0,0.0,0.0,0.0,0.0,0.1,0.0,0.1,0.4,0.0,0.1,0.1,0.1,0.1,0.0,0.0,0.0,0.0,0.0,0.0,0.0,0.0,2.7755575615628914E-17,
671.4008,604.2607,67.1401,0.0,0.1,0.105,0.1,0.1,782.3762,782.3762,33.57005,105.4265702479339,105.4265702479339,75.0,0.0,0.0,1800.0,0.0,0.0,743.257320247934,361.61313595041327,371.628660123967,637.8307500000001,105.4265702479339,743.257320247934,361.61313595041327,371.628660123967,0.0,0.0,0.0,0.0,0.0,0.0,0.0,0.0,0.0,0.1,0.0,0.2,0.2,0.0,0.4,0.0,0.1,0.0,0.0,0.0,0.0,0.0,0.0,0.0,0.0,-8.326672684688674E-17,
700.3317,630.2985,70.0332,0.0,0.1,0.105,0.1,0.347,870.0,816.089,105.04979999999999,121.54517355371901,121.54517355371901,75.0,0.0,0.0,1800.0,0.0,0.0,856.893473553719,416.89994528925615,428.4467367768595,735.3483,121.54517355371901,856.893473553719,416.89994528925615,428.4467367768595,0.0,0.0,0.0,0.0,0.0,0.0,0.0,0.0,0.0,0.0,0.6,0.0,0.3,0.0,0.1,0.0,0.0,0.0,0.0,0.0,0.0,0.0,0.0,0.0,0.0,2.7755575615628914E-17,
690.8752,621.7877,69.0875,0.0,0.1,0.105,0.1,0.347,870.0,805.0695,103.63125,119.90395867768595,119.90395867768595,75.0,0.0,0.0,1800.0,0.0,0.0,845.322908677686,411.2705782644628,422.661454338843,725.41895,119.90395867768595,845.322908677686,411.2705782644628,422.661454338843,0.0,0.0,0.0,0.0,0.0,0.0,0.0,0.0,0.0,0.0,0.0,0.2,0.3,0.3,0.1,0.1,0.0,0.0,0.0,0.0,0.0,0.0,0.0,0.0,0.0,0.0,
692.1043000000001,622.8939,69.2104,0.0,0.1,0.105,0.1,0.347,870.0,806.5018,117.65768000000001,122.40521983471076,122.40521983471076,75.0,0.0,0.0,1800.0,0.0,0.0,862.9567998347109,419.84990403305784,431.47839991735543,740.5515800000001,122.40521983471076,862.9567998347109,419.84990403305784,431.47839991735543,0.0,0.0,0.0,0.0,0.0,0.0,0.0,0.0,0.0,0.0,0.0,0.0,0.6,0.2,0.1,0.1,0.0,0.0,0.0,0.0,0.0,0.0,0.0,0.0,0.0,0.0,
687.092,618.3828,68.7092,0.0,0.1,0.105,0.1,0.347,870.0,800.661,109.93472,120.38306115702478,120.38306115702478,75.0,0.0,0.0,1800.0,0.0,0.0,848.7005811570248,412.913899768595,424.3502905785124,728.31752,120.38306115702478,848.7005811570248,412.913899768595,424.3502905785124,0.0,0.0,0.0,0.0,0.0,0.0,0.0,0.0,0.0,0.0,0.0,0.0,0.0,0.7,0.0,0.2,0.1,0.0,0.0,0.0,0.0,0.0,0.0,0.0,0.0,2.7755575615628914E-17,
687.2014,618.4813,68.7201,0.0,0.1,0.105,0.1,0.347,870.0,800.7885,109.95216000000002,120.40222479338844,120.40222479338844,75.0,0.0,0.0,1800.0,0.0,0.0,848.8356847933885,412.97963104132236,424.41784239669425,728.4334600000001,120.40222479338844,848.8356847933885,412.97963104132236,424.41784239669425,0.0,0.0,0.0,0.0,0.0,0.0,0.0,0.0,0.0,0.0,0.0,0.0,0.0,0.0,0.8,0.0,0.2,0.0,0.0,0.0,0.0,0.0,0.0,0.0,0.0,-5.551115123125783E-17,
698.905,629.0145,69.8905,0.0,0.1,0.105,0.1,0.347,870.0,814.4264,97.8467,120.14234710743803,120.14234710743803,75.0,0.0,0.0,1800.0,0.0,0.0,847.0035471074381,412.08825057851243,423.50177355371903,726.8612,120.14234710743803,847.0035471074381,412.08825057851243,423.50177355371903,0.0,0.0,0.0,0.0,0.0,0.0,0.0,0.0,0.0,0.0,0.0,0.0,0.0,0.0,0.0,0.9,0.1,0.0,0.0,0.0,0.0,0.0,0.0,0.0,0.0,-2.7755575615628914E-17,
685.1357,616.6221,68.5136,0.0,0.1,0.105,0.1,0.347,870.0,798.3813,109.62176,120.04030743801654,120.04030743801654,75.0,0.0,0.0,1800.0,0.0,0.0,846.2841674380165,411.7382545123967,423.14208371900827,726.24386,120.04030743801654,846.2841674380165,411.7382545123967,423.14208371900827,0.0,0.0,0.0,0.0,0.0,0.0,0.0,0.0,0.0,0.0,0.0,0.0,0.0,0.0,0.0,0.0,1.0,0.0,0.0,0.0,0.0,0.0,0.0,0.0,0.0,0.0,
675.7779,608.2001,67.5778,0.0,0.1,0.105,0.1,0.1,787.4767,787.4767,54.06224,109.46484958677686,109.46484958677686,75.0,0.0,0.0,1800.0,0.0,0.0,771.7271895867768,375.46443408264463,385.8635947933884,662.26234,109.46484958677686,771.7271895867768,375.46443408264463,385.8635947933884,0.0,0.0,0.0,0.0,0.0,0.0,0.0,0.0,0.0,0.0,0.0,0.0,0.0,0.0,0.0,0.0,0.0,0.8,0.1,0.0,0.0,0.0,0.1,0.0,0.0,-5.551115123125783E-17,
721.2163,649.0947,72.1216,0.0,0.1,0.105,0.1,0.1,840.4257,840.4257,72.1216,119.20930578512397,119.20930578512397,75.0,0.0,0.0,1800.0,0.0,0.0,840.425605785124,408.88791884297524,420.212802892562,721.2163,119.20930578512397,840.425605785124,408.88791884297524,420.212802892562,0.0,0.0,0.0,0.0,0.0,0.0,0.0,0.0,0.0,0.0,0.0,0.0,0.0,0.0,0.0,0.0,0.0,0.0,0.9,0.1,0.0,0.0,0.0,0.0,0.0,-2.7755575615628914E-17,
677.6048999999999,609.8444,67.7605,0.0,0.1,0.105,0.1,0.1,789.6056,789.6056,54.20839999999999,109.76079338842975,109.76079338842975,75.0,0.0,0.0,1800.0,0.0,0.0,773.8135933884297,376.479521322314,386.90679669421485,664.0527999999999,109.76079338842975,773.8135933884297,376.479521322314,386.90679669421485,0.0,0.0,0.0,0.0,0.0,0.0,0.0,0.0,0.0,0.0,0.0,0.0,0.0,0.0,0.0,0.0,0.0,0.0,0.0,0.7,0.3,0.0,0.0,0.0,0.0,5.551115123125783E-17,
669.6,602.64,66.96,0.0,0.1,0.105,0.1,0.1,780.2776,780.2776,66.96,110.67768595041323,110.67768595041323,75.0,0.0,0.0,1800.0,0.0,0.0,780.2776859504132,379.62446280991736,390.1388429752066,669.6,110.67768595041323,780.2776859504132,379.62446280991736,390.1388429752066,0.0,0.0,0.0,0.0,0.0,0.0,0.0,0.0,0.0,0.0,0.0,0.0,0.0,0.0,0.0,0.0,0.0,0.0,0.0,0.0,0.7,0.3,0.0,0.0,0.0,5.551115123125783E-17,
707.7166,636.9449,70.7717,0.0,0.1,0.105,0.1,0.1,824.6945,824.6945,70.7717,116.97795041322314,116.97795041322314,75.0,0.0,0.0,1800.0,0.0,0.0,824.6945504132232,401.23436991735537,412.3472752066116,707.7166,116.97795041322314,824.6945504132232,401.23436991735537,412.3472752066116,0.0,0.0,0.0,0.0,0.0,0.0,0.0,0.0,0.0,0.0,0.0,0.0,0.0,0.0,0.0,0.0,0.0,0.0,0.0,0.0,0.0,0.7,0.2,0.1,0.0,2.7755575615628914E-17,
714.5552,643.0997,71.4555,0.0,0.1,0.105,0.1,0.1,832.6636,832.6636,78.60105,119.28938016528926,119.28938016528926,75.0,0.0,0.0,1800.0,0.0,0.0,840.9901301652892,409.1625739669421,420.4950650826446,721.70075,119.28938016528926,840.9901301652892,409.1625739669421,420.4950650826446,0.0,0.0,0.0,0.0,0.0,0.0,0.0,0.0,0.0,0.0,0.0,0.0,0.0,0.0,0.0,0.0,0.0,0.0,0.0,0.0,0.0,0.0,0.8,0.2,0.0,-5.551115123125783E-17,
669.5912000000001,602.6321,66.9591,0.0,0.1,0.105,0.1,0.1,780.2675,780.2675,66.9591,110.6762314049587,110.6762314049587,75.0,0.0,0.0,1800.0,0.0,0.0,780.2674314049588,379.6194737190083,390.1337157024794,669.5912000000001,110.6762314049587,780.2674314049588,379.6194737190083,390.1337157024794,0.0,0.0,0.0,0.0,0.0,0.0,0.0,0.0,0.0,0.0,0.0,0.0,0.0,0.0,0.0,0.0,0.0,0.0,0.0,0.0,0.0,0.0,0.0,0.7,0.3,5.551115123125783E-17,
700.7854,630.7069,70.0785,0.0,0.1,0.105,0.1,0.1,816.6178,816.6178,84.0942,118.14894214876034,118.14894214876034,75.0,0.0,0.0,1800.0,0.0,0.0,832.9500421487603,405.2508715702479,416.47502107438015,714.8011,118.14894214876034,832.9500421487603,405.2508715702479,416.47502107438015,0.0,0.0,0.0,0.0,0.0,0.0,0.0,0.0,0.0,0.0,0.0,0.0,0.0,0.0,0.0,0.0,0.0,0.0,0.0,0.0,0.0,0.0,0.0,0.0,0.9,0.09999999999999998,
695.6734,626.1061,69.5673,0.0,0.1,0.105,0.1,0.1,810.6608,810.6608,76.52402999999998,116.13721157024794,116.13721157024794,75.0,0.0,0.0,1800.0,0.0,0.0,818.7673415702479,398.3506356859504,409.38367078512397,702.63013,116.13721157024794,818.7673415702479,398.3506356859504,409.38367078512397,0.0,0.0,0.0,0.0,0.0,0.0,0.0,0.0,0.0,0.0,0.0,0.0,0.0,0.0,0.0,0.0,0.0,0.0,0.0,0.0,0.0,0.0,0.0,0.0,0.0,1.0,
MAX_T, 24.0,
f_ESD, 1.0,
ESD_MAX, 1800.0,
f_TES, 1.0,
TES_MAX, 75.0,
TES_R, 1.0,
TES_D, 1.0,
ESD_R, 1.0,
ESD_D, 1.0,
MAX_DIS_TES, 75.0,
MAX_DIS_ESD, 1000.0,
DoD, 0.4,
MAX_IT, 780.0,
COP_C, 6.05,
COP_H, 4.43,
MAX_HOST, 100.0,
MAX_Relocate, 100.0,
relocateActive, 0.0,
TES_INIT, 75.0,
ESD_INIT, 1800.0,
ESD_FIN, 1800.0,
TES_FIN, 75.0,
WE, 0.0,
WF, 1.0,
WT, 0.0,
WL, 0.0,
WREN, 0.0,
E_D_Percentage, 0.1


