E_Total, Real_Time_Workload, Delay_Tolerant_Workload, Energy_Price, L_Price, T_Price, D_Price, DR_Signal, Baseline, Delay_Tolerant_Executed, Total Cooling, IT Cooling, TES, D_TES, R_TES, ESD, D_ESD, R_ESD, DC Demand, DC Thermal Generation(Adapted Heat), Adapted CO2, Adapted Server, Adapted Cooling, Adapted DC, Baseline Heat, Baseline CO2,  Relocated, Hosted, Y
0.23570000000000002,0.165,0.0707,0.25,0.23,0.23,0.23,0.2622,0.3072,0.06363,0.007621,0.007621,0.0,0.0,-0.0,0.0,0.0,-0.0,0.236251,0.026140029999999998,0.1181255,0.22863,0.007621,0.236251,0.026140029999999998,0.1181255,0.0,0.0,0.9,0.0,0.1,0.0,0.0,0.0,0.0,0.0,0.0,0.0,0.0,0.0,0.0,0.0,0.0,0.0,0.0,0.0,0.0,0.0,0.0,0.0,0.0,-2.7755575615628914E-17,
0.2352,0.1646,0.0706,0.26,0.23,0.23,0.23,0.2615,0.3065,0.05648,0.010702666666666668,0.010702666666666668,0.0,0.0,0.0,0.0,0.0,0.0,0.3317826666666667,0.036710146666666665,0.16589133333333336,0.22108,0.010702666666666668,0.3317826666666667,0.025276813333333332,0.11422466666666667,0.0,1.0,0.0,0.8,0.2,0.0,0.0,0.0,0.0,0.0,0.0,0.0,0.0,0.0,0.0,0.0,0.0,0.0,0.0,0.0,0.0,0.0,0.0,0.0,0.0,-5.551115123125783E-17,
0.2349,0.1644,0.0705,0.26,0.23,0.23,0.23,0.2611,0.3061,0.0282,0.009753333333333333,0.009753333333333333,0.0,0.0,0.0,0.0,0.0,0.0,0.3023533333333333,0.03345393333333333,0.15117666666666665,0.1926,0.009753333333333333,0.3023533333333333,0.022020599999999998,0.09951,0.0,1.0,0.0,0.0,0.1,0.2,0.1,0.3,0.2,0.1,0.0,0.0,0.0,0.0,0.0,0.0,0.0,0.0,0.0,0.0,0.0,0.0,0.0,0.0,0.0,-2.7755575615628914E-17,
0.23470000000000002,0.1643,0.0704,0.26,0.23,0.23,0.23,0.2609,0.3059,0.07744000000000001,0.010724666666666667,0.010724666666666667,0.0,0.0,0.0,0.0,0.0,0.0,0.3324646666666667,0.036785606666666665,0.16623233333333334,0.24174,0.010724666666666667,0.3324646666666667,0.02763894,0.12489900000000001,0.0,0.8,0.0,0.0,0.0,0.9,0.0,0.1,0.0,0.0,0.0,0.0,0.0,0.0,0.0,0.0,0.0,0.0,0.0,0.0,0.0,0.0,0.0,0.0,0.0,-2.7755575615628914E-17,
0.235,0.1645,0.0705,0.26,0.23,0.23,0.23,0.2613,0.3063,0.0423,0.009560000000000003,0.009560000000000003,0.0,0.0,0.0,0.0,0.0,0.0,0.29636000000000007,0.0327908,0.14818000000000003,0.2068,0.009560000000000003,0.29636000000000007,0.023644133333333334,0.10684666666666667,0.0,0.8,0.0,0.0,0.0,0.0,0.5,0.1,0.1,0.0,0.3,0.0,0.0,0.0,0.0,0.0,0.0,0.0,0.0,0.0,0.0,0.0,0.0,0.0,0.0,5.551115123125783E-17,
0.2363,0.1654,0.0709,0.25,0.23,0.23,0.23,0.2629,0.3079,0.06381,0.009640333333333334,0.009640333333333334,0.0,0.0,0.0,0.0,0.0,0.0,0.29885033333333333,0.03306634333333333,0.14942516666666666,0.22921,0.009640333333333334,0.29885033333333333,0.026206343333333333,0.11842516666666666,0.0,0.6000000000000001,0.0,0.0,0.0,0.0,0.0,0.4,0.5,0.0,0.1,0.0,0.0,0.0,0.0,0.0,0.0,0.0,0.0,0.0,0.0,0.0,0.0,0.0,0.0,-2.7755575615628914E-17,
0.2376,0.1663,0.0713,0.22,0.23,0.23,0.23,0.2645,0.3095,0.0713,0.009920000000000002,0.009920000000000002,0.0,0.0,0.0,0.0,0.0,0.0,0.30752,0.0340256,0.15376,0.2376,0.009920000000000002,0.30752,0.027165599999999998,0.12276000000000001,0.0,0.6000000000000001,0.0,0.0,0.0,0.0,0.0,0.0,0.2,0.0,0.0,0.3,0.4,0.1,0.0,0.0,0.0,0.0,0.0,0.0,0.0,0.0,0.0,0.0,0.0,-2.7755575615628914E-17,
0.2389,0.1672,0.0717,0.22,0.1,0.23,0.23,0.2663,0.3113,0.02151,0.008957,0.008957,0.0,0.0,0.0,0.0,0.0,0.0,0.277667,0.030722509999999998,0.1388335,0.18871,0.008957,0.277667,0.02157584333333333,0.09750016666666667,0.0,0.8,0.0,0.0,0.0,0.0,0.0,0.0,0.0,0.2,0.2,0.1,0.4,0.1,0.0,0.0,0.0,0.0,0.0,0.0,0.0,0.0,0.0,0.0,0.0,8.326672684688674E-17,
0.2402,0.1681,0.0721,0.22,0.1,0.23,0.23,0.268,0.313,0.05047,0.009952333333333334,0.009952333333333334,0.0,0.0,0.0,0.0,0.0,0.0,0.30852233333333334,0.03413650333333333,0.15426116666666667,0.21857,0.009952333333333334,0.30852233333333334,0.024989836666666664,0.11292783333333332,0.0,0.8,0.0,0.0,0.0,0.0,0.0,0.0,0.0,0.0,0.1,0.1,0.3,0.3,0.1,0.0,0.0,0.0,0.0,0.1,0.0,0.0,0.0,0.0,0.0,0.0,
0.24120000000000003,0.1688,0.0724,0.22,0.1,0.23,0.23,0.2693,0.3143,0.08688000000000001,0.010522666666666668,0.010522666666666668,0.0,0.0,0.0,0.0,0.0,0.0,0.3262026666666667,0.03609274666666667,0.16310133333333335,0.25568,0.010522666666666668,0.3262026666666667,0.029232746666666667,0.13210133333333335,0.0,0.6000000000000001,0.0,0.0,0.0,0.0,0.0,0.0,0.0,0.0,0.0,0.7,0.0,0.0,0.1,0.0,0.0,0.2,0.0,0.0,0.0,0.0,0.0,0.0,0.0,2.7755575615628914E-17,
0.24169999999999997,0.1692,0.0725,0.22,0.1,0.23,0.23,0.27,0.315,0.07974999999999999,0.010298333333333333,0.010298333333333333,0.0,0.0,0.0,0.0,0.0,0.0,0.31924833333333336,0.03532328333333333,0.15962416666666668,0.24894999999999998,0.010298333333333333,0.31924833333333336,0.02846328333333333,0.12862416666666665,0.0,0.6000000000000001,0.0,0.0,0.0,0.0,0.0,0.0,0.0,0.0,0.0,0.0,0.0,0.1,0.4,0.0,0.2,0.3,0.0,0.0,0.0,0.0,0.0,0.0,0.0,0.0,
0.24230000000000002,0.1696,0.0727,0.22,0.1,0.23,0.23,0.2707,0.3157,0.04362,0.010440666666666666,0.010440666666666666,0.0,0.0,0.0,0.0,0.0,0.0,0.32366066666666665,0.03581148666666666,0.16183033333333333,0.21322,0.010440666666666666,0.32366066666666665,0.024378153333333333,0.11016366666666666,0.0,1.0,0.0,0.0,0.0,0.0,0.0,0.0,0.0,0.0,0.0,0.0,0.0,0.0,0.0,0.2,0.1,0.3,0.1,0.0,0.1,0.2,0.0,0.0,0.0,2.7755575615628914E-17,
0.2427,0.1699,0.0728,0.22,0.1,0.23,0.23,0.2712,0.3162,0.043680000000000004,0.010452666666666666,0.010452666666666666,0.0,0.0,0.0,0.0,0.0,0.0,0.32403266666666664,0.03585264666666666,0.16201633333333332,0.21358,0.010452666666666666,0.32403266666666664,0.02441931333333333,0.11034966666666667,0.0,1.0,0.0,0.0,0.0,0.0,0.0,0.0,0.0,0.0,0.0,0.0,0.0,0.0,0.0,0.1,0.2,0.3,0.1,0.3,0.0,0.0,0.0,0.0,0.0,-5.551115123125783E-17,
0.243,0.1701,0.0729,0.22,0.1,0.23,0.23,0.2716,0.3166,0.021870000000000004,0.009065666666666668,0.009065666666666668,0.0,0.0,0.0,0.0,0.0,0.0,0.28103566666666674,0.03109523666666667,0.14051783333333337,0.19197,0.009065666666666668,0.28103566666666674,0.02194857,0.0991845,0.0,0.8,0.0,0.0,0.0,0.0,0.0,0.0,0.0,0.0,0.0,0.0,0.0,0.0,0.0,0.0,0.1,0.7,0.2,0.0,0.0,0.0,0.0,0.0,0.0,5.551115123125783E-17,
0.24319999999999997,0.1702,0.073,0.22,0.23,0.25,0.23,0.2719,0.3169,0.0438,0.009800000000000001,0.009800000000000001,0.0,0.0,0.0,0.0,0.0,0.0,0.3038,0.033614000000000005,0.1519,0.214,0.009800000000000001,0.3038,0.02446733333333333,0.11056666666666666,0.0,0.8,0.0,0.0,0.0,0.0,0.0,0.0,0.0,0.0,0.0,0.0,0.0,0.0,0.0,0.0,0.0,0.1,0.8,0.1,0.0,0.0,0.0,0.0,0.0,-2.7755575615628914E-17,
0.24330000000000002,0.1703,0.073,0.22,0.23,0.55,0.27,0.48,0.3171,0.146,0.013876666666666667,0.013876666666666667,0.0,0.0,0.0,0.0,0.0,0.0,0.43017666666666665,0.047596966666666664,0.21508833333333333,0.3163,0.013876666666666667,0.43017666666666665,0.036163633333333334,0.1634216666666667,0.0,1.0,0.0,0.0,0.0,0.0,0.0,0.0,0.0,0.0,0.0,0.0,0.0,0.0,0.0,0.0,0.0,0.1,0.2,0.5,0.2,0.0,0.0,0.0,0.0,-5.551115123125783E-17,
0.2434,0.1704,0.073,0.22,0.23,0.55,0.27,0.48,0.3172,0.1606,0.014366666666666665,0.014366666666666665,0.0,0.0,0.0,0.0,0.0,0.0,0.4453666666666666,0.04927766666666666,0.2226833333333333,0.33099999999999996,0.014366666666666665,0.4453666666666666,0.03784433333333333,0.17101666666666665,0.0,1.0,0.0,0.0,0.0,0.0,0.0,0.0,0.0,0.0,0.0,0.0,0.0,0.0,0.0,0.0,0.0,0.0,0.8,0.1,0.1,0.0,0.0,0.0,0.0,-5.551115123125783E-17,
0.2434,0.1704,0.073,0.3,0.28,0.55,0.27,0.48,0.3171,0.11679999999999999,0.012906666666666667,0.012906666666666667,0.0,0.0,0.0,0.0,0.0,0.0,0.40010666666666667,0.044269866666666664,0.20005333333333333,0.2872,0.012906666666666667,0.40010666666666667,0.032836533333333334,0.14838666666666667,0.0,1.0,0.0,0.0,0.0,0.0,0.0,0.0,0.0,0.0,0.0,0.0,0.0,0.0,0.0,0.0,0.0,0.0,0.0,0.5,0.3,0.2,0.0,0.0,0.0,0.0,
0.24330000000000002,0.1703,0.073,0.3,0.28,0.55,0.27,0.48,0.3171,0.12409999999999999,0.013146666666666666,0.013146666666666666,0.0,0.0,0.0,0.0,0.0,0.0,0.4075466666666666,0.04509306666666666,0.2037733333333333,0.2944,0.013146666666666666,0.4075466666666666,0.03365973333333333,0.15210666666666667,0.0,1.0,0.0,0.0,0.0,0.0,0.0,0.0,0.0,0.0,0.0,0.0,0.0,0.0,0.0,0.0,0.0,0.0,0.0,0.0,1.0,0.0,0.0,0.0,0.0,0.0,
0.2434,0.1704,0.073,0.3,0.28,0.55,0.27,0.48,0.3173,0.1022,0.012420000000000002,0.012420000000000002,0.0,0.0,0.0,0.0,0.0,0.0,0.38502000000000003,0.0426006,0.19251000000000001,0.2726,0.012420000000000002,0.38502000000000003,0.031167266666666665,0.14084333333333335,0.0,1.0,0.0,0.0,0.0,0.0,0.0,0.0,0.0,0.0,0.0,0.0,0.0,0.0,0.0,0.0,0.0,0.0,0.0,0.0,0.0,1.0,0.0,0.0,0.0,0.0,
0.2437,0.1706,0.0731,0.3,0.28,0.25,0.23,0.3175,0.3175,0.058480000000000004,0.010302666666666667,0.010302666666666667,0.0,0.0,0.0,0.0,0.0,0.0,0.3193826666666667,0.03533814666666667,0.15969133333333335,0.22908,0.010302666666666667,0.3193826666666667,0.02619148,0.118358,0.0,0.8,0.0,0.0,0.0,0.0,0.0,0.0,0.0,0.0,0.0,0.0,0.0,0.0,0.0,0.0,0.0,0.0,0.0,0.0,0.0,0.0,0.8,0.2,0.0,-5.551115123125783E-17,
0.24409999999999998,0.1709,0.0732,0.3,0.28,0.25,0.23,0.3181,0.3181,0.05124,0.010738,0.010738,0.0,0.0,0.0,0.0,0.0,0.0,0.332878,0.03683134,0.166439,0.22214,0.010738,0.332878,0.025398006666666667,0.11477233333333334,0.0,1.0,0.0,0.0,0.0,0.0,0.0,0.0,0.0,0.0,0.0,0.0,0.0,0.0,0.0,0.0,0.0,0.0,0.0,0.0,0.0,0.0,0.0,0.5,0.3,0.2,
0.2449,0.1714,0.0735,0.3,0.28,0.25,0.23,0.3191,0.3191,0.0882,0.011986666666666668,0.011986666666666668,0.0,0.0,0.0,0.0,0.0,0.0,0.3715866666666667,0.04111426666666667,0.18579333333333334,0.2596,0.011986666666666668,0.3715866666666667,0.029680933333333333,0.13412666666666667,0.0,1.0,0.0,0.0,0.0,0.0,0.0,0.0,0.0,0.0,0.0,0.0,0.0,0.0,0.0,0.0,0.0,0.0,0.0,0.0,0.0,0.0,0.0,0.0,0.9,0.09999999999999998,
0.24569999999999997,0.172,0.0737,0.3,0.28,0.25,0.23,0.3202,0.3202,0.09580999999999999,0.011593666666666667,0.011593666666666667,0.0,0.0,0.0,0.0,0.0,0.0,0.3594036666666667,0.03976627666666666,0.17970183333333334,0.26781,0.011593666666666667,0.3594036666666667,0.03061961,0.1383685,0.0,0.8,0.0,0.0,0.0,0.0,0.0,0.0,0.0,0.0,0.0,0.0,0.0,0.0,0.0,0.0,0.0,0.0,0.0,0.0,0.0,0.0,0.0,0.0,0.0,1.0,
MAX_T, 24.0,
f_ESD, 0.0,
ESD_MAX, 0.0,
f_TES, 0.0,
TES_MAX, 0.0,
TES_R, 0.0,
TES_D, 0.0,
ESD_R, 0.0,
ESD_D, 0.0,
MAX_DIS_TES, 0.0,
MAX_DIS_ESD, 0.0,
DoD, 0.0,
MAX_IT, 0.5,
COP_C, 30.0,
COP_H, 4.43,
MAX_HOST, 0.0,
MAX_Relocate, 0.1,
relocateActive, 1.0,
TES_INIT, 0.0,
ESD_INIT, 0.0,
ESD_FIN, 0.0,
TES_FIN, 0.0,
WE, 0.0,
WF, 1.0,
WT, 1.0,
WL, 0.0,
E_D_Percentage, 0.3


