2020-09-04T07:00:00.000Z,
BuyEnergy,SellHeat,DynamicAdjustmentOfCoolingIntensity,WorkloadRelocation,WorkloadHosting,
2020-09-04T09:00:00.000Z,
BuyEnergy,SellHeat,DynamicAdjustmentOfCoolingIntensity,WorkloadRelocation,WorkloadHosting,
2020-09-04T15:00:00.000Z,
BuyEnergy,SellHeat,DynamicAdjustmentOfCoolingIntensity,WorkloadRelocation,WorkloadHosting,
2020-09-04T17:00:00.000Z,
BuyEnergy,SellHeat,DynamicAdjustmentOfCoolingIntensity,WorkloadRelocation,WorkloadHosting,
2020-09-04T01:00:00.000Z,
BuyEnergy,SellHeat,DynamicAdjustmentOfCoolingIntensity,WorkloadRelocation,WorkloadHosting,
2020-09-04T10:00:00.000Z,
BuyEnergy,SellHeat,DynamicAdjustmentOfCoolingIntensity,WorkloadRelocation,WorkloadHosting,
2020-09-04T12:00:00.000Z,
BuyEnergy,SellHeat,DynamicAdjustmentOfCoolingIntensity,WorkloadRelocation,WorkloadHosting,
2020-09-04T19:00:00.000Z,
BuyEnergy,SellHeat,DynamicAdjustmentOfCoolingIntensity,WorkloadRelocation,WorkloadHosting,
2020-09-04T21:00:00.000Z,
BuyEnergy,SellHeat,DynamicAdjustmentOfCoolingIntensity,WorkloadRelocation,WorkloadHosting,
2020-09-04T02:00:00.000Z,
BuyEnergy,SellHeat,DynamicAdjustmentOfCoolingIntensity,WorkloadRelocation,WorkloadHosting,
2020-09-04T04:00:00.000Z,
BuyEnergy,SellHeat,DynamicAdjustmentOfCoolingIntensity,WorkloadRelocation,WorkloadHosting,
2020-09-04T18:00:00.000Z,
BuyEnergy,SellHeat,DynamicAdjustmentOfCoolingIntensity,WorkloadRelocation,WorkloadHosting,
2020-09-04T20:00:00.000Z,
BuyEnergy,SellHeat,DynamicAdjustmentOfCoolingIntensity,WorkloadRelocation,WorkloadHosting,
2020-09-04T13:00:00.000Z,
BuyEnergy,SellHeat,DynamicAdjustmentOfCoolingIntensity,WorkloadRelocation,WorkloadHosting,
2020-09-04T11:00:00.000Z,
BuyEnergy,SellHeat,DynamicAdjustmentOfCoolingIntensity,WorkloadRelocation,WorkloadHosting,
2020-09-04T03:00:00.000Z,
BuyEnergy,SellHeat,DynamicAdjustmentOfCoolingIntensity,WorkloadRelocation,WorkloadHosting,
2020-09-04T05:00:00.000Z,
BuyEnergy,SellHeat,DynamicAdjustmentOfCoolingIntensity,WorkloadRelocation,WorkloadHosting,
2020-09-04T08:00:00.000Z,
BuyEnergy,SellHeat,DynamicAdjustmentOfCoolingIntensity,WorkloadRelocation,WorkloadHosting,
2020-09-04T14:00:00.000Z,
BuyEnergy,SellHeat,DynamicAdjustmentOfCoolingIntensity,WorkloadRelocation,WorkloadHosting,
2020-09-04T16:00:00.000Z,
BuyEnergy,SellHeat,DynamicAdjustmentOfCoolingIntensity,WorkloadRelocation,WorkloadHosting,
2020-09-04T00:00:00.000Z,
BuyEnergy,SellHeat,DynamicAdjustmentOfCoolingIntensity,WorkloadRelocation,WorkloadHosting,
2020-09-04T06:00:00.000Z,
BuyEnergy,SellHeat,DynamicAdjustmentOfCoolingIntensity,WorkloadRelocation,WorkloadHosting,
2020-09-04T23:00:00.000Z,
BuyEnergy,SellHeat,DynamicAdjustmentOfCoolingIntensity,WorkloadRelocation,WorkloadHosting,
2020-09-04T22:00:00.000Z,
BuyEnergy,SellHeat,DynamicAdjustmentOfCoolingIntensity,WorkloadRelocation,WorkloadHosting,
2020-09-04T07:00:00.000Z,
BuyEnergy,SellHeat,
2020-09-04T09:00:00.000Z,
BuyEnergy,SellHeat,
2020-09-04T15:00:00.000Z,
BuyEnergy,SellHeat,
2020-09-04T17:00:00.000Z,
BuyEnergy,SellHeat,
2020-09-04T01:00:00.000Z,
BuyEnergy,SellHeat,
2020-09-04T10:00:00.000Z,
BuyEnergy,SellHeat,
2020-09-04T12:00:00.000Z,
BuyEnergy,SellHeat,
2020-09-04T19:00:00.000Z,
BuyEnergy,SellHeat,
2020-09-04T21:00:00.000Z,
BuyEnergy,SellHeat,
2020-09-04T02:00:00.000Z,
BuyEnergy,SellHeat,
2020-09-04T04:00:00.000Z,
BuyEnergy,SellHeat,
2020-09-04T18:00:00.000Z,
BuyEnergy,SellHeat,
2020-09-04T20:00:00.000Z,
BuyEnergy,SellHeat,
2020-09-04T13:00:00.000Z,
BuyEnergy,SellHeat,
2020-09-04T11:00:00.000Z,
BuyEnergy,SellHeat,
2020-09-04T03:00:00.000Z,
BuyEnergy,SellHeat,
2020-09-04T05:00:00.000Z,
BuyEnergy,SellHeat,
2020-09-04T08:00:00.000Z,
BuyEnergy,SellHeat,
2020-09-04T14:00:00.000Z,
BuyEnergy,SellHeat,
2020-09-04T16:00:00.000Z,
BuyEnergy,SellHeat,
2020-09-04T00:00:00.000Z,
BuyEnergy,SellHeat,
2020-09-04T06:00:00.000Z,
BuyEnergy,SellHeat,
2020-09-04T23:00:00.000Z,
BuyEnergy,SellHeat,
2020-09-04T22:00:00.000Z,
BuyEnergy,SellHeat,

