E_Total, Real_Time_Workload, Delay_Tolerant_Workload, REN, Energy_Price, L_Price, T_Price, D_Price, DR_Signal, Baseline, Delay_Tolerant_Executed, Total Cooling, IT Cooling, TES, D_TES, R_TES, ESD, D_ESD, R_ESD, DC Demand, DC Thermal Generation(Adapted Heat), Adapted CO2, Adapted Server, Adapted Cooling, Adapted DC, Baseline Heat, Baseline CO2,  Relocated, Hosted, Y
683.5540000000001,615.1986,68.3554,0.0,0.22,0.28,0.23,0.35,720.0,796.5382,68.3554,112.98413223140497,112.98413223140497,75.0,0.0,0.0,1800.0,0.0,0.0,796.538132231405,387.535573553719,398.2690661157025,683.5540000000001,112.98413223140497,796.538132231405,387.535573553719,398.2690661157025,0.0,0.0,1.0,0.0,0.0,0.0,0.0,0.0,0.0,0.0,0.0,0.0,0.0,0.0,0.0,0.0,0.0,0.0,0.0,0.0,0.0,0.0,0.0,0.0,0.0,0.0,
675.3514,607.8163,67.5351,0.0,0.22,0.28,0.23,0.35,720.0,786.9797,27.01404,104.9306347107438,104.9306347107438,75.0,0.0,0.0,1800.0,0.0,0.0,739.7609747107438,359.9120770578512,369.8804873553719,634.83034,104.9306347107438,739.7609747107438,359.9120770578512,369.8804873553719,0.0,0.0,0.0,0.4,0.0,0.1,0.0,0.1,0.0,0.0,0.0,0.1,0.1,0.1,0.1,0.0,0.0,0.0,0.0,0.0,0.0,0.0,0.0,0.0,0.0,2.7755575615628914E-17,
672.6172,605.3555,67.2617,0.0,0.22,0.28,0.23,0.35,720.0,783.7936,13.452340000000001,102.2822876033058,102.2822876033058,75.0,0.0,0.0,1800.0,0.0,0.0,721.0901276033059,350.8282464793389,360.54506380165293,618.80784,102.2822876033058,721.0901276033059,350.8282464793389,360.54506380165293,0.0,0.0,0.0,0.0,0.2,0.4,0.1,0.0,0.1,0.0,0.0,0.1,0.0,0.1,0.0,0.0,0.0,0.0,0.0,0.0,0.0,0.0,0.0,0.0,0.0,2.7755575615628914E-17,
678.0856,610.277,67.8086,0.0,0.22,0.28,0.23,0.35,720.0,790.1659,33.904300000000006,106.47624793388431,106.47624793388431,75.0,0.0,0.0,1800.0,0.0,0.0,750.6575479338844,365.21353041322317,375.3287739669422,644.1813000000001,106.47624793388431,750.6575479338844,365.21353041322317,375.3287739669422,0.0,0.0,0.0,0.0,0.0,0.0,0.1,0.2,0.0,0.3,0.1,0.1,0.0,0.1,0.1,0.0,0.0,0.0,0.0,0.0,0.0,0.0,0.0,0.0,0.0,-8.326672684688674E-17,
679.4526999999999,611.5074,67.9453,0.0,0.22,0.28,0.23,0.35,720.0,791.759,13.589060000000002,103.32172892561984,103.32172892561984,75.0,0.0,0.0,1800.0,0.0,0.0,728.4181889256198,354.393530214876,364.2090944628099,625.09646,103.32172892561984,728.4181889256198,354.393530214876,364.2090944628099,0.0,0.0,0.0,0.0,0.0,0.0,0.0,0.0,0.2,0.1,0.3,0.2,0.0,0.2,0.0,0.0,0.0,0.0,0.0,0.0,0.0,0.0,0.0,0.0,0.0,5.551115123125783E-17,
680.8198,612.7378,68.082,0.0,0.22,0.28,0.23,0.35,720.0,793.352,20.424599999999998,104.65494214876033,104.65494214876033,75.0,0.0,0.0,1800.0,0.0,0.0,737.8173421487603,358.9664515702479,368.90867107438015,633.1623999999999,104.65494214876033,737.8173421487603,358.9664515702479,368.90867107438015,0.0,0.0,0.0,0.0,0.0,0.0,0.0,0.0,0.1,0.2,0.1,0.2,0.4,0.0,0.0,0.0,0.0,0.0,0.0,0.0,0.0,0.0,0.0,0.0,0.0,-5.551115123125783E-17,
683.5540000000001,615.1986,68.3554,0.0,0.22,0.22,0.23,0.35,720.0,796.5382,27.342160000000003,106.20508429752068,106.20508429752068,75.0,0.0,0.0,1800.0,0.0,0.0,748.7458442975208,364.2834391404959,374.3729221487604,642.5407600000001,106.20508429752068,748.7458442975208,364.2834391404959,374.3729221487604,0.0,0.0,0.0,0.0,0.0,0.0,0.0,0.0,0.0,0.1,0.5,0.1,0.1,0.1,0.0,0.0,0.1,0.0,0.0,0.0,0.0,0.0,0.0,0.0,0.0,2.7755575615628914E-17,
679.5284,611.5756,67.9528,0.0,0.22,0.22,0.35,0.35,720.0,791.8472,54.36224,35.07237024793389,110.07237024793389,75.0,75.0,0.0,1800.0,0.0,0.0,701.010210247934,0.0,350.505105123967,665.93784,35.07237024793389,701.010210247934,377.54822995041326,388.005105123967,0.0,0.0,0.0,0.0,0.0,0.0,0.0,0.0,0.0,0.1,0.1,0.1,0.0,0.3,0.1,0.3,0.0,0.0,0.0,0.0,0.0,0.0,0.0,0.0,0.0,5.551115123125783E-17,
681.3637,613.2273,68.1364,0.0,0.22,0.22,0.35,0.35,870.0,793.9858,88.57732,153.50076363636364,116.00076363636364,0.0,0.0,37.5,1800.0,0.0,0.0,855.3053836363637,596.8239289090909,427.65269181818184,701.80462,153.50076363636364,855.3053836363637,397.88261927272725,408.90269181818184,0.0,0.0,0.0,0.0,0.0,0.0,0.0,0.0,0.0,0.0,0.2,0.2,0.5,0.0,0.1,0.0,0.0,0.0,0.0,0.0,0.0,0.0,0.0,0.0,0.0,8.326672684688674E-17,
680.0791999999999,612.0713,68.0079,0.0,0.25,0.22,0.35,0.35,870.0,792.489,81.60948,152.15798016528925,114.65798016528925,37.5,0.0,37.5,1800.0,0.0,0.0,845.8387601652892,589.9153079504132,422.9193800826446,693.6807799999999,152.15798016528925,845.8387601652892,393.2768719669421,404.1693800826446,0.0,0.0,0.0,0.0,0.0,0.0,0.0,0.0,0.0,0.0,0.0,0.1,0.4,0.3,0.1,0.0,0.1,0.0,0.0,0.0,0.0,0.0,0.0,0.0,0.0,0.0,
682.9544,614.659,68.2954,0.0,0.26,0.22,0.35,0.35,870.0,795.8395,122.93172000000001,121.91582148760331,121.91582148760331,75.0,0.0,0.0,1800.0,0.0,0.0,859.5065414876034,418.1712677024793,429.7532707438017,737.59072,121.91582148760331,859.5065414876034,418.1712677024793,429.7532707438017,0.0,0.0,0.0,0.0,0.0,0.0,0.0,0.0,0.0,0.0,0.0,0.0,0.3,0.0,0.1,0.4,0.2,0.0,0.0,0.0,0.0,0.0,0.0,0.0,0.0,-5.551115123125783E-17,
680.1362,612.1226,68.0136,0.0,0.26,0.22,0.35,0.35,870.0,792.5555,115.62311999999999,120.28854876033058,120.28854876033058,75.0,0.0,0.0,1800.0,0.0,0.0,848.0342687603306,412.5897222479339,424.0171343801653,727.74572,120.28854876033058,848.0342687603306,412.5897222479339,424.0171343801653,0.0,0.0,0.0,0.0,0.0,0.0,0.0,0.0,0.0,0.0,0.0,0.0,0.0,0.5,0.4,0.1,0.0,0.0,0.0,0.0,0.0,0.0,0.0,0.0,0.0,-2.7755575615628914E-17,
681.8451,613.6606,68.1845,0.0,0.26,0.22,0.35,0.35,870.0,794.5468,102.27674999999999,118.33675206611571,118.33675206611571,75.0,0.0,0.0,1800.0,0.0,0.0,834.2741020661158,405.8950595867769,417.1370510330579,715.93735,118.33675206611571,834.2741020661158,405.8950595867769,417.1370510330579,0.0,0.0,0.0,0.0,0.0,0.0,0.0,0.0,0.0,0.0,0.0,0.0,0.0,0.0,0.5,0.2,0.3,0.0,0.0,0.0,0.0,0.0,0.0,0.0,0.0,0.0,
676.7185999999999,609.0467,67.6719,0.0,0.26,0.22,0.35,0.35,870.0,788.5728,128.57661,121.9212082644628,121.9212082644628,75.0,0.0,0.0,1800.0,0.0,0.0,859.5445182644628,418.18974434710736,429.7722591322314,737.62331,121.9212082644628,859.5445182644628,418.18974434710736,429.7722591322314,0.0,0.0,0.0,0.0,0.0,0.0,0.0,0.0,0.0,0.0,0.0,0.0,0.0,0.0,0.0,0.9,0.1,0.0,0.0,0.0,0.0,0.0,0.0,0.0,0.0,-2.7755575615628914E-17,
680.1362,612.1226,68.0136,0.0,0.25,0.22,0.31,0.35,870.0,792.5555,122.42447999999999,121.41274049586778,121.41274049586778,75.0,0.0,0.0,1800.0,0.0,0.0,855.9598204958678,416.44569990082647,427.9799102479339,734.54708,121.41274049586778,855.9598204958678,416.44569990082647,427.9799102479339,0.0,0.0,0.0,0.0,0.0,0.0,0.0,0.0,0.0,0.0,0.0,0.0,0.0,0.0,0.0,0.0,1.0,0.0,0.0,0.0,0.0,0.0,0.0,0.0,0.0,0.0,
686.9717999999999,618.2746,68.6972,0.0,0.22,0.27,0.31,0.35,770.0,800.5209,48.08803999999999,110.14258512396694,110.14258512396694,75.0,0.0,0.0,1800.0,0.0,0.0,776.5052251239669,377.78906697520654,388.2526125619834,666.3626399999999,110.14258512396694,776.5052251239669,377.78906697520654,388.2526125619834,0.0,0.0,0.0,0.0,0.0,0.0,0.0,0.0,0.0,0.0,0.0,0.0,0.0,0.0,0.0,0.0,0.0,0.7,0.3,0.0,0.0,0.0,0.0,0.0,0.0,5.551115123125783E-17,
654.5029999999999,589.0527,65.4503,0.0,0.22,0.27,0.31,0.35,770.0,762.6853,78.54035999999999,110.3459603305785,110.3459603305785,75.0,0.0,0.0,1800.0,0.0,0.0,777.9390203305784,378.48664393388424,388.9695101652892,667.5930599999999,110.3459603305785,777.9390203305784,378.48664393388424,388.9695101652892,0.0,0.0,0.0,0.0,0.0,0.0,0.0,0.0,0.0,0.0,0.0,0.0,0.0,0.0,0.0,0.0,0.0,0.0,0.9,0.1,0.0,0.0,0.0,0.0,0.0,-2.7755575615628914E-17,
678.4273000000001,610.5846,67.8427,0.0,0.22,0.27,0.31,0.35,770.0,790.5641,74.62697,113.25811074380167,113.25811074380167,75.0,0.0,0.0,1800.0,0.0,0.0,798.4696807438017,388.4753198512397,399.2348403719009,685.21157,113.25811074380167,798.4696807438017,388.4753198512397,399.2348403719009,0.0,0.0,0.0,0.0,0.0,0.0,0.0,0.0,0.0,0.0,0.0,0.0,0.0,0.0,0.0,0.0,0.0,0.0,0.0,1.0,0.0,0.0,0.0,0.0,0.0,0.0,
751.9094,676.7185,75.1909,0.0,0.22,0.27,0.31,0.35,770.0,876.192,22.55727,115.58277190082644,115.58277190082644,75.0,0.0,0.0,1800.0,0.0,0.0,814.8585419008264,396.4489076198347,407.4292709504132,699.27577,115.58277190082644,814.8585419008264,396.4489076198347,407.4292709504132,0.0,0.0,0.0,0.0,0.0,0.0,0.0,0.0,0.0,0.0,0.0,0.0,0.0,0.0,0.0,0.0,0.0,0.0,0.0,0.0,0.3,0.7,0.0,0.0,0.0,0.0,
678.4273000000001,610.5846,67.8427,0.0,0.22,0.27,0.31,0.35,770.0,790.5641,88.19550999999998,115.50084462809919,115.50084462809919,75.0,0.0,0.0,1800.0,0.0,0.0,814.2809546280993,396.16789707438016,407.14047731404963,698.78011,115.50084462809919,814.2809546280993,396.16789707438016,407.14047731404963,0.0,0.0,0.0,0.0,0.0,0.0,0.0,0.0,0.0,0.0,0.0,0.0,0.0,0.0,0.0,0.0,0.0,0.0,0.0,0.0,0.0,0.6,0.3,0.1,0.0,2.7755575615628914E-17,
664.7563,598.2807,66.4756,0.0,0.22,0.27,0.31,0.35,770.0,774.6334,86.41828,113.17338512396695,113.17338512396695,75.0,0.0,0.0,1800.0,0.0,0.0,797.8723651239669,388.1847109752066,398.93618256198346,684.69898,113.17338512396695,797.8723651239669,388.1847109752066,398.93618256198346,0.0,0.0,0.0,0.0,0.0,0.0,0.0,0.0,0.0,0.0,0.0,0.0,0.0,0.0,0.0,0.0,0.0,0.0,0.0,0.0,0.0,0.0,1.0,0.0,0.0,0.0,
709.1873,638.2686,70.9187,0.0,0.3,0.27,0.31,0.35,750.0,826.4084,49.64309,113.70441157024794,113.70441157024794,75.0,0.0,0.0,1800.0,0.0,0.0,801.616101570248,390.00613168595044,400.808050785124,687.91169,113.70441157024794,801.616101570248,390.00613168595044,400.808050785124,0.0,0.0,0.0,0.0,0.0,0.0,0.0,0.0,0.0,0.0,0.0,0.0,0.0,0.0,0.0,0.0,0.0,0.0,0.0,0.0,0.0,0.0,0.0,0.6,0.4,0.0,
688.6807,619.8126,68.8681,0.0,0.3,0.27,0.31,0.35,750.0,802.5122,82.64172,116.1081520661157,116.1081520661157,75.0,0.0,0.0,1800.0,0.0,0.0,818.5624720661157,398.2509615867768,409.28123603305784,702.4543199999999,116.1081520661157,818.5624720661157,398.2509615867768,409.28123603305784,0.0,0.0,0.0,0.0,0.0,0.0,0.0,0.0,0.0,0.0,0.0,0.0,0.0,0.0,0.0,0.0,0.0,0.0,0.0,0.0,0.0,0.0,0.0,0.0,0.8,0.19999999999999996,
692.0984,622.8886,69.2098,0.0,0.3,0.27,0.31,0.35,750.0,806.4949,83.05176,116.6843570247934,116.6843570247934,75.0,0.0,0.0,1800.0,0.0,0.0,822.6247170247934,400.22734459504136,411.3123585123967,705.94036,116.6843570247934,822.6247170247934,400.22734459504136,411.3123585123967,0.0,0.0,0.0,0.0,0.0,0.0,0.0,0.0,0.0,0.0,0.0,0.0,0.0,0.0,0.0,0.0,0.0,0.0,0.0,0.0,0.0,0.0,0.0,0.0,0.0,1.0,
MAX_T, 24.0,
f_ESD, 1.0,
ESD_MAX, 1800.0,
f_TES, 1.0,
TES_MAX, 75.0,
TES_R, 1.0,
TES_D, 1.0,
ESD_R, 1.0,
ESD_D, 1.0,
MAX_DIS_TES, 75.0,
MAX_DIS_ESD, 1000.0,
DoD, 0.4,
MAX_IT, 780.0,
COP_C, 6.05,
COP_H, 4.43,
MAX_HOST, 100.0,
MAX_Relocate, 100.0,
relocateActive, 0.0,
TES_INIT, 75.0,
ESD_INIT, 1800.0,
ESD_FIN, 1800.0,
TES_FIN, 75.0,
WE, 0.0,
WF, 1.0,
WT, 0.0,
WL, 0.0,
WREN, 0.0,
E_D_Percentage, 0.1


