2020-07-31T01:00:00.000Z,
SellEnergy,SellHeat,SellFlexibility,DynamicAdjustmentOfCoolingIntensity,ShiftDelayTolerantWorkload,ShiftDelayTolerantWorkload,ShiftDelayTolerantWorkload,WorkloadRelocation,WorkloadHosting,
2020-07-31T21:00:00.000Z,
SellEnergy,SellHeat,SellFlexibility,DynamicAdjustmentOfCoolingIntensity,ShiftDelayTolerantWorkload,ShiftDelayTolerantWorkload,WorkloadRelocation,WorkloadHosting,
2020-07-31T02:00:00.000Z,
SellEnergy,SellHeat,SellFlexibility,DynamicAdjustmentOfCoolingIntensity,ShiftDelayTolerantWorkload,ShiftDelayTolerantWorkload,ShiftDelayTolerantWorkload,WorkloadRelocation,WorkloadHosting,
2020-07-31T04:00:00.000Z,
SellEnergy,SellHeat,SellFlexibility,DynamicAdjustmentOfCoolingIntensity,ShiftDelayTolerantWorkload,ShiftDelayTolerantWorkload,ShiftDelayTolerantWorkload,WorkloadRelocation,WorkloadHosting,
2020-07-31T19:00:00.000Z,
SellEnergy,SellHeat,SellFlexibility,DynamicAdjustmentOfCoolingIntensity,ShiftDelayTolerantWorkload,ShiftDelayTolerantWorkload,WorkloadRelocation,WorkloadHosting,
2020-07-31T03:00:00.000Z,
SellEnergy,SellHeat,SellFlexibility,DynamicAdjustmentOfCoolingIntensity,ShiftDelayTolerantWorkload,ShiftDelayTolerantWorkload,ShiftDelayTolerantWorkload,ShiftDelayTolerantWorkload,ShiftDelayTolerantWorkload,WorkloadRelocation,WorkloadHosting,
2020-07-31T11:00:00.000Z,
SellEnergy,SellHeat,SellFlexibility,DynamicAdjustmentOfCoolingIntensity,ShiftDelayTolerantWorkload,ShiftDelayTolerantWorkload,ShiftDelayTolerantWorkload,WorkloadRelocation,WorkloadHosting,
2020-07-31T13:00:00.000Z,
BuyEnergy,BuyHeat,SellFlexibility,DischargeTes,DynamicAdjustmentOfCoolingIntensity,ShiftDelayTolerantWorkload,ShiftDelayTolerantWorkload,ShiftDelayTolerantWorkload,ShiftDelayTolerantWorkload,WorkloadRelocation,WorkloadHosting,
2020-07-31T18:00:00.000Z,
SellEnergy,SellHeat,SellFlexibility,DynamicAdjustmentOfCoolingIntensity,ShiftDelayTolerantWorkload,ShiftDelayTolerantWorkload,ShiftDelayTolerantWorkload,ShiftDelayTolerantWorkload,ShiftDelayTolerantWorkload,WorkloadRelocation,WorkloadHosting,
2020-07-31T20:00:00.000Z,
SellEnergy,SellHeat,SellFlexibility,DynamicAdjustmentOfCoolingIntensity,ShiftDelayTolerantWorkload,ShiftDelayTolerantWorkload,ShiftDelayTolerantWorkload,ShiftDelayTolerantWorkload,WorkloadRelocation,WorkloadHosting,
2020-07-31T10:00:00.000Z,
SellEnergy,SellHeat,SellFlexibility,DynamicAdjustmentOfCoolingIntensity,ShiftDelayTolerantWorkload,ShiftDelayTolerantWorkload,ShiftDelayTolerantWorkload,WorkloadRelocation,WorkloadHosting,
2020-07-31T12:00:00.000Z,
SellEnergy,SellHeat,SellFlexibility,DynamicAdjustmentOfCoolingIntensity,ShiftDelayTolerantWorkload,ShiftDelayTolerantWorkload,WorkloadRelocation,WorkloadHosting,
2020-07-31T05:00:00.000Z,
SellEnergy,SellHeat,SellFlexibility,DynamicAdjustmentOfCoolingIntensity,ShiftDelayTolerantWorkload,ShiftDelayTolerantWorkload,ShiftDelayTolerantWorkload,WorkloadRelocation,WorkloadHosting,
2020-07-31T15:00:00.000Z,
SellEnergy,SellHeat,SellFlexibility,ChargeTes,DynamicAdjustmentOfCoolingIntensity,ShiftDelayTolerantWorkload,WorkloadRelocation,WorkloadHosting,
2020-07-31T17:00:00.000Z,
SellEnergy,SellHeat,SellFlexibility,DynamicAdjustmentOfCoolingIntensity,ShiftDelayTolerantWorkload,ShiftDelayTolerantWorkload,ShiftDelayTolerantWorkload,WorkloadRelocation,WorkloadHosting,
2020-07-31T00:00:00.000Z,
SellEnergy,SellHeat,SellFlexibility,DynamicAdjustmentOfCoolingIntensity,ShiftDelayTolerantWorkload,ShiftDelayTolerantWorkload,WorkloadRelocation,WorkloadHosting,
2020-07-31T23:00:00.000Z,
BuyEnergy,SellHeat,SellFlexibility,DynamicAdjustmentOfCoolingIntensity,ShiftDelayTolerantWorkload,WorkloadRelocation,WorkloadHosting,
2020-07-31T07:00:00.000Z,
SellEnergy,SellHeat,SellFlexibility,DynamicAdjustmentOfCoolingIntensity,ShiftDelayTolerantWorkload,ShiftDelayTolerantWorkload,ShiftDelayTolerantWorkload,WorkloadRelocation,WorkloadHosting,
2020-07-31T09:00:00.000Z,
SellEnergy,SellHeat,SellFlexibility,DynamicAdjustmentOfCoolingIntensity,ShiftDelayTolerantWorkload,ShiftDelayTolerantWorkload,ShiftDelayTolerantWorkload,ShiftDelayTolerantWorkload,WorkloadRelocation,WorkloadHosting,
2020-07-31T16:00:00.000Z,
BuyEnergy,SellHeat,SellFlexibility,DynamicAdjustmentOfCoolingIntensity,ShiftDelayTolerantWorkload,WorkloadRelocation,WorkloadHosting,
2020-07-31T22:00:00.000Z,
SellEnergy,SellHeat,SellFlexibility,DynamicAdjustmentOfCoolingIntensity,ShiftDelayTolerantWorkload,ShiftDelayTolerantWorkload,WorkloadRelocation,WorkloadHosting,
2020-07-31T06:00:00.000Z,
BuyEnergy,SellHeat,SellFlexibility,DynamicAdjustmentOfCoolingIntensity,ShiftDelayTolerantWorkload,WorkloadRelocation,WorkloadHosting,
2020-07-31T08:00:00.000Z,
SellEnergy,SellHeat,SellFlexibility,DynamicAdjustmentOfCoolingIntensity,ShiftDelayTolerantWorkload,ShiftDelayTolerantWorkload,ShiftDelayTolerantWorkload,WorkloadRelocation,WorkloadHosting,
2020-07-31T14:00:00.000Z,
SellEnergy,SellHeat,SellFlexibility,ChargeTes,DynamicAdjustmentOfCoolingIntensity,ShiftDelayTolerantWorkload,ShiftDelayTolerantWorkload,WorkloadRelocation,WorkloadHosting,
2020-07-31T01:00:00.000Z,

2020-07-31T21:00:00.000Z,

2020-07-31T02:00:00.000Z,

2020-07-31T04:00:00.000Z,

2020-07-31T19:00:00.000Z,

2020-07-31T03:00:00.000Z,

2020-07-31T11:00:00.000Z,

2020-07-31T13:00:00.000Z,

2020-07-31T18:00:00.000Z,

2020-07-31T20:00:00.000Z,

2020-07-31T10:00:00.000Z,

2020-07-31T12:00:00.000Z,

2020-07-31T05:00:00.000Z,

2020-07-31T15:00:00.000Z,

2020-07-31T17:00:00.000Z,

2020-07-31T00:00:00.000Z,

2020-07-31T23:00:00.000Z,
BuyEnergy,SellHeat,
2020-07-31T07:00:00.000Z,

2020-07-31T09:00:00.000Z,

2020-07-31T16:00:00.000Z,
BuyEnergy,SellHeat,
2020-07-31T22:00:00.000Z,

2020-07-31T06:00:00.000Z,
BuyEnergy,SellHeat,
2020-07-31T08:00:00.000Z,

2020-07-31T14:00:00.000Z,


