E_Total, Real_Time_Workload, Delay_Tolerant_Workload, Energy_Price, L_Price, T_Price, D_Price, DR_Signal, Baseline, Delay_Tolerant_Executed, Total Cooling, IT Cooling, TES, D_TES, R_TES, ESD, D_ESD, R_ESD, DC Demand, DC Thermal Generation(Adapted Heat), Adapted CO2, Adapted Server, Adapted Cooling, Adapted DC, Baseline Heat, Baseline CO2,  Relocated, Hosted, Y
638.3093,570.5195,67.7898,0.25,0.23,0.23,0.23,750.0,738.6892,67.7898,105.50566942148761,105.50566942148761,75.0,0.0,0.0,1800.0,0.0,0.0,743.8149694214876,361.8844461157025,371.9074847107438,638.3093,105.50566942148761,743.8149694214876,361.8844461157025,371.9074847107438,0.0,0.0,1.0,0.0,0.0,0.0,0.0,0.0,0.0,0.0,0.0,0.0,0.0,0.0,0.0,0.0,0.0,0.0,0.0,0.0,0.0,0.0,0.0,0.0,0.0,0.0,
673.4994,610.1083,63.3911,0.26,0.23,0.23,0.23,750.0,789.9474,31.69555,106.08328099173555,106.08328099173555,75.0,0.0,0.0,1800.0,0.0,0.0,747.8871309917356,363.8656538016529,373.9435654958678,641.80385,106.08328099173555,747.8871309917356,363.8656538016529,373.9435654958678,0.0,0.0,0.0,0.5,0.2,0.2,0.0,0.1,0.0,0.0,0.0,0.0,0.0,0.0,0.0,0.0,0.0,0.0,0.0,0.0,0.0,0.0,0.0,0.0,0.0,-2.7755575615628914E-17,
660.7803,594.7023,66.078,0.26,0.23,0.23,0.23,750.0,789.6365,46.2546,105.94328925619836,105.94328925619836,75.0,0.0,0.0,1800.0,0.0,0.0,746.9001892561984,363.38548214876033,373.4500946280992,640.9569,105.94328925619836,746.9001892561984,363.38548214876033,373.4500946280992,0.0,0.0,0.0,0.0,0.5,0.4,0.1,0.0,0.0,0.0,0.0,0.0,0.0,0.0,0.0,0.0,0.0,0.0,0.0,0.0,0.0,0.0,0.0,0.0,0.0,-2.7755575615628914E-17,
677.6313,609.8682,67.7631,0.26,0.23,0.23,0.23,750.0,770.0002,47.43417,108.64501983471075,108.64501983471075,75.0,0.0,0.0,1800.0,0.0,0.0,765.9473898347107,372.6524180330578,382.9736949173554,657.30237,108.64501983471075,765.9473898347107,372.6524180330578,382.9736949173554,0.0,0.0,0.0,0.0,0.0,0.1,0.4,0.1,0.0,0.4,0.0,0.0,0.0,0.0,0.0,0.0,0.0,0.0,0.0,0.0,0.0,0.0,0.0,0.0,0.0,0.0,
660.4869000000001,594.4382,66.0487,0.26,0.23,0.23,0.23,750.0,789.3206,52.83896,106.98796033057853,106.98796033057853,75.0,0.0,0.0,1800.0,0.0,0.0,754.2651203305786,366.96870393388434,377.1325601652893,647.2771600000001,106.98796033057853,754.2651203305786,366.96870393388434,377.1325601652893,0.0,0.0,0.0,0.0,0.0,0.0,0.3,0.0,0.2,0.2,0.1,0.0,0.0,0.0,0.2,0.0,0.0,0.0,0.0,0.0,0.0,0.0,0.0,0.0,0.0,-8.326672684688674E-17,
677.3602,609.6242,67.736,0.25,0.23,0.23,0.23,750.0,769.6583,47.415200000000006,108.60155371900827,108.60155371900827,75.0,0.0,0.0,1800.0,0.0,0.0,765.6409537190083,372.50332925619836,382.82047685950414,657.0394,108.60155371900827,765.6409537190083,372.50332925619836,382.82047685950414,0.0,0.0,0.0,0.0,0.0,0.0,0.0,0.5,0.2,0.0,0.1,0.0,0.1,0.0,0.0,0.0,0.0,0.0,0.0,0.1,0.0,0.0,0.0,0.0,0.0,-2.7755575615628914E-17,
677.0873,609.3786,67.7087,0.22,0.23,0.23,0.23,750.0,789.0026,33.85435,106.3194958677686,106.3194958677686,75.0,0.0,0.0,1800.0,0.0,0.0,749.5524458677686,364.67587082644627,374.7762229338843,643.23295,106.3194958677686,749.5524458677686,364.67587082644627,374.7762229338843,0.0,0.0,0.0,0.0,0.0,0.0,0.0,0.0,0.1,0.5,0.1,0.1,0.2,0.0,0.0,0.0,0.0,0.0,0.0,0.0,0.0,0.0,0.0,0.0,0.0,2.7755575615628914E-17,
644.9456,580.451,64.4946,0.22,0.1,0.23,0.23,750.0,751.5482,103.19136,37.99873719008265,112.99873719008265,75.0,75.0,0.0,1800.0,0.0,0.0,721.6410971900827,0.0,360.8205485950414,683.64236,37.99873719008265,721.6410971900827,387.5856685619835,398.3205485950414,0.0,0.0,0.0,0.0,0.0,0.0,0.0,0.0,0.0,0.5,0.1,0.0,0.2,0.1,0.1,0.0,0.0,0.0,0.0,0.0,0.0,0.0,0.0,0.0,0.0,0.0,
660.0771,594.0694,66.0077,0.22,0.1,0.23,0.23,750.0,769.1807,46.20539,143.33054380165288,105.83054380165288,0.0,0.0,37.5,1800.0,0.0,0.0,783.6053338016528,544.498147859504,391.8026669008264,640.2747899999999,143.33054380165288,783.6053338016528,362.99876523966935,373.0526669008264,0.0,0.0,0.0,0.0,0.0,0.0,0.0,0.0,0.0,0.0,0.3,0.1,0.1,0.1,0.3,0.0,0.0,0.0,0.0,0.1,0.0,0.0,0.0,0.0,0.0,2.7755575615628914E-17,
676.9947999999999,609.2953,67.6995,0.22,0.1,0.55,0.23,750.0,788.8947,27.079800000000002,142.68596694214875,105.18596694214875,37.5,0.0,37.5,1800.0,0.0,0.0,779.0610669421487,541.1817999173553,389.53053347107436,636.3751,142.68596694214875,779.0610669421487,360.7878666115702,370.78053347107436,0.0,0.0,0.0,0.0,0.0,0.0,0.0,0.0,0.0,0.0,0.0,0.2,0.3,0.0,0.0,0.1,0.0,0.2,0.1,0.1,0.0,0.0,0.0,0.0,0.0,0.0,
641.1316,577.0184,64.1132,0.22,0.1,0.55,0.23,750.0,788.521,64.1132,105.97216528925621,105.97216528925621,75.0,0.0,0.0,1800.0,0.0,0.0,747.1037652892562,363.48452694214876,373.5518826446281,641.1316,105.97216528925621,747.1037652892562,363.48452694214876,373.5518826446281,0.0,0.0,0.0,0.0,0.0,0.0,0.0,0.0,0.0,0.0,0.0,0.0,0.1,0.2,0.1,0.0,0.0,0.1,0.2,0.0,0.3,0.0,0.0,0.0,0.0,0.0,
676.6740000000001,609.0066,67.6674,0.22,0.1,0.55,0.23,750.0,747.1038,33.8337,106.25459504132233,106.25459504132233,75.0,0.0,0.0,1800.0,0.0,0.0,749.0948950413224,364.4532609917356,374.5474475206612,642.8403000000001,106.25459504132233,749.0948950413224,364.4532609917356,374.5474475206612,0.0,0.0,0.0,0.0,0.0,0.0,0.0,0.0,0.0,0.0,0.0,0.0,0.0,0.1,0.2,0.1,0.0,0.3,0.1,0.1,0.0,0.1,0.0,0.0,0.0,-2.7755575615628914E-17,
641.4603,577.3143,64.146,0.22,0.1,0.55,0.23,750.0,747.4868,64.146,106.02649586776859,106.02649586776859,75.0,0.0,0.0,1800.0,0.0,0.0,747.4867958677686,363.67088082644625,373.7433979338843,641.4603,106.02649586776859,747.4867958677686,363.67088082644625,373.7433979338843,0.0,0.0,0.0,0.0,0.0,0.0,0.0,0.0,0.0,0.0,0.0,0.0,0.0,0.0,0.1,0.1,0.1,0.5,0.2,0.0,0.0,0.0,0.0,0.0,0.0,5.551115123125783E-17,
677.0184,609.3166,67.7018,0.22,0.1,0.55,0.23,750.0,788.9223,20.310540000000003,104.07060165289258,104.07060165289258,75.0,0.0,0.0,1800.0,0.0,0.0,733.6977416528927,356.9621636694215,366.84887082644633,629.62714,104.07060165289258,733.6977416528927,356.9621636694215,366.84887082644633,0.0,0.0,0.0,0.0,0.0,0.0,0.0,0.0,0.0,0.0,0.0,0.0,0.0,0.0,0.0,0.0,0.1,0.4,0.5,0.0,0.0,0.0,0.0,0.0,0.0,0.0,
675.6377,607.9144,67.7233,0.22,0.23,0.25,0.23,750.0,789.1725,20.31699,103.83989917355373,103.83989917355373,75.0,0.0,0.0,1800.0,0.0,0.0,732.0712891735537,356.17085416528926,366.03564458677687,628.23139,103.83989917355373,732.0712891735537,356.17085416528926,366.03564458677687,0.0,0.0,0.0,0.0,0.0,0.0,0.0,0.0,0.0,0.0,0.0,0.0,0.0,0.0,0.0,0.0,0.1,0.2,0.3,0.1,0.1,0.2,0.0,0.0,0.0,-8.326672684688674E-17,
677.0559000000001,609.5099,67.546,0.22,0.23,0.25,0.27,870.0,787.1068,141.84660000000002,124.19115702479341,124.19115702479341,75.0,0.0,0.0,1800.0,0.0,0.0,875.5476570247935,425.9756685950414,437.77382851239673,751.3565000000001,124.19115702479341,875.5476570247935,425.9756685950414,437.77382851239673,0.0,0.0,0.0,0.0,0.0,0.0,0.0,0.0,0.0,0.0,0.0,0.0,0.0,0.0,0.0,0.0,0.0,0.4,0.5,0.0,0.1,0.0,0.0,0.0,0.0,-2.7755575615628914E-17,
660.0612000000001,594.0551,66.0061,0.22,0.23,0.25,0.27,870.0,788.9477,145.21342,122.19314380165291,122.19314380165291,75.0,0.0,0.0,1800.0,0.0,0.0,861.461663801653,419.12248323966946,430.7308319008265,739.2685200000001,122.19314380165291,861.461663801653,419.12248323966946,430.7308319008265,0.0,0.0,0.0,0.0,0.0,0.0,0.0,0.0,0.0,0.0,0.0,0.0,0.0,0.0,0.0,0.0,0.0,0.0,0.3,0.3,0.2,0.2,0.0,0.0,0.0,-5.551115123125783E-17,
677.0401999999999,609.3362,67.704,0.3,0.28,0.25,0.27,870.0,769.1623,108.32639999999998,118.62191735537189,118.62191735537189,75.0,0.0,0.0,1800.0,0.0,0.0,836.2845173553718,406.8731765289255,418.1422586776859,717.6625999999999,118.62191735537189,836.2845173553718,406.8731765289255,418.1422586776859,0.0,0.0,0.0,0.0,0.0,0.0,0.0,0.0,0.0,0.0,0.0,0.0,0.0,0.0,0.0,0.0,0.0,0.0,0.0,0.8,0.2,0.0,0.0,0.0,0.0,-5.551115123125783E-17,
687.0536,618.3482,68.7054,0.3,0.28,0.25,0.27,870.0,788.8178,109.92863999999999,120.37633719008265,120.37633719008265,75.0,0.0,0.0,1800.0,0.0,0.0,848.6531771900826,412.89083656198346,424.3265885950413,728.27684,120.37633719008265,848.6531771900826,412.89083656198346,424.3265885950413,0.0,0.0,0.0,0.0,0.0,0.0,0.0,0.0,0.0,0.0,0.0,0.0,0.0,0.0,0.0,0.0,0.0,0.0,0.0,0.0,0.7,0.3,0.0,0.0,0.0,5.551115123125783E-17,
676.9288,609.2359,67.6929,0.3,0.28,0.25,0.27,870.0,800.6161,121.84722,120.84018512396695,120.84018512396695,75.0,0.0,0.0,1800.0,0.0,0.0,851.923305123967,414.4818349752066,425.9616525619835,731.08312,120.84018512396695,851.923305123967,414.4818349752066,425.9616525619835,0.0,0.0,0.0,0.0,0.0,0.0,0.0,0.0,0.0,0.0,0.0,0.0,0.0,0.0,0.0,0.0,0.0,0.0,0.0,0.0,0.0,1.0,0.0,0.0,0.0,0.0,
672.2956999999999,609.0301,63.2656,0.3,0.28,0.25,0.23,770.0,788.5513,50.612480000000005,109.03183140495867,109.03183140495867,75.0,0.0,0.0,1800.0,0.0,0.0,768.6744114049586,373.97918171900824,384.3372057024793,659.64258,109.03183140495867,768.6744114049586,373.97918171900824,384.3372057024793,0.0,0.0,0.0,0.0,0.0,0.0,0.0,0.0,0.0,0.0,0.0,0.0,0.0,0.0,0.0,0.0,0.0,0.0,0.0,0.0,0.0,0.0,0.8,0.2,0.0,-5.551115123125783E-17,
637.0603,569.3903,67.67,0.3,0.28,0.25,0.23,750.0,737.2271,81.20400000000001,107.5362479338843,107.5362479338843,75.0,0.0,0.0,1800.0,0.0,0.0,758.1305479338843,368.84933041322313,379.06527396694213,650.5943,107.5362479338843,758.1305479338843,368.84933041322313,379.06527396694213,0.0,0.0,0.0,0.0,0.0,0.0,0.0,0.0,0.0,0.0,0.0,0.0,0.0,0.0,0.0,0.0,0.0,0.0,0.0,0.0,0.0,0.0,0.0,1.0,0.0,0.0,
674.4617999999999,607.0156,67.4462,0.3,0.28,0.25,0.23,750.0,785.9431,60.70158000000001,110.36647603305785,110.36647603305785,75.0,0.0,0.0,1800.0,0.0,0.0,778.0836560330579,378.5570127933884,389.04182801652894,667.71718,110.36647603305785,778.0836560330579,378.5570127933884,389.04182801652894,0.0,0.0,0.0,0.0,0.0,0.0,0.0,0.0,0.0,0.0,0.0,0.0,0.0,0.0,0.0,0.0,0.0,0.0,0.0,0.0,0.0,0.0,0.0,0.0,0.9,0.09999999999999998,
676.114,608.5026,67.6114,0.3,0.28,0.25,0.23,750.0,787.8684,74.37253999999999,112.87192396694215,112.87192396694215,75.0,0.0,0.0,1800.0,0.0,0.0,795.7470639669422,387.15069920661153,397.8735319834711,682.87514,112.87192396694215,795.7470639669422,387.15069920661153,397.8735319834711,0.0,0.0,0.0,0.0,0.0,0.0,0.0,0.0,0.0,0.0,0.0,0.0,0.0,0.0,0.0,0.0,0.0,0.0,0.0,0.0,0.0,0.0,0.0,0.0,0.0,1.0,
MAX_T, 24.0,
f_ESD, 1.0,
ESD_MAX, 1800.0,
f_TES, 1.0,
TES_MAX, 75.0,
TES_R, 1.0,
TES_D, 1.0,
ESD_R, 1.0,
ESD_D, 1.0,
MAX_DIS_TES, 75.0,
MAX_DIS_ESD, 1000.0,
DoD, 0.4,
MAX_IT, 780.0,
COP_C, 6.05,
COP_H, 4.43,
MAX_HOST, 100.0,
MAX_Relocate, 100.0,
relocateActive, 0.0,
TES_INIT, 75.0,
ESD_INIT, 1800.0,
ESD_FIN, 1800.0,
TES_FIN, 75.0,
WE, 0.0,
WF, 0.5,
WT, 0.5,
WL, 0.0,
E_D_Percentage, 0.1


