{
    "date": "2019-01-01T05:00:00Z",
    "starttime": "2019-01-01T12:00:00Z",
    "endtime": "2019-01-01T00:00:00Z",
    "offering": {
        "offering-dc-1": {
            "cpu": {
                "min": 1,
                "max": 6
            },
            "ram": {
                "min": 1,
                "max": 4
            },
            "disk": 100,
            "count": 100
        },
        "offering-dc-2": {
            "cpu": {
                "min": 1,
                "max": 8
            },
            "ram": {
                "min": 2,
                "max": 8
            },
            "disk": 100,
            "count": 75
        },
        "offering-dc-3": {
            "cpu": {
                "min": 1,
                "max": 2
            },
            "ram": {
                "min": 1,
                "max": 2
            },
            "disk": 100,
            "count": 150
        },
        "offering-dc-4": {
            "cpu": {
                "min": 2,
                "max": 4
            },
            "ram": {
                "min": 2,
                "max": 8
            },
            "disk": 100,
            "count": 40
        }
    },
    "bidding": {
        "bidding-dc-1": {
            "cpu": {
                "min": 8,
                "max": 16
            },
            "ram": {
                "min": 8,
                "max": 32
            },
            "disk": 40000,
            "count": 12
        },
        "bidding-dc-2": {
            "cpu": {
                "min": 32,
                "max": 64
            },
            "ram": {
                "min": 8,
                "max": 64
            },
            "disk": 40000,
            "count": 14
        },
        "bidding-dc-3": {
            "cpu": {
                "min": 16,
                "max": 32
            },
            "ram": {
                "min": 16,
                "max": 32
            },
            "disk": 40000,
            "count": 10
        },
        "bidding-dc-4": {
            "cpu": {
                "min": 16,
                "max": 32
            },
            "ram": {
                "min": 16,
                "max": 32
            },
            "disk": 40000,
            "count": 5
        }
    }

}
