{
   "oslo.message": {
      "_context_domain": null,
      "_context_roles": [
         "admin",
         "Member"
      ],
      "_context_global_request_id": null,
      "_context_quota_class": null,
      "event_type": "compute.instance.pause.end",
      "_context_request_id": "req-c505b3c7-e9be-4ae0-945a-abf549ecd9ee",
      "_context_service_catalog": [
         {
            "endpoints": [
               {
                  "region": "RegionOne",
                  "publicURL": "http: //192.168.1.22/volume/v2/0fa5d78db05b4687a498d6e6abe11816"
               }
            ],
            "type": "volumev2",
            "name": "cinderv2"
         },
         {
            "endpoints": [
               {
                  "region": "RegionOne",
                  "publicURL": "http: //192.168.1.22: 9696/"
               }
            ],
            "type": "network",
            "name": "neutron"
         },
         {
            "endpoints": [
               {
                  "region": "RegionOne",
                  "publicURL": "http: //192.168.1.22/volume/v3/0fa5d78db05b4687a498d6e6abe11816"
               }
            ],
            "type": "volumev3",
            "name": "cinderv3"
         },
         {
            "endpoints": [
               {
                  "region": "RegionOne",
                  "publicURL": "http: //192.168.1.22/volume/v3/0fa5d78db05b4687a498d6e6abe11816"
               }
            ],
            "type": "block-storage",
            "name": "cinder"
         },
         {
            "endpoints": [
               {
                  "region": "RegionOne",
                  "publicURL": "http: //192.168.1.22/placement"
               }
            ],
            "type": "placement",
            "name": "placement"
         },
         {
            "endpoints": [
               {
                  "region": "RegionOne",
                  "publicURL": "http: //192.168.1.22/image"
               }
            ],
            "type": "image",
            "name": "glance"
         }
      ],
      "timestamp": "2019-10-15 11: 14: 11.176898",
      "_context_user": "8ca9d932b54747b0895b38a1ab02aa57",
      "_unique_id": "d764a11dfecb449a8748e7659ec41056",
      "_context_resource_uuid": null,
      "_context_instance_lock_checked": false,
      "_context_is_admin_project": true,
      "_context_user_id": "8ca9d932b54747b0895b38a1ab02aa57",
      "payload": {
         "state_description": "",
         "availability_zone": "nova",
         "terminated_at": "",
         "ephemeral_gb": 0,
         "instance_type_id": 6,
         "deleted_at": "",
         "reservation_id": "r-siar9xb4",
         "instance_id": "c8a0de99-370d-46dc-834f-6d827453fc79",
         "display_name": "test_notifications",
         "hostname": "test-notifications",
         "state": "paused",
         "progress": "",
         "launched_at": "2019-10-14T11: 56: 20.000000",
         "metadata": {

         },
         "node": "ubuntu",
         "ramdisk_id": "",
         "access_ip_v6": null,
         "disk_gb": 1,
         "access_ip_v4": null,
         "kernel_id": "",
         "host": "ubuntu",
         "user_id": "8ca9d932b54747b0895b38a1ab02aa57",
         "image_ref_url": "http: //192.168.1.22/image/images/eb119b89-6eed-4bbe-b07f-24935fad410b",
         "cell_name": "",
         "root_gb": 1,
         "tenant_id": "0fa5d78db05b4687a498d6e6abe11816",
         "created_at": "2019-10-14 11: 56: 08+00: 00",
         "memory_mb": 512,
         "instance_type": "m1.tiny",
         "vcpus": 1,
         "image_meta": {
            "min_disk": "1",
            "container_format": "bare",
            "min_ram": "0",
            "disk_format": "qcow2",
            "base_image_ref": "eb119b89-6eed-4bbe-b07f-24935fad410b"
         },
         "architecture": null,
         "os_type": null,
         "instance_flavor_id": "1"
      },
      "_context_project_name": "Catalyst",
      "_context_read_deleted": "no",
      "_context_user_identity": "8ca9d932b54747b0895b38a1ab02aa57 0fa5d78db05b4687a498d6e6abe11816 - default default",
      "_context_auth_token": "gAAAAABdpanBdFCJTUvWpDDFZuv9N3VpI47LYbidBrdvLJQeVPb0oZfo10sEk1V4MlsDBSEbHfEKpc2FHeh8nE9PTYAxzWEiC9Aty_UpAF9nL-1gSNGMgf17hDktq_PgaGkiqIjKwjEq0UF0pj-oh3DuTgrCFuXHAg3iejVGDBXnaj0AJdgbpc76moStlH6St6us6R7xKiWI",
      "_context_show_deleted": false,
      "_context_tenant": "0fa5d78db05b4687a498d6e6abe11816",
      "priority": "INFO",
      "_context_read_only": false,
      "_context_is_admin": true,
      "_context_project_id": "0fa5d78db05b4687a498d6e6abe11816",
      "_context_project_domain": "default",
      "_context_timestamp": "2019-10-15T11: 14: 10.404462",
      "_context_user_domain": "default",
      "_context_user_name": "admin",
      "publisher_id": "compute.ubuntu",
      "message_id": "4457207a-98f0-4846-a3ac-1d70e7333f10",
      "_context_project": "0fa5d78db05b4687a498d6e6abe11816",
      "_context_remote_address": "192.168.1.22"
   },
   "oslo.version": "2.0"
}