{
   "_context_domain":null,
   "_msg_id":"16f4588425594dfc891e701437fa50b5",
   "_context_global_request_id":null,
   "_context_tenant_name":null,
   "_context_read_only":false,
   "_context_request_id":"req-b5419588-2f3f-487b-95ea-0b640564ce83",
   "args":{
      "host":"ubuntu",
      "router_ids":[
         "4855d4d5-dc45-4303-8475-8ba6a9f45528"
      ]
   },
   "_unique_id":"b8b38f71adce426b95c4dc13682f9e08",
   "_context_resource_uuid":null,
   "_context_tenant_id":null,
   "_context_is_admin_project":true,
   "_context_user":null,
   "_context_user_id":null,
   "_context_project_name":null,
   "_context_user_identity":"- - - - -",
   "_reply_q":"reply_3daccf9f213847b78e68874d79b2d0db",
   "_context_auth_token":null,
   "_context_show_deleted":false,
   "_context_tenant":null,
   "_context_roles":[

   ],
   "_context_is_admin":true,
   "version":"1.0",
   "_context_project_id":null,
   "_context_project_domain":null,
   "_context_timestamp":"2019-10-08 12:34:45.283137",
   "_context_user_domain":null,
   "_context_user_name":null,
   "method":"sync_routers",
   "_context_project":null
}