EESchema Schematic File Version 4
EELAYER 30 0
EELAYER END
$Descr A4 11693 8268
encoding utf-8
Sheet 1 1
Title ""
Date ""
Rev ""
Comp ""
Comment1 ""
Comment2 ""
Comment3 ""
Comment4 ""
$EndDescr
Wire Wire Line
	6000 950  6000 900 
$Comp
L power:GND #PWR?
U 1 1 61AC0327
P 6000 1950
F 0 "#PWR?" H 6000 1700 50  0001 C CNN
F 1 "GND" H 6005 1777 50  0000 C CNN
F 2 "" H 6000 1950 50  0001 C CNN
F 3 "" H 6000 1950 50  0001 C CNN
	1    6000 1950
	1    0    0    -1  
$EndComp
$Comp
L power:GND #PWR?
U 1 1 61AC07CF
P 3150 2700
F 0 "#PWR?" H 3150 2450 50  0001 C CNN
F 1 "GND" H 3155 2527 50  0000 C CNN
F 2 "" H 3150 2700 50  0001 C CNN
F 3 "" H 3150 2700 50  0001 C CNN
	1    3150 2700
	1    0    0    -1  
$EndComp
$Comp
L power:+5V #PWR?
U 1 1 61AC2904
P 3150 1250
F 0 "#PWR?" H 3150 1100 50  0001 C CNN
F 1 "+5V" H 3165 1423 50  0000 C CNN
F 2 "" H 3150 1250 50  0001 C CNN
F 3 "" H 3150 1250 50  0001 C CNN
	1    3150 1250
	1    0    0    -1  
$EndComp
$Comp
L power:+5V #PWR?
U 1 1 61AC4F7E
P 3900 1400
F 0 "#PWR?" H 3900 1250 50  0001 C CNN
F 1 "+5V" H 4000 1450 50  0000 C CNN
F 2 "" H 3900 1400 50  0001 C CNN
F 3 "" H 3900 1400 50  0001 C CNN
	1    3900 1400
	1    0    0    -1  
$EndComp
Wire Wire Line
	5150 1900 5150 1150
Wire Wire Line
	5150 1150 5700 1150
$Comp
L Device:R R?
U 1 1 61AC5CF7
P 3900 2200
F 0 "R?" V 3900 2200 50  0000 C CNN
F 1 "10K" V 3800 2200 50  0000 C CNN
F 2 "" V 3830 2200 50  0001 C CNN
F 3 "~" H 3900 2200 50  0001 C CNN
	1    3900 2200
	0    1    1    0   
$EndComp
Wire Wire Line
	5200 1200 5700 1200
$Comp
L power:GND #PWR?
U 1 1 61ACC2AC
P 4200 2600
F 0 "#PWR?" H 4200 2350 50  0001 C CNN
F 1 "GND" H 4200 2450 50  0000 C CNN
F 2 "" H 4200 2600 50  0001 C CNN
F 3 "" H 4200 2600 50  0001 C CNN
	1    4200 2600
	1    0    0    -1  
$EndComp
$Comp
L power:+5V #PWR?
U 1 1 61AD16DF
P 4800 2400
F 0 "#PWR?" H 4800 2250 50  0001 C CNN
F 1 "+5V" H 4815 2573 50  0000 C CNN
F 2 "" H 4800 2400 50  0001 C CNN
F 3 "" H 4800 2400 50  0001 C CNN
	1    4800 2400
	1    0    0    -1  
$EndComp
Wire Wire Line
	4800 2400 4800 2700
Wire Wire Line
	4800 2700 4750 2700
Wire Wire Line
	4050 2200 5200 2200
Wire Wire Line
	5200 1200 5200 2200
$Comp
L power:GND #PWR?
U 1 1 61ADA66D
P 5200 2800
F 0 "#PWR?" H 5200 2550 50  0001 C CNN
F 1 "GND" H 5205 2627 50  0000 C CNN
F 2 "" H 5200 2800 50  0001 C CNN
F 3 "" H 5200 2800 50  0001 C CNN
	1    5200 2800
	1    0    0    -1  
$EndComp
$Comp
L Device:R R?
U 1 1 61AC6072
P 5200 2650
F 0 "R?" V 5200 2650 50  0000 C CNN
F 1 "10K" V 5300 2650 50  0000 C CNN
F 2 "" V 5130 2650 50  0001 C CNN
F 3 "~" H 5200 2650 50  0001 C CNN
	1    5200 2650
	1    0    0    -1  
$EndComp
$Comp
L Device:R R?
U 1 1 61AC692A
P 5200 2350
F 0 "R?" V 5200 2350 50  0000 C CNN
F 1 "10K" V 5300 2350 50  0000 C CNN
F 2 "" V 5130 2350 50  0001 C CNN
F 3 "~" H 5200 2350 50  0001 C CNN
	1    5200 2350
	1    0    0    -1  
$EndComp
$Comp
L random:ESP-01S U?
U 1 1 61AB6D41
P 6000 1450
F 0 "U?" H 6050 2131 50  0000 C CNN
F 1 "ESP-01S" H 6050 2040 50  0000 C CNN
F 2 "" V 6050 1550 50  0001 C CNN
F 3 "" V 6050 1550 50  0001 C CNN
	1    6000 1450
	1    0    0    -1  
$EndComp
Connection ~ 5200 2200
Wire Wire Line
	4750 2600 4750 2500
Wire Wire Line
	4750 2500 4200 2500
Wire Wire Line
	4200 2500 4200 2600
$Comp
L Connector:AudioJack4 J?
U 1 1 61ACD364
P 4550 2700
F 0 "J?" H 4507 3025 50  0000 C CNN
F 1 "AudioJack4" H 4507 2934 50  0000 C CNN
F 2 "" H 4550 2700 50  0001 C CNN
F 3 "~" H 4550 2700 50  0001 C CNN
	1    4550 2700
	1    0    0    -1  
$EndComp
Wire Wire Line
	4750 2900 5000 2900
Wire Wire Line
	5000 2900 5000 1800
Wire Wire Line
	4750 2800 4950 2800
Wire Wire Line
	4950 2800 4950 2000
Wire Wire Line
	6400 1450 6400 1350
Wire Wire Line
	6400 1350 6400 900 
Connection ~ 6400 1350
Connection ~ 6000 900 
$Comp
L Device:C C?
U 1 1 61AEC9E6
P 3300 1400
F 0 "C?" V 3450 1400 50  0000 C CNN
F 1 "10nF" V 3139 1400 50  0000 C CNN
F 2 "" H 3338 1250 50  0001 C CNN
F 3 "~" H 3300 1400 50  0001 C CNN
	1    3300 1400
	0    1    1    0   
$EndComp
Wire Wire Line
	3150 1500 3150 1400
Wire Wire Line
	3150 1250 3150 1400
Connection ~ 3150 1400
$Comp
L power:GND #PWR?
U 1 1 61AF1A00
P 3450 1400
F 0 "#PWR?" H 3450 1150 50  0001 C CNN
F 1 "GND" H 3450 1250 50  0000 C CNN
F 2 "" H 3450 1400 50  0001 C CNN
F 3 "" H 3450 1400 50  0001 C CNN
	1    3450 1400
	1    0    0    -1  
$EndComp
$Comp
L random:3.7-5VStepUp U?
U 1 1 61AFA379
P 3150 3450
F 0 "U?" H 3150 3875 50  0000 C CNN
F 1 "3.7-5VStepUp" H 3150 3784 50  0000 C CNN
F 2 "" H 3150 3450 50  0001 C CNN
F 3 "" H 3150 3450 50  0001 C CNN
	1    3150 3450
	1    0    0    -1  
$EndComp
$Comp
L random:TP4056 U?
U 1 1 61AFB186
P 2200 3450
F 0 "U?" H 2200 3915 50  0000 C CNN
F 1 "TP4056" H 2200 3824 50  0000 C CNN
F 2 "" H 2200 3450 50  0001 C CNN
F 3 "" H 2200 3450 50  0001 C CNN
	1    2200 3450
	1    0    0    -1  
$EndComp
$Comp
L power:GND #PWR?
U 1 1 61AFEFEB
P 3600 3600
F 0 "#PWR?" H 3600 3350 50  0001 C CNN
F 1 "GND" H 3605 3427 50  0000 C CNN
F 2 "" H 3600 3600 50  0001 C CNN
F 3 "" H 3600 3600 50  0001 C CNN
	1    3600 3600
	1    0    0    -1  
$EndComp
$Comp
L power:+5V #PWR?
U 1 1 61AFF45E
P 3600 3250
F 0 "#PWR?" H 3600 3100 50  0001 C CNN
F 1 "+5V" H 3615 3423 50  0000 C CNN
F 2 "" H 3600 3250 50  0001 C CNN
F 3 "" H 3600 3250 50  0001 C CNN
	1    3600 3250
	1    0    0    -1  
$EndComp
$Comp
L Device:Battery BT?
U 1 1 61B01B0B
P 800 3450
F 0 "BT?" H 908 3496 50  0000 L CNN
F 1 "Battery" H 908 3405 50  0000 L CNN
F 2 "" V 800 3510 50  0001 C CNN
F 3 "~" V 800 3510 50  0001 C CNN
	1    800  3450
	1    0    0    -1  
$EndComp
Wire Wire Line
	800  3650 1050 3650
Wire Wire Line
	1700 3350 1050 3350
Wire Wire Line
	1050 3350 1050 3650
Wire Wire Line
	1700 3250 800  3250
$Comp
L Connector:Jack-DC J?
U 1 1 61B05447
P 1450 4000
F 0 "J?" V 1553 4188 50  0000 L CNN
F 1 "Jack-DC" V 1462 4188 50  0000 L CNN
F 2 "" H 1500 3960 50  0001 C CNN
F 3 "~" H 1500 3960 50  0001 C CNN
	1    1450 4000
	0    1    -1   0   
$EndComp
Wire Wire Line
	1700 3550 1550 3550
Wire Wire Line
	1550 3550 1550 3700
Wire Wire Line
	1700 3450 1350 3450
Wire Wire Line
	1350 3450 1350 3700
Wire Wire Line
	6400 900  6000 900 
Wire Wire Line
	4950 2000 4100 2000
$Comp
L power:+5V #PWR?
U 1 1 61B09F55
P 4550 900
F 0 "#PWR?" H 4550 750 50  0001 C CNN
F 1 "+5V" H 4565 1073 50  0000 C CNN
F 2 "" H 4550 900 50  0001 C CNN
F 3 "" H 4550 900 50  0001 C CNN
	1    4550 900 
	1    0    0    -1  
$EndComp
$Comp
L power:GND #PWR?
U 1 1 61ABE193
P 4850 1200
F 0 "#PWR?" H 4850 950 50  0001 C CNN
F 1 "GND" H 4855 1027 50  0000 C CNN
F 2 "" H 4850 1200 50  0001 C CNN
F 3 "" H 4850 1200 50  0001 C CNN
	1    4850 1200
	1    0    0    -1  
$EndComp
Wire Wire Line
	6000 900  5150 900 
$Comp
L Regulator_Linear:TC1262-33 U?
U 1 1 61AB475A
P 4850 900
F 0 "U?" H 4850 1142 50  0000 C CNN
F 1 "TC1264-33" H 4850 1051 50  0000 C CNN
F 2 "" H 4850 1125 50  0001 C CIN
F 3 "http://ww1.microchip.com/downloads/en/DeviceDoc/21373C.pdf" H 4850 600 50  0001 C CNN
	1    4850 900 
	1    0    0    -1  
$EndComp
$Comp
L Device:R 10K
U 1 1 61B13B43
P 3900 1600
F 0 "10K" H 3970 1646 50  0000 L CNN
F 1 "R" H 3970 1555 50  0000 L CNN
F 2 "" V 3830 1600 50  0001 C CNN
F 3 "~" H 3900 1600 50  0001 C CNN
	1    3900 1600
	1    0    0    -1  
$EndComp
$Comp
L MCU_Microchip_ATtiny:ATtiny85-20PU U?
U 1 1 61AB2FC9
P 3150 2100
F 0 "U?" H 2621 2146 50  0000 R CNN
F 1 "ATtiny85-20PU" H 2621 2055 50  0000 R CNN
F 2 "Package_DIP:DIP-8_W7.62mm" H 3150 2100 50  0001 C CIN
F 3 "http://ww1.microchip.com/downloads/en/DeviceDoc/atmel-2586-avr-8-bit-microcontroller-attiny25-attiny45-attiny85_datasheet.pdf" H 3150 2100 50  0001 C CNN
	1    3150 2100
	1    0    0    -1  
$EndComp
Wire Wire Line
	3750 2300 4500 2300
Connection ~ 3900 1450
$Comp
L Device:R 10K
U 1 1 61B175A3
P 4100 1600
F 0 "10K" H 4170 1646 50  0000 L CNN
F 1 "R" H 4170 1555 50  0000 L CNN
F 2 "" V 4030 1600 50  0001 C CNN
F 3 "~" H 4100 1600 50  0001 C CNN
	1    4100 1600
	1    0    0    -1  
$EndComp
$Comp
L Device:R 10K
U 1 1 61B1C397
P 4500 1600
F 0 "10K" H 4570 1646 50  0000 L CNN
F 1 "R" H 4570 1555 50  0000 L CNN
F 2 "" V 4430 1600 50  0001 C CNN
F 3 "~" H 4500 1600 50  0001 C CNN
	1    4500 1600
	1    0    0    -1  
$EndComp
Wire Wire Line
	3750 1800 3900 1800
Wire Wire Line
	3750 1900 5150 1900
Wire Wire Line
	3900 1350 3900 1450
Wire Wire Line
	4500 1750 4500 2300
Wire Wire Line
	3900 1750 3900 1800
Connection ~ 3900 1800
Wire Wire Line
	3900 1800 5000 1800
Connection ~ 4100 2000
Wire Wire Line
	4100 2000 3750 2000
Wire Wire Line
	3900 1450 4100 1450
Connection ~ 4100 1450
Wire Wire Line
	4100 1450 4500 1450
Wire Wire Line
	4100 1750 4100 2000
$EndSCHEMATC
