EESchema Schematic File Version 4
EELAYER 30 0
EELAYER END
$Descr A4 11693 8268
encoding utf-8
Sheet 1 1
Title ""
Date ""
Rev ""
Comp ""
Comment1 ""
Comment2 ""
Comment3 ""
Comment4 ""
$EndDescr
Wire Wire Line
	5150 2500 5150 2400
Wire Wire Line
	4500 2700 4500 2250
$Comp
L power:GND #PWR?
U 1 1 615E59E6
P 5150 3750
F 0 "#PWR?" H 5150 3500 50  0001 C CNN
F 1 "GND" H 5155 3577 50  0000 C CNN
F 2 "" H 5150 3750 50  0001 C CNN
F 3 "" H 5150 3750 50  0001 C CNN
	1    5150 3750
	1    0    0    -1  
$EndComp
$Comp
L Device:R 40R
U 1 1 615E8E74
P 6700 2700
F 0 "40R" V 6700 2700 50  0000 C CNN
F 1 " " V 6584 2700 50  0000 C CNN
F 2 "" V 6630 2700 50  0001 C CNN
F 3 "~" H 6700 2700 50  0001 C CNN
	1    6700 2700
	0    1    1    0   
$EndComp
$Comp
L Device:R 40R
U 1 1 615ED448
P 6700 2800
F 0 "40R" V 6700 2800 50  0000 C CNN
F 1 " " V 6584 2800 50  0000 C CNN
F 2 "" V 6630 2800 50  0001 C CNN
F 3 "~" H 6700 2800 50  0001 C CNN
	1    6700 2800
	0    1    1    0   
$EndComp
Wire Wire Line
	6850 2700 7150 2700
Wire Wire Line
	6850 2800 8200 2800
Wire Wire Line
	8200 2550 8200 2800
Connection ~ 8200 2550
Wire Wire Line
	8200 2550 7950 2550
Connection ~ 8450 2550
Wire Wire Line
	8450 2550 8200 2550
Connection ~ 8200 2250
Wire Wire Line
	7950 2250 8200 2250
Connection ~ 8450 2250
Wire Wire Line
	8450 2250 8200 2250
Wire Wire Line
	8700 2250 8450 2250
$Comp
L Device:LED D?
U 1 1 61615BA6
P 8200 2400
F 0 "D?" V 8147 2480 50  0000 L CNN
F 1 "LED" V 8238 2480 50  0000 L CNN
F 2 "" H 8200 2400 50  0001 C CNN
F 3 "~" H 8200 2400 50  0001 C CNN
	1    8200 2400
	0    -1   -1   0   
$EndComp
$Comp
L Device:LED D?
U 1 1 61615BA0
P 8450 2400
F 0 "D?" V 8397 2480 50  0000 L CNN
F 1 "LED" V 8488 2480 50  0000 L CNN
F 2 "" H 8450 2400 50  0001 C CNN
F 3 "~" H 8450 2400 50  0001 C CNN
	1    8450 2400
	0    -1   -1   0   
$EndComp
$Comp
L Device:LED D?
U 1 1 61615B9A
P 8700 2400
F 0 "D?" V 8647 2480 50  0000 L CNN
F 1 "LED" V 8738 2480 50  0000 L CNN
F 2 "" H 8700 2400 50  0001 C CNN
F 3 "~" H 8700 2400 50  0001 C CNN
	1    8700 2400
	0    -1   -1   0   
$EndComp
Connection ~ 7150 2550
Wire Wire Line
	7150 2550 6900 2550
Connection ~ 7400 2550
Wire Wire Line
	7400 2550 7150 2550
Wire Wire Line
	7650 2550 7400 2550
Connection ~ 7150 2250
Wire Wire Line
	6900 2250 7150 2250
Connection ~ 7400 2250
Wire Wire Line
	7400 2250 7150 2250
Wire Wire Line
	7650 2250 7400 2250
$Comp
L Device:LED D?
U 1 1 61600C6C
P 6900 2400
F 0 "D?" V 6847 2480 50  0000 L CNN
F 1 "LED" V 6938 2480 50  0000 L CNN
F 2 "" H 6900 2400 50  0001 C CNN
F 3 "~" H 6900 2400 50  0001 C CNN
	1    6900 2400
	0    -1   -1   0   
$EndComp
$Comp
L Device:LED D?
U 1 1 6160046D
P 7150 2400
F 0 "D?" V 7097 2480 50  0000 L CNN
F 1 "LED" V 7188 2480 50  0000 L CNN
F 2 "" H 7150 2400 50  0001 C CNN
F 3 "~" H 7150 2400 50  0001 C CNN
	1    7150 2400
	0    -1   -1   0   
$EndComp
$Comp
L Device:LED D?
U 1 1 615FFBC6
P 7400 2400
F 0 "D?" V 7347 2480 50  0000 L CNN
F 1 "LED" V 7438 2480 50  0000 L CNN
F 2 "" H 7400 2400 50  0001 C CNN
F 3 "~" H 7400 2400 50  0001 C CNN
	1    7400 2400
	0    -1   -1   0   
$EndComp
$Comp
L Device:LED D?
U 1 1 615F614A
P 7650 2400
F 0 "D?" V 7597 2480 50  0000 L CNN
F 1 "LED" V 7688 2480 50  0000 L CNN
F 2 "" H 7650 2400 50  0001 C CNN
F 3 "~" H 7650 2400 50  0001 C CNN
	1    7650 2400
	0    -1   -1   0   
$EndComp
Wire Wire Line
	4500 2700 4650 2700
$Comp
L Device:LED D?
U 1 1 61615BAC
P 7950 2400
F 0 "D?" V 7897 2480 50  0000 L CNN
F 1 "LED" V 7988 2480 50  0000 L CNN
F 2 "" H 7950 2400 50  0001 C CNN
F 3 "~" H 7950 2400 50  0001 C CNN
	1    7950 2400
	0    -1   -1   0   
$EndComp
Wire Wire Line
	6150 3600 6150 3750
Wire Wire Line
	4750 3300 4750 3500
Wire Wire Line
	4650 3300 4500 3300
Wire Wire Line
	5650 2700 5750 2700
Wire Wire Line
	5750 2800 5650 2800
Wire Wire Line
	5650 2900 5750 2900
Wire Wire Line
	5750 3000 5650 3000
Wire Wire Line
	5650 3100 5750 3100
Connection ~ 5150 2250
Wire Wire Line
	4500 2250 5150 2250
$Comp
L power:+5V #PWR?
U 1 1 615E6EF3
P 5150 2250
F 0 "#PWR?" H 5150 2100 50  0001 C CNN
F 1 "+5V" H 5165 2423 50  0000 C CNN
F 2 "" H 5150 2250 50  0001 C CNN
F 3 "" H 5150 2250 50  0001 C CNN
	1    5150 2250
	1    0    0    -1  
$EndComp
Wire Wire Line
	5150 2250 6550 2250
$Comp
L Interface_Expansion:MCP23008-xP U1
U 1 1 615C63E7
P 5150 3100
F 0 "U1" H 5050 3050 50  0000 C CNN
F 1 "MCP23008-xP" V 5150 3100 50  0000 C CNN
F 2 "Package_DIP:DIP-18_W7.62mm" H 5150 2050 50  0001 C CNN
F 3 "http://ww1.microchip.com/downloads/en/DeviceDoc/MCP23008-MCP23S08-Data-Sheet-20001919F.pdf" H 6450 1900 50  0001 C CNN
	1    5150 3100
	1    0    0    -1  
$EndComp
$Comp
L Device:C C?
U 1 1 61797844
P 5300 2400
F 0 "C?" V 5048 2400 50  0000 C CNN
F 1 "C" V 5139 2400 50  0000 C CNN
F 2 "" H 5338 2250 50  0001 C CNN
F 3 "~" H 5300 2400 50  0001 C CNN
	1    5300 2400
	0    1    1    0   
$EndComp
Connection ~ 5150 2400
Wire Wire Line
	5150 2400 5150 2250
$Comp
L power:GND #PWR?
U 1 1 6179A090
P 5450 2400
F 0 "#PWR?" H 5450 2150 50  0001 C CNN
F 1 "GND" H 5450 2250 50  0000 C CNN
F 2 "" H 5450 2400 50  0001 C CNN
F 3 "" H 5450 2400 50  0001 C CNN
	1    5450 2400
	1    0    0    -1  
$EndComp
Wire Wire Line
	4500 3500 4500 3400
Wire Wire Line
	4650 3400 4500 3400
Connection ~ 4500 3400
Wire Wire Line
	4500 3400 4500 3300
Wire Wire Line
	4650 3500 4500 3500
Connection ~ 4500 3500
Connection ~ 4500 3300
Connection ~ 4500 2700
Wire Wire Line
	6150 3750 5150 3750
Wire Wire Line
	5150 3700 5150 3750
Connection ~ 5150 3750
Wire Wire Line
	5150 3750 4350 3750
Wire Wire Line
	4500 2700 4500 3300
Wire Wire Line
	7150 2700 7150 2550
Wire Wire Line
	7950 2250 7650 2250
Connection ~ 7950 2250
Connection ~ 7650 2250
Wire Wire Line
	6900 2250 6550 2250
Connection ~ 6900 2250
Connection ~ 6550 2250
Wire Wire Line
	6550 2250 6550 2600
Wire Wire Line
	4350 3500 4500 3500
Wire Wire Line
	4350 3600 4350 3750
$Comp
L Connector:AudioJack4 J?
U 1 1 61793BCF
P 4150 3500
F 0 "J?" H 4050 3750 50  0000 R CNN
F 1 "AudioJack4" H 4300 3700 50  0000 R CNN
F 2 "" H 4150 3500 50  0001 C CNN
F 3 "~" H 4150 3500 50  0001 C CNN
	1    4150 3500
	1    0    0    1   
$EndComp
Wire Wire Line
	4350 3300 4350 2900
Wire Wire Line
	4350 2900 4650 2900
Wire Wire Line
	4350 3400 4400 3400
Wire Wire Line
	4400 3400 4400 2800
Wire Wire Line
	4400 2800 4650 2800
$Comp
L Transistor_Array:ULN2803A U2
U 1 1 615C52DE
P 6150 2900
F 0 "U2" H 6200 3000 50  0000 C CNN
F 1 "ULN2803A" V 6200 2700 50  0000 C CNN
F 2 "" H 6200 2250 50  0001 L CNN
F 3 "http://www.ti.com/lit/ds/symlink/uln2803a.pdf" H 6250 2700 50  0001 C CNN
	1    6150 2900
	1    0    0    -1  
$EndComp
Wire Wire Line
	8700 2550 8450 2550
$Comp
L Device:R 40R
U 1 1 615EF0FE
P 6700 3000
F 0 "40R" V 6700 3000 50  0000 C CNN
F 1 " " V 6584 3000 50  0000 C CNN
F 2 "" V 6630 3000 50  0001 C CNN
F 3 "~" H 6700 3000 50  0001 C CNN
	1    6700 3000
	0    1    -1   0   
$EndComp
$Comp
L Device:R 40R
U 1 1 615EEC45
P 6700 2900
F 0 "40R" V 6700 2900 50  0000 C CNN
F 1 " " V 6584 2900 50  0000 C CNN
F 2 "" V 6630 2900 50  0001 C CNN
F 3 "~" H 6700 2900 50  0001 C CNN
	1    6700 2900
	0    1    1    0   
$EndComp
$Comp
L Device:R 40R
U 1 1 615EF613
P 6700 3100
F 0 "40R" V 6700 3100 50  0000 C CNN
F 1 " " V 6584 3100 50  0000 C CNN
F 2 "" V 6630 3100 50  0001 C CNN
F 3 "~" H 6700 3100 50  0001 C CNN
	1    6700 3100
	0    1    1    0   
$EndComp
Wire Wire Line
	6950 3100 6850 3100
$Comp
L power:+5V #PWR?
U 1 1 616353B9
P 7400 3350
F 0 "#PWR?" H 7400 3200 50  0001 C CNN
F 1 "+5V" H 7415 3523 50  0000 C CNN
F 2 "" H 7400 3350 50  0001 C CNN
F 3 "" H 7400 3350 50  0001 C CNN
	1    7400 3350
	1    0    0    -1  
$EndComp
Wire Wire Line
	7400 3350 7250 3350
Connection ~ 7250 3350
Wire Wire Line
	7250 3100 7250 3350
Connection ~ 6950 3100
Connection ~ 6950 3350
Wire Wire Line
	6950 3350 6950 3100
Connection ~ 6950 3600
Wire Wire Line
	6950 3600 6950 3350
Wire Wire Line
	6950 3850 6950 3600
Connection ~ 7250 3600
Wire Wire Line
	7250 3600 7250 3350
Wire Wire Line
	7250 3850 7250 3600
$Comp
L Device:LED D?
U 1 1 616353AE
P 7100 3100
F 0 "D?" V 7047 3180 50  0000 L CNN
F 1 "LED" V 7138 3180 50  0000 L CNN
F 2 "" H 7100 3100 50  0001 C CNN
F 3 "~" H 7100 3100 50  0001 C CNN
	1    7100 3100
	1    0    0    -1  
$EndComp
$Comp
L Device:LED D?
U 1 1 616353A8
P 7100 3350
F 0 "D?" V 7047 3430 50  0000 L CNN
F 1 "LED" V 7138 3430 50  0000 L CNN
F 2 "" H 7100 3350 50  0001 C CNN
F 3 "~" H 7100 3350 50  0001 C CNN
	1    7100 3350
	1    0    0    -1  
$EndComp
$Comp
L Device:LED D?
U 1 1 616353A2
P 7100 3600
F 0 "D?" V 7047 3680 50  0000 L CNN
F 1 "LED" V 7138 3680 50  0000 L CNN
F 2 "" H 7100 3600 50  0001 C CNN
F 3 "~" H 7100 3600 50  0001 C CNN
	1    7100 3600
	1    0    0    -1  
$EndComp
$Comp
L Device:LED D?
U 1 1 6163539C
P 7100 3850
F 0 "D?" V 7047 3930 50  0000 L CNN
F 1 "LED" V 7138 3930 50  0000 L CNN
F 2 "" H 7100 3850 50  0001 C CNN
F 3 "~" H 7100 3850 50  0001 C CNN
	1    7100 3850
	1    0    0    -1  
$EndComp
Wire Wire Line
	6850 3000 7650 3000
$Comp
L power:+5V #PWR?
U 1 1 6181AC80
P 8150 3250
F 0 "#PWR?" H 8150 3100 50  0001 C CNN
F 1 "+5V" H 8165 3423 50  0000 C CNN
F 2 "" H 8150 3250 50  0001 C CNN
F 3 "" H 8150 3250 50  0001 C CNN
	1    8150 3250
	1    0    0    -1  
$EndComp
Connection ~ 7650 3000
Connection ~ 7650 3250
Wire Wire Line
	7650 3250 7650 3000
Connection ~ 7650 3500
Wire Wire Line
	7650 3500 7650 3250
Wire Wire Line
	7650 3750 7650 3500
Wire Wire Line
	7950 3250 8150 3250
Connection ~ 7950 3250
Wire Wire Line
	7950 3000 7950 3250
Connection ~ 7950 3500
Wire Wire Line
	7950 3500 7950 3250
Wire Wire Line
	7950 3750 7950 3500
$Comp
L Device:LED D?
U 1 1 6162FA13
P 7800 3000
F 0 "D?" V 7747 3080 50  0000 L CNN
F 1 "LED" V 7838 3080 50  0000 L CNN
F 2 "" H 7800 3000 50  0001 C CNN
F 3 "~" H 7800 3000 50  0001 C CNN
	1    7800 3000
	1    0    0    -1  
$EndComp
$Comp
L Device:LED D?
U 1 1 6162FA0D
P 7800 3250
F 0 "D?" V 7747 3330 50  0000 L CNN
F 1 "LED" V 7838 3330 50  0000 L CNN
F 2 "" H 7800 3250 50  0001 C CNN
F 3 "~" H 7800 3250 50  0001 C CNN
	1    7800 3250
	1    0    0    -1  
$EndComp
$Comp
L Device:LED D?
U 1 1 6162FA07
P 7800 3500
F 0 "D?" V 7747 3580 50  0000 L CNN
F 1 "LED" V 7838 3580 50  0000 L CNN
F 2 "" H 7800 3500 50  0001 C CNN
F 3 "~" H 7800 3500 50  0001 C CNN
	1    7800 3500
	1    0    0    -1  
$EndComp
$Comp
L Device:LED D?
U 1 1 6162FA01
P 7800 3750
F 0 "D?" V 7747 3830 50  0000 L CNN
F 1 "LED" V 7838 3830 50  0000 L CNN
F 2 "" H 7800 3750 50  0001 C CNN
F 3 "~" H 7800 3750 50  0001 C CNN
	1    7800 3750
	1    0    0    -1  
$EndComp
Wire Wire Line
	8300 2900 6850 2900
Wire Wire Line
	8300 3150 8300 2900
Connection ~ 8300 3150
Connection ~ 8300 2900
Wire Wire Line
	8300 3400 8300 3150
Wire Wire Line
	8300 3650 8300 3400
Connection ~ 8300 3400
$Comp
L power:+5V #PWR?
U 1 1 616185D0
P 8700 3150
F 0 "#PWR?" H 8700 3000 50  0001 C CNN
F 1 "+5V" H 8715 3323 50  0000 C CNN
F 2 "" H 8700 3150 50  0001 C CNN
F 3 "" H 8700 3150 50  0001 C CNN
	1    8700 3150
	1    0    0    -1  
$EndComp
$Comp
L Device:LED D?
U 1 1 616185B3
P 8450 3650
F 0 "D?" V 8397 3730 50  0000 L CNN
F 1 "LED" V 8488 3730 50  0000 L CNN
F 2 "" H 8450 3650 50  0001 C CNN
F 3 "~" H 8450 3650 50  0001 C CNN
	1    8450 3650
	1    0    0    -1  
$EndComp
$Comp
L Device:LED D?
U 1 1 616185B9
P 8450 3400
F 0 "D?" V 8397 3480 50  0000 L CNN
F 1 "LED" V 8488 3480 50  0000 L CNN
F 2 "" H 8450 3400 50  0001 C CNN
F 3 "~" H 8450 3400 50  0001 C CNN
	1    8450 3400
	1    0    0    -1  
$EndComp
$Comp
L Device:LED D?
U 1 1 616185BF
P 8450 3150
F 0 "D?" V 8397 3230 50  0000 L CNN
F 1 "LED" V 8488 3230 50  0000 L CNN
F 2 "" H 8450 3150 50  0001 C CNN
F 3 "~" H 8450 3150 50  0001 C CNN
	1    8450 3150
	1    0    0    -1  
$EndComp
$Comp
L Device:LED D?
U 1 1 616185C5
P 8450 2900
F 0 "D?" V 8397 2980 50  0000 L CNN
F 1 "LED" V 8488 2980 50  0000 L CNN
F 2 "" H 8450 2900 50  0001 C CNN
F 3 "~" H 8450 2900 50  0001 C CNN
	1    8450 2900
	1    0    0    -1  
$EndComp
Wire Wire Line
	8600 3400 8600 3150
Wire Wire Line
	8600 3150 8600 2900
Connection ~ 8600 3150
Wire Wire Line
	8600 3650 8600 3400
Connection ~ 8600 3400
Wire Wire Line
	8700 3150 8600 3150
Entry Wire Line
	7700 3350 7800 3450
Entry Wire Line
	7700 3350 7800 3450
$EndSCHEMATC
