EESchema Schematic File Version 4
EELAYER 30 0
EELAYER END
$Descr A4 11693 8268
encoding utf-8
Sheet 1 1
Title ""
Date ""
Rev ""
Comp ""
Comment1 ""
Comment2 ""
Comment3 ""
Comment4 ""
$EndDescr
$Comp
L power:GND #PWR?
U 1 1 615D75AF
P 2000 3300
F 0 "#PWR?" H 2000 3050 50  0001 C CNN
F 1 "GND" H 2005 3127 50  0000 C CNN
F 2 "" H 2000 3300 50  0001 C CNN
F 3 "" H 2000 3300 50  0001 C CNN
	1    2000 3300
	1    0    0    -1  
$EndComp
$Comp
L Regulator_Linear:LM1084-3.3 U?
U 1 1 615DCBE8
P 2000 2200
F 0 "U?" H 2000 2442 50  0000 C CNN
F 1 "LM1084-3.3" H 2000 2351 50  0000 C CNN
F 2 "" H 2000 2450 50  0001 C CIN
F 3 "http://www.ti.com/lit/ds/symlink/lm1084.pdf" H 2000 2200 50  0001 C CNN
	1    2000 2200
	1    0    0    -1  
$EndComp
$Comp
L power:GND #PWR?
U 1 1 615DFF3F
P 2000 2500
F 0 "#PWR?" H 2000 2250 50  0001 C CNN
F 1 "GND" H 2005 2327 50  0000 C CNN
F 2 "" H 2000 2500 50  0001 C CNN
F 3 "" H 2000 2500 50  0001 C CNN
	1    2000 2500
	1    0    0    -1  
$EndComp
$Comp
L power:+12V #PWR?
U 1 1 615E6888
P 1700 2200
F 0 "#PWR?" H 1700 2050 50  0001 C CNN
F 1 "+12V" H 1750 2400 50  0000 C CNN
F 2 "" H 1700 2200 50  0001 C CNN
F 3 "" H 1700 2200 50  0001 C CNN
	1    1700 2200
	1    0    0    -1  
$EndComp
$Comp
L power:+5V #PWR?
U 1 1 615E763B
P 2300 3000
F 0 "#PWR?" H 2300 2850 50  0001 C CNN
F 1 "+5V" H 2315 3173 50  0000 C CNN
F 2 "" H 2300 3000 50  0001 C CNN
F 3 "" H 2300 3000 50  0001 C CNN
	1    2300 3000
	1    0    0    -1  
$EndComp
$Comp
L power:+5V #PWR?
U 1 1 615E89CB
P 3450 1000
F 0 "#PWR?" H 3450 850 50  0001 C CNN
F 1 "+5V" H 3465 1173 50  0000 C CNN
F 2 "" H 3450 1000 50  0001 C CNN
F 3 "" H 3450 1000 50  0001 C CNN
	1    3450 1000
	1    0    0    -1  
$EndComp
$Comp
L power:GND #PWR?
U 1 1 615F7CE0
P 3350 3000
F 0 "#PWR?" H 3350 2750 50  0001 C CNN
F 1 "GND" H 3355 2827 50  0000 C CNN
F 2 "" H 3350 3000 50  0001 C CNN
F 3 "" H 3350 3000 50  0001 C CNN
	1    3350 3000
	1    0    0    -1  
$EndComp
$Comp
L power:GND #PWR?
U 1 1 615F9294
P 3250 3000
F 0 "#PWR?" H 3250 2750 50  0001 C CNN
F 1 "GND" H 3255 2827 50  0000 C CNN
F 2 "" H 3250 3000 50  0001 C CNN
F 3 "" H 3250 3000 50  0001 C CNN
	1    3250 3000
	1    0    0    -1  
$EndComp
$Comp
L Device:R 100K
U 1 1 61603B3D
P 5150 2900
F 0 "100K" V 5150 2900 50  0000 C CNN
F 1 " " V 5034 2900 50  0000 C CNN
F 2 "" V 5080 2900 50  0001 C CNN
F 3 "~" H 5150 2900 50  0001 C CNN
	1    5150 2900
	1    0    0    -1  
$EndComp
$Comp
L Device:R 100K
U 1 1 616060D3
P 5150 2450
F 0 "100K" V 5150 2450 50  0000 C CNN
F 1 " " V 5034 2450 50  0000 C CNN
F 2 "" V 5080 2450 50  0001 C CNN
F 3 "~" H 5150 2450 50  0001 C CNN
	1    5150 2450
	1    0    0    -1  
$EndComp
$Comp
L power:GND #PWR?
U 1 1 6160BA11
P 5150 3150
F 0 "#PWR?" H 5150 2900 50  0001 C CNN
F 1 "GND" H 5155 2977 50  0000 C CNN
F 2 "" H 5150 3150 50  0001 C CNN
F 3 "" H 5150 3150 50  0001 C CNN
	1    5150 3150
	1    0    0    -1  
$EndComp
$Comp
L Switch:SW_Push SW?
U 1 1 6160E018
P 5400 2500
F 0 "SW?" V 5354 2648 50  0000 L CNN
F 1 "TeamA:TTO" V 5445 2648 50  0000 L CNN
F 2 "" H 5400 2700 50  0001 C CNN
F 3 "~" H 5400 2700 50  0001 C CNN
	1    5400 2500
	0    1    1    0   
$EndComp
$Comp
L Switch:SW_Push SW?
U 1 1 6160FE83
P 5400 2900
F 0 "SW?" V 5354 3048 50  0000 L CNN
F 1 "TeamA:OR" V 5445 3048 50  0000 L CNN
F 2 "" H 5400 3100 50  0001 C CNN
F 3 "~" H 5400 3100 50  0001 C CNN
	1    5400 2900
	0    1    1    0   
$EndComp
Wire Wire Line
	5150 2600 5150 2700
Wire Wire Line
	5400 2700 5150 2700
Connection ~ 5400 2700
Connection ~ 5150 2700
Wire Wire Line
	5150 2700 5150 2750
Wire Wire Line
	5400 2300 5150 2300
Wire Wire Line
	5150 3150 5150 3100
Wire Wire Line
	5400 3100 5150 3100
Connection ~ 5150 3100
Wire Wire Line
	5150 3100 5150 3050
$Comp
L Device:R 100K
U 1 1 6163CBE0
P 6000 2900
F 0 "100K" V 6000 2900 50  0000 C CNN
F 1 " " V 5884 2900 50  0000 C CNN
F 2 "" V 5930 2900 50  0001 C CNN
F 3 "~" H 6000 2900 50  0001 C CNN
	1    6000 2900
	1    0    0    -1  
$EndComp
$Comp
L Device:R 100K
U 1 1 6163CBE6
P 6000 2450
F 0 "100K" V 6000 2450 50  0000 C CNN
F 1 " " V 5884 2450 50  0000 C CNN
F 2 "" V 5930 2450 50  0001 C CNN
F 3 "~" H 6000 2450 50  0001 C CNN
	1    6000 2450
	1    0    0    -1  
$EndComp
$Comp
L power:GND #PWR?
U 1 1 6163CBEC
P 6000 3150
F 0 "#PWR?" H 6000 2900 50  0001 C CNN
F 1 "GND" H 6005 2977 50  0000 C CNN
F 2 "" H 6000 3150 50  0001 C CNN
F 3 "" H 6000 3150 50  0001 C CNN
	1    6000 3150
	1    0    0    -1  
$EndComp
$Comp
L Switch:SW_Push SW?
U 1 1 6163CBF2
P 6250 2500
F 0 "SW?" V 6204 2648 50  0000 L CNN
F 1 "Team1:TTO" V 6295 2648 50  0000 L CNN
F 2 "" H 6250 2700 50  0001 C CNN
F 3 "~" H 6250 2700 50  0001 C CNN
	1    6250 2500
	0    1    1    0   
$EndComp
$Comp
L Switch:SW_Push SW?
U 1 1 6163CBF8
P 6250 2900
F 0 "SW?" V 6204 3048 50  0000 L CNN
F 1 "Team1:OR" V 6295 3048 50  0000 L CNN
F 2 "" H 6250 3100 50  0001 C CNN
F 3 "~" H 6250 3100 50  0001 C CNN
	1    6250 2900
	0    1    1    0   
$EndComp
Wire Wire Line
	6000 2600 6000 2700
Connection ~ 6250 2700
Connection ~ 6000 2700
Wire Wire Line
	6000 2700 6000 2750
Wire Wire Line
	6000 3150 6000 3100
Wire Wire Line
	6250 3100 6000 3100
Connection ~ 6000 3100
Wire Wire Line
	6000 3100 6000 3050
$Comp
L Device:R 1K
U 1 1 6163CC08
P 6000 2150
F 0 "1K" V 6000 2150 50  0000 C CNN
F 1 " " V 5884 2150 50  0000 C CNN
F 2 "" V 5930 2150 50  0001 C CNN
F 3 "~" H 6000 2150 50  0001 C CNN
	1    6000 2150
	1    0    0    -1  
$EndComp
$Comp
L power:+5V #PWR?
U 1 1 6163CC0E
P 6000 2000
F 0 "#PWR?" H 6000 1850 50  0001 C CNN
F 1 "+5V" H 6015 2173 50  0000 C CNN
F 2 "" H 6000 2000 50  0001 C CNN
F 3 "" H 6000 2000 50  0001 C CNN
	1    6000 2000
	1    0    0    -1  
$EndComp
Connection ~ 6000 2300
$Comp
L Device:R 100K
U 1 1 6163F9C5
P 6850 2900
F 0 "100K" V 6850 2900 50  0000 C CNN
F 1 " " V 6734 2900 50  0000 C CNN
F 2 "" V 6780 2900 50  0001 C CNN
F 3 "~" H 6850 2900 50  0001 C CNN
	1    6850 2900
	1    0    0    -1  
$EndComp
$Comp
L Device:R 100K
U 1 1 6163F9CB
P 6850 2450
F 0 "100K" V 6850 2450 50  0000 C CNN
F 1 " " V 6734 2450 50  0000 C CNN
F 2 "" V 6780 2450 50  0001 C CNN
F 3 "~" H 6850 2450 50  0001 C CNN
	1    6850 2450
	1    0    0    -1  
$EndComp
$Comp
L power:GND #PWR?
U 1 1 6163F9D1
P 6850 3150
F 0 "#PWR?" H 6850 2900 50  0001 C CNN
F 1 "GND" H 6855 2977 50  0000 C CNN
F 2 "" H 6850 3150 50  0001 C CNN
F 3 "" H 6850 3150 50  0001 C CNN
	1    6850 3150
	1    0    0    -1  
$EndComp
$Comp
L Switch:SW_Push SW?
U 1 1 6163F9D7
P 7100 2500
F 0 "SW?" V 7054 2648 50  0000 L CNN
F 1 "End" V 7145 2648 50  0000 L CNN
F 2 "" H 7100 2700 50  0001 C CNN
F 3 "~" H 7100 2700 50  0001 C CNN
	1    7100 2500
	0    1    1    0   
$EndComp
$Comp
L Switch:SW_Push SW?
U 1 1 6163F9DD
P 7100 2900
F 0 "SW?" V 7054 3048 50  0000 L CNN
F 1 "GoTo5" V 7145 3048 50  0000 L CNN
F 2 "" H 7100 3100 50  0001 C CNN
F 3 "~" H 7100 3100 50  0001 C CNN
	1    7100 2900
	0    1    1    0   
$EndComp
Wire Wire Line
	6850 2600 6850 2700
Wire Wire Line
	7100 2700 6850 2700
Connection ~ 7100 2700
Connection ~ 6850 2700
Wire Wire Line
	6850 2700 6850 2750
Wire Wire Line
	6850 3150 6850 3100
Wire Wire Line
	7100 3100 6850 3100
Connection ~ 6850 3100
Wire Wire Line
	6850 3100 6850 3050
Wire Wire Line
	5150 2700 3750 2700
Wire Wire Line
	4850 2600 4850 3400
Wire Wire Line
	4850 3400 5750 3400
Wire Wire Line
	5750 3400 5750 2700
Wire Wire Line
	5750 2700 6000 2700
Wire Wire Line
	3750 2600 4850 2600
Wire Wire Line
	6850 2700 6650 2700
$Comp
L Device:R 10K
U 1 1 6165B7B2
P 4350 2350
F 0 "10K" V 4350 2350 50  0000 C CNN
F 1 " " V 4234 2350 50  0000 C CNN
F 2 "" V 4280 2350 50  0001 C CNN
F 3 "~" H 4350 2350 50  0001 C CNN
	1    4350 2350
	1    0    0    1   
$EndComp
Wire Wire Line
	4350 2500 3750 2500
$Comp
L Device:R 10K
U 1 1 616586D4
P 4250 2250
F 0 "10K" V 4250 2250 50  0000 C CNN
F 1 " " V 4134 2250 50  0000 C CNN
F 2 "" V 4180 2250 50  0001 C CNN
F 3 "~" H 4250 2250 50  0001 C CNN
	1    4250 2250
	1    0    0    -1  
$EndComp
Wire Wire Line
	3950 2100 3950 3450
Wire Wire Line
	3950 2100 3750 2100
Wire Wire Line
	3750 2400 4250 2400
Wire Wire Line
	4350 2200 4350 2100
Wire Wire Line
	4350 2100 4250 2100
$Comp
L power:GND #PWR?
U 1 1 616E0116
P 3500 3800
F 0 "#PWR?" H 3500 3550 50  0001 C CNN
F 1 "GND" H 3505 3627 50  0000 C CNN
F 2 "" H 3500 3800 50  0001 C CNN
F 3 "" H 3500 3800 50  0001 C CNN
	1    3500 3800
	1    0    0    -1  
$EndComp
Wire Wire Line
	3500 3800 3500 3400
Wire Wire Line
	3500 3400 3100 3400
$Comp
L power:+5V #PWR?
U 1 1 616FC905
P 3650 3400
F 0 "#PWR?" H 3650 3250 50  0001 C CNN
F 1 "+5V" H 3665 3573 50  0000 C CNN
F 2 "" H 3650 3400 50  0001 C CNN
F 3 "" H 3650 3400 50  0001 C CNN
	1    3650 3400
	1    0    0    -1  
$EndComp
Wire Wire Line
	3100 3500 3650 3500
Wire Wire Line
	3650 3500 3650 3400
Wire Wire Line
	3100 3700 4250 3700
Wire Wire Line
	4250 3700 4250 2400
Connection ~ 4250 2400
Connection ~ 4350 2500
$Comp
L Connector:AudioJack4 J1
U 1 1 615CF226
P 2900 3500
F 0 "J1" H 2800 3750 50  0000 R CNN
F 1 "AudioJack4" H 2950 3800 50  0000 R CNN
F 2 "" H 2900 3500 50  0001 C CNN
F 3 "~" H 2900 3500 50  0001 C CNN
	1    2900 3500
	1    0    0    -1  
$EndComp
Wire Wire Line
	3100 3600 4350 3600
Wire Wire Line
	4350 2500 4350 3600
$Comp
L power:+3.3V #PWR?
U 1 1 61719BB4
P 2300 2200
F 0 "#PWR?" H 2300 2050 50  0001 C CNN
F 1 "+3.3V" H 2315 2373 50  0000 C CNN
F 2 "" H 2300 2200 50  0001 C CNN
F 3 "" H 2300 2200 50  0001 C CNN
	1    2300 2200
	1    0    0    -1  
$EndComp
Wire Wire Line
	6000 2700 6250 2700
$Comp
L Switch:SW_Push SW?
U 1 1 6175158D
P 4600 2200
F 0 "SW?" V 4646 2348 50  0000 L CNN
F 1 "OTO" V 4555 2348 50  0000 L CNN
F 2 "" H 4600 2400 50  0001 C CNN
F 3 "~" H 4600 2400 50  0001 C CNN
	1    4600 2200
	0    1    -1   0   
$EndComp
$Comp
L power:GND #PWR?
U 1 1 6175265E
P 4600 2400
F 0 "#PWR?" H 4600 2150 50  0001 C CNN
F 1 "GND" H 4605 2227 50  0000 C CNN
F 2 "" H 4600 2400 50  0001 C CNN
F 3 "" H 4600 2400 50  0001 C CNN
	1    4600 2400
	1    0    0    -1  
$EndComp
$Comp
L power:+5V #PWR?
U 1 1 616B700D
P 4350 1900
F 0 "#PWR?" H 4350 1750 50  0001 C CNN
F 1 "+5V" H 4365 2073 50  0000 C CNN
F 2 "" H 4350 1900 50  0001 C CNN
F 3 "" H 4350 1900 50  0001 C CNN
	1    4350 1900
	1    0    0    -1  
$EndComp
Wire Wire Line
	4600 2000 3750 2000
Wire Wire Line
	4350 2100 4350 1900
Connection ~ 4350 2100
$Comp
L power:+5V #PWR?
U 1 1 615CD908
P 2900 4200
F 0 "#PWR?" H 2900 4050 50  0001 C CNN
F 1 "+5V" H 2915 4373 50  0000 C CNN
F 2 "" H 2900 4200 50  0001 C CNN
F 3 "" H 2900 4200 50  0001 C CNN
	1    2900 4200
	1    0    0    -1  
$EndComp
Wire Wire Line
	2750 2200 2400 2200
Wire Wire Line
	2400 4600 2550 4600
Wire Wire Line
	2550 2300 2750 2300
Wire Wire Line
	3750 2300 3850 2300
Wire Wire Line
	3850 2300 3850 4050
Wire Wire Line
	2250 4700 2550 4700
Text Notes 6850 3150 0    50   ~ 0
Go 5 / End
Text Notes 4750 2100 0    50   ~ 0
OTO
$Comp
L power:+12V #PWR?
U 1 1 615D9BB3
P 1700 3000
F 0 "#PWR?" H 1700 2850 50  0001 C CNN
F 1 "+12V" H 1715 3173 50  0000 C CNN
F 2 "" H 1700 3000 50  0001 C CNN
F 3 "" H 1700 3000 50  0001 C CNN
	1    1700 3000
	1    0    0    -1  
$EndComp
$Comp
L Regulator_Linear:LM1084-5.0 U?
U 1 1 615D0F1A
P 2000 3000
F 0 "U?" H 2000 3242 50  0000 C CNN
F 1 "LM1084-5.0" H 2000 3151 50  0000 C CNN
F 2 "" H 2000 3250 50  0001 C CIN
F 3 "http://www.ti.com/lit/ds/symlink/lm1084.pdf" H 2000 3000 50  0001 C CNN
	1    2000 3000
	1    0    0    -1  
$EndComp
$Comp
L power:GND #PWR?
U 1 1 6160C151
P 5000 4150
F 0 "#PWR?" H 5000 3900 50  0001 C CNN
F 1 "GND" H 5005 3977 50  0000 C CNN
F 2 "" H 5000 4150 50  0001 C CNN
F 3 "" H 5000 4150 50  0001 C CNN
	1    5000 4150
	1    0    0    -1  
$EndComp
Text Notes 2200 1650 0    50   ~ 0
TDA8932 Mute
Text Notes 2150 1750 0    50   ~ 0
Horn Amp Mute
$Comp
L Connector:AudioJack3 J?
U 1 1 61636D24
P 2000 1000
F 0 "J?" V 1936 1188 50  0000 L CNN
F 1 "To Horn Amp" V 2027 1188 50  0000 L CNN
F 2 "" H 2000 1000 50  0001 C CNN
F 3 "~" H 2000 1000 50  0001 C CNN
	1    2000 1000
	0    1    1    0   
$EndComp
$Comp
L power:GND #PWR?
U 1 1 61637891
P 2100 1200
F 0 "#PWR?" H 2100 950 50  0001 C CNN
F 1 "GND" H 2105 1027 50  0000 C CNN
F 2 "" H 2100 1200 50  0001 C CNN
F 3 "" H 2100 1200 50  0001 C CNN
	1    2100 1200
	1    0    0    -1  
$EndComp
Wire Wire Line
	2750 1700 2000 1700
Wire Wire Line
	2000 1700 2000 1550
Wire Wire Line
	3550 5550 1650 5550
Wire Wire Line
	1650 1200 1900 1200
$Comp
L power:GND #PWR?
U 1 1 61658C7B
P 5550 1700
F 0 "#PWR?" H 5550 1450 50  0001 C CNN
F 1 "GND" H 5555 1527 50  0000 C CNN
F 2 "" H 5550 1700 50  0001 C CNN
F 3 "" H 5550 1700 50  0001 C CNN
	1    5550 1700
	1    0    0    -1  
$EndComp
$Comp
L power:+3.3V #PWR?
U 1 1 6165996A
P 5550 700
F 0 "#PWR?" H 5550 550 50  0001 C CNN
F 1 "+3.3V" H 5565 873 50  0000 C CNN
F 2 "" H 5550 700 50  0001 C CNN
F 3 "" H 5550 700 50  0001 C CNN
	1    5550 700 
	1    0    0    -1  
$EndComp
Wire Wire Line
	5950 1200 5950 1100
Wire Wire Line
	5550 750  5950 750 
$Comp
L MCU_Module:Arduino_Nano_v3.x A?
U 1 1 615C7518
P 3250 2000
F 0 "A?" H 3250 911 50  0000 C CNN
F 1 "Arduino_Nano_v3.x" V 3250 1800 50  0000 C CNN
F 2 "Module:Arduino_Nano" H 3250 2000 50  0001 C CIN
F 3 "http://www.mouser.com/pdfdocs/Gravitech_Arduino_Nano3_0.pdf" H 3250 2000 50  0001 C CNN
	1    3250 2000
	1    0    0    -1  
$EndComp
Wire Wire Line
	5250 900  2750 900 
Wire Wire Line
	2750 900  2750 1400
$Comp
L Device:R 10K
U 1 1 61673D9D
P 2600 1350
F 0 "10K" V 2600 1350 50  0000 C CNN
F 1 " " V 2484 1350 50  0000 C CNN
F 2 "" V 2530 1350 50  0001 C CNN
F 3 "~" H 2600 1350 50  0001 C CNN
	1    2600 1350
	-1   0    0    1   
$EndComp
$Comp
L Device:R 20K
U 1 1 61675FB0
P 2450 1350
F 0 "20K" V 2450 1350 50  0000 C CNN
F 1 " " V 2334 1350 50  0000 C CNN
F 2 "" V 2380 1350 50  0001 C CNN
F 3 "~" H 2450 1350 50  0001 C CNN
	1    2450 1350
	-1   0    0    1   
$EndComp
Wire Wire Line
	2750 1500 2600 1500
Wire Wire Line
	2600 1200 2450 1200
$Comp
L power:GND #PWR?
U 1 1 6167E98E
P 2450 1500
F 0 "#PWR?" H 2450 1250 50  0001 C CNN
F 1 "GND" H 2455 1327 50  0000 C CNN
F 2 "" H 2450 1500 50  0001 C CNN
F 3 "" H 2450 1500 50  0001 C CNN
	1    2450 1500
	1    0    0    -1  
$EndComp
Connection ~ 2450 1200
Connection ~ 5950 1100
Wire Wire Line
	5950 750  5950 1100
$Comp
L New_Library:ESP-01S U?
U 1 1 616561B6
P 5550 1200
F 0 "U?" H 5600 1881 50  0000 C CNN
F 1 "ESP-01S" H 5600 1790 50  0000 C CNN
F 2 "" V 5600 1300 50  0001 C CNN
F 3 "" V 5600 1300 50  0001 C CNN
	1    5550 1200
	1    0    0    -1  
$EndComp
Wire Wire Line
	5250 800  2450 800 
Wire Wire Line
	5250 800  5250 950 
Wire Wire Line
	2450 800  2450 1200
Wire Wire Line
	1500 5600 1500 1600
Wire Wire Line
	1500 1600 2750 1600
Text Notes 4850 5550 1    50   ~ 0
~Mute~ not ~SD~
$Comp
L power:GND #PWR?
U 1 1 61626F04
P 5300 5050
F 0 "#PWR?" H 5300 4800 50  0001 C CNN
F 1 "GND" H 5305 4877 50  0000 C CNN
F 2 "" H 5300 5050 50  0001 C CNN
F 3 "" H 5300 5050 50  0001 C CNN
	1    5300 5050
	1    0    0    -1  
$EndComp
Wire Wire Line
	3250 4350 3550 4350
$Comp
L power:GND #PWR?
U 1 1 615CE607
P 2900 5250
F 0 "#PWR?" H 2900 5000 50  0001 C CNN
F 1 "GND" H 2905 5077 50  0000 C CNN
F 2 "" H 2900 5250 50  0001 C CNN
F 3 "" H 2900 5250 50  0001 C CNN
	1    2900 5250
	1    0    0    -1  
$EndComp
$Comp
L power:GND #PWR?
U 1 1 615F664B
P 4750 4650
F 0 "#PWR?" H 4750 4400 50  0001 C CNN
F 1 "GND" H 4755 4477 50  0000 C CNN
F 2 "" H 4750 4650 50  0001 C CNN
F 3 "" H 4750 4650 50  0001 C CNN
	1    4750 4650
	1    0    0    -1  
$EndComp
$Comp
L Amplifier_Audio:PAM8302AAD U?
U 1 1 61605F5A
P 5300 4650
F 0 "U?" H 5300 5231 50  0000 C CNN
F 1 "TPA9118 Breakout" H 5350 4300 50  0000 C CNN
F 2 "" H 5300 4650 50  0001 C CNN
F 3 "https://www.diodes.com/assets/Datasheets/PAM8302A.pdf" H 5300 4650 50  0001 C CNN
	1    5300 4650
	1    0    0    -1  
$EndComp
Wire Wire Line
	3250 4450 4900 4450
Wire Wire Line
	4900 4650 4750 4650
Wire Wire Line
	4900 4850 4750 4850
Wire Wire Line
	4750 4850 4750 5600
Wire Wire Line
	2550 4500 2550 4450
Wire Wire Line
	1500 5600 4750 5600
Wire Wire Line
	3550 4350 3550 5550
$Comp
L New_Library:JQ8400-FL U?
U 1 1 615C86DD
P 2900 5000
F 0 "U?" H 2900 5965 50  0000 C CNN
F 1 "JQ8400-FL" H 2900 4800 39  0000 C CNN
F 2 "" H 2900 5000 50  0001 C CNN
F 3 "" H 2900 5000 50  0001 C CNN
	1    2900 5000
	1    0    0    -1  
$EndComp
Wire Wire Line
	1650 5550 1650 1200
Wire Wire Line
	3850 4050 2250 4050
Wire Wire Line
	2550 4150 2550 2300
$Comp
L Device:R 1K
U 1 1 615ED13A
P 2550 4300
F 0 "1K" V 2550 4300 50  0000 C CNN
F 1 " " V 2434 4300 50  0000 C CNN
F 2 "" V 2480 4300 50  0001 C CNN
F 3 "~" H 2550 4300 50  0001 C CNN
	1    2550 4300
	1    0    0    -1  
$EndComp
Wire Wire Line
	2250 4050 2250 4700
Wire Wire Line
	2400 2200 2400 4600
$Comp
L Device:R 1K?
U 1 1 617B8CDB
P 2000 1400
F 0 "1K?" V 2000 1400 50  0000 C CNN
F 1 " " V 1884 1400 50  0000 C CNN
F 2 "" V 1930 1400 50  0001 C CNN
F 3 "~" H 2000 1400 50  0001 C CNN
	1    2000 1400
	1    0    0    -1  
$EndComp
Wire Wire Line
	2000 1250 2000 1200
Wire Wire Line
	6800 4850 6800 4550
$Comp
L Device:Transformer_1P_1S T?
U 1 1 61749ADE
P 6400 4650
F 0 "T?" H 6400 5031 50  0000 C CNN
F 1 "8R:1K Audio" H 6400 4400 50  0000 C CNN
F 2 "" H 6400 4650 50  0001 C CNN
F 3 "~" H 6400 4650 50  0001 C CNN
	1    6400 4650
	1    0    0    -1  
$EndComp
$Comp
L Connector:AudioJack2 J?
U 1 1 6163ECC6
P 7000 4450
F 0 "J?" H 6820 4433 50  0000 R CNN
F 1 "Piezos" H 6820 4524 50  0000 R CNN
F 2 "" H 7000 4450 50  0001 C CNN
F 3 "~" H 7000 4450 50  0001 C CNN
	1    7000 4450
	-1   0    0    1   
$EndComp
Wire Wire Line
	6000 4450 5700 4450
Wire Wire Line
	6000 4850 5700 4850
Wire Wire Line
	5700 4850 5700 4650
Wire Wire Line
	5300 3850 5300 4250
$Comp
L power:+12V #PWR?
U 1 1 61605972
P 4700 3850
F 0 "#PWR?" H 4700 3700 50  0001 C CNN
F 1 "+12V" H 4550 3950 50  0000 C CNN
F 2 "" H 4700 3850 50  0001 C CNN
F 3 "" H 4700 3850 50  0001 C CNN
	1    4700 3850
	1    0    0    -1  
$EndComp
$Comp
L Regulator_Linear:LM1084-5.0 U?
U 1 1 6160041D
P 5000 3850
F 0 "U?" H 5000 4092 50  0000 C CNN
F 1 "StepUp to 25V" H 5050 4000 50  0000 C CNN
F 2 "" H 5000 4100 50  0001 C CIN
F 3 "http://www.ti.com/lit/ds/symlink/lm1084.pdf" H 5000 3850 50  0001 C CNN
	1    5000 3850
	1    0    0    -1  
$EndComp
Wire Wire Line
	6000 2300 5400 2300
Connection ~ 5400 2300
Wire Wire Line
	6000 2300 6250 2300
Connection ~ 6250 2300
Wire Wire Line
	6250 2300 6850 2300
Connection ~ 6850 2300
Wire Wire Line
	6850 2300 7100 2300
Wire Wire Line
	6650 2700 6650 3450
Wire Wire Line
	3950 3450 6650 3450
$EndSCHEMATC
