EESchema Schematic File Version 4
EELAYER 30 0
EELAYER END
$Descr A4 11693 8268
encoding utf-8
Sheet 1 1
Title ""
Date ""
Rev ""
Comp ""
Comment1 ""
Comment2 ""
Comment3 ""
Comment4 ""
$EndDescr
$Comp
L Device:Speaker LS?
U 1 1 617E6BD5
P 4200 2050
F 0 "LS?" V 4209 1770 50  0000 R CNN
F 1 "Speaker" V 4118 1770 50  0000 R CNN
F 2 "" H 4200 1850 50  0001 C CNN
F 3 "~" H 4190 2000 50  0001 C CNN
	1    4200 2050
	0    -1   -1   0   
$EndComp
$Comp
L Device:Speaker LS?
U 1 1 617E7879
P 3750 2050
F 0 "LS?" V 3759 1770 50  0000 R CNN
F 1 "Speaker" V 3668 1770 50  0000 R CNN
F 2 "" H 3750 1850 50  0001 C CNN
F 3 "~" H 3740 2000 50  0001 C CNN
	1    3750 2050
	0    -1   -1   0   
$EndComp
$Comp
L Device:Speaker LS?
U 1 1 617E98E1
P 4800 3100
F 0 "LS?" V 4809 2820 50  0000 R CNN
F 1 "Speaker" V 4718 2820 50  0000 R CNN
F 2 "" H 4800 2900 50  0001 C CNN
F 3 "~" H 4790 3050 50  0001 C CNN
	1    4800 3100
	1    0    0    -1  
$EndComp
$Comp
L Device:Speaker LS?
U 1 1 617E98E7
P 4800 2650
F 0 "LS?" V 4809 2370 50  0000 R CNN
F 1 "Speaker" V 4718 2370 50  0000 R CNN
F 2 "" H 4800 2450 50  0001 C CNN
F 3 "~" H 4790 2600 50  0001 C CNN
	1    4800 2650
	1    0    0    -1  
$EndComp
$Comp
L Device:Speaker LS?
U 1 1 617EADAD
P 3850 3550
F 0 "LS?" V 3859 3270 50  0000 R CNN
F 1 "Speaker" V 3768 3270 50  0000 R CNN
F 2 "" H 3850 3350 50  0001 C CNN
F 3 "~" H 3840 3500 50  0001 C CNN
	1    3850 3550
	0    1    1    0   
$EndComp
$Comp
L Device:Speaker LS?
U 1 1 617EADB3
P 4300 3550
F 0 "LS?" V 4309 3270 50  0000 R CNN
F 1 "Speaker" V 4218 3270 50  0000 R CNN
F 2 "" H 4300 3350 50  0001 C CNN
F 3 "~" H 4290 3500 50  0001 C CNN
	1    4300 3550
	0    1    1    0   
$EndComp
$Comp
L Device:Speaker LS?
U 1 1 617ECB57
P 3250 2650
F 0 "LS?" V 3259 2370 50  0000 R CNN
F 1 "Speaker" V 3168 2370 50  0000 R CNN
F 2 "" H 3250 2450 50  0001 C CNN
F 3 "~" H 3240 2600 50  0001 C CNN
	1    3250 2650
	-1   0    0    1   
$EndComp
$Comp
L Device:Speaker LS?
U 1 1 617ECB5D
P 3250 3100
F 0 "LS?" V 3259 2820 50  0000 R CNN
F 1 "Speaker" V 3168 2820 50  0000 R CNN
F 2 "" H 3250 2900 50  0001 C CNN
F 3 "~" H 3240 3050 50  0001 C CNN
	1    3250 3100
	-1   0    0    1   
$EndComp
Wire Wire Line
	3850 2250 4200 2250
Wire Wire Line
	3450 2650 3450 3000
Wire Wire Line
	3850 3350 4200 3350
Wire Wire Line
	4600 3100 4600 2750
$Comp
L Connector:AudioJack2 J?
U 1 1 617EDAC3
P 3950 2750
F 0 "J?" H 3982 3075 50  0000 C CNN
F 1 "AudioJack2" H 3982 2984 50  0000 C CNN
F 2 "" H 3950 2750 50  0001 C CNN
F 3 "~" H 3950 2750 50  0001 C CNN
	1    3950 2750
	1    0    0    -1  
$EndComp
Wire Wire Line
	4600 2650 4550 2650
Wire Wire Line
	3750 3350 3750 3300
Wire Wire Line
	3750 2250 3750 2300
Wire Wire Line
	3750 2300 4300 2300
Wire Wire Line
	4300 2300 4300 2250
Wire Wire Line
	4550 2650 4550 3200
Wire Wire Line
	4550 3200 4600 3200
Wire Wire Line
	3750 3300 4300 3300
Wire Wire Line
	4300 3300 4300 3350
Wire Wire Line
	3500 2550 3500 3100
Wire Wire Line
	3500 2550 3450 2550
Wire Wire Line
	3450 3100 3500 3100
Wire Wire Line
	4300 3300 4550 3300
Wire Wire Line
	4550 3300 4550 3200
Connection ~ 4300 3300
Connection ~ 4550 3200
Wire Wire Line
	4200 3350 4200 3100
Wire Wire Line
	4200 3100 4600 3100
Connection ~ 4200 3350
Connection ~ 4600 3100
Wire Wire Line
	4550 2650 4200 2650
Connection ~ 4550 2650
Wire Wire Line
	4200 3100 4200 2750
Wire Wire Line
	4200 2750 4150 2750
Connection ~ 4200 3100
Wire Wire Line
	3500 3100 4200 3100
Connection ~ 3500 3100
Wire Wire Line
	3450 2650 3750 2650
Wire Wire Line
	3750 2650 3750 2300
Connection ~ 3450 2650
Connection ~ 3750 2300
Wire Wire Line
	4200 2250 4200 2650
Connection ~ 4200 2250
Connection ~ 4200 2650
Wire Wire Line
	4200 2650 4150 2650
$EndSCHEMATC
