{
    "data":[
        {
            "id":1,
            "questions": [
                {
                    "id":1,
                    "title":"Quiz1 Question1",
                    "options":[
                        {
                            "id":1,
                            "option":"Question1 option1",
                            "status":"unset"
                        },
                        {
                            "id":2,
                            "option":"Question1 option2",
                            "status":"unset"
                        },
                        {
                            "id":3,
                            "option":"Question1 option3",
                            "status":"unset"
                        }
                    ],
                    "correctOptionId":1
                },
                {
                    "id":2,
                    "title":"Quiz1 Question2",
                    "options":[
                        {
                            "id":1,
                            "option":"Question2 option1",
                            "status":"unset"
                        },
                        {
                            "id":2,
                            "option":"Question2 option2",
                            "status":"unset"
                        },
                        {
                            "id":3,
                            "option":"Question2 option3",
                            "status":"unset"
                        }
                    ],
                    "correctOptionId":2
                },
                {
                    "id":3,
                    "title":"Quiz1 Question3",
                    "options":[
                        {
                            "id":1,
                            "option":"Question3 option1",
                            "status":"unset"
                        },
                        {
                            "id":2,
                            "option":"Question3 option2",
                            "status":"unset"
                        },
                        {
                            "id":3,
                            "option":"Question3 option3",
                            "status":"unset"
                        }
                    ],
                    "correctOptionId":3
                },
                {
                    "id":4,
                    "title":"Quiz1 Question4",
                    "options":[
                        {
                            "id":1,
                            "option":"Question4 option1",
                            "status":"unset"
                        },
                        {
                            "id":2,
                            "option":"Question4 option2",
                            "status":"unset"
                        },
                        {
                            "id":3,
                            "option":"Question4 option3",
                            "status":"unset"
                        }
                    ],
                    "correctOptionId":1
                },
                {
                    "id":5,
                    "title":"Quiz1 Question5",
                    "options":[
                        {
                            "id":1,
                            "option":"Question5 option1",
                            "status":"unset"
                        },
                        {
                            "id":2,
                            "option":"Question5 option2",
                            "status":"unset"
                        },
                        {
                            "id":3,
                            "option":"Question5 option3",
                            "status":"unset"
                        }
                    ],
                    "correctOptionId":2
                },
                {
                    "id":6,
                    "title":"Quiz1 Question6",
                    "options":[
                        {
                            "id":1,
                            "option":"Question6 option1",
                            "status":"unset"
                        },
                        {
                            "id":2,
                            "option":"Question6 option2",
                            "status":"unset"
                        },
                        {
                            "id":3,
                            "option":"Question6 option3",
                            "status":"unset"
                        }
                    ],
                    "correctOptionId":3
                }
            ]
        },
        {
            "id":2,
            "questions": [
                {
                    "id":4,
                    "title":"Quiz2 Question1",
                    "options":[
                        {
                            "id":1,
                            "option":"Question1 option1",
                            "status":"unset"
                        },
                        {
                            "id":2,
                            "option":"Question1 option2",
                            "status":"unset"
                        },
                        {
                            "id":3,
                            "option":"Question1 option3",
                            "status":"unset"
                        }
                    ],
                    "correctOptionId":1
                },
                {
                    "id":5,
                    "title":"Quiz2 Question2",
                    "options":[
                        {
                            "id":1,
                            "option":"Question2 option1",
                            "status":"unset"
                        },
                        {
                            "id":2,
                            "option":"Question2 option2",
                            "status":"unset"
                        },
                        {
                            "id":3,
                            "option":"Question2 option3",
                            "status":"unset"
                        }
                    ],
                    "correctOptionId":2
                },
                {
                    "id":6,
                    "title":"Quiz2 Question3",
                    "options":[
                        {
                            "id":1,
                            "option":"Question3 option1",
                            "status":"unset"
                        },
                        {
                            "id":2,
                            "option":"Question3 option2",
                            "status":"unset"
                        },
                        {
                            "id":3,
                            "option":"Question3 option3",
                            "status":"unset"
                        }
                    ],
                    "correctOptionId":3
                }
            ]
        }
    ]
}