<?xml version="1.0" encoding="UTF-8" standalone="no"?>
<!-- Created with Inkscape (http://www.inkscape.org/) -->

<svg
   xmlns:dc="http://purl.org/dc/elements/1.1/"
   xmlns:cc="http://creativecommons.org/ns#"
   xmlns:rdf="http://www.w3.org/1999/02/22-rdf-syntax-ns#"
   xmlns:svg="http://www.w3.org/2000/svg"
   xmlns="http://www.w3.org/2000/svg"
   xmlns:sodipodi="http://sodipodi.sourceforge.net/DTD/sodipodi-0.dtd"
   xmlns:inkscape="http://www.inkscape.org/namespaces/inkscape"
   width="1600"
   height="2560"
   viewBox="0 0 423.33332 677.33336"
   version="1.1"
   id="svg8"
   inkscape:version="0.92.4 5da689c313, 2019-01-14"
   sodipodi:docname="cover.svg"
   inkscape:export-filename="/home/nika-zhenya/Repositorios/perro-tuerto/lo-que-hacemos/archivos-madre/img/cover.png"
   inkscape:export-xdpi="96"
   inkscape:export-ydpi="96">
  <defs
     id="defs2" />
  <sodipodi:namedview
     id="base"
     pagecolor="#0d030b"
     bordercolor="#666666"
     borderopacity="1.0"
     inkscape:pageopacity="1"
     inkscape:pageshadow="2"
     inkscape:zoom="0.24748737"
     inkscape:cx="626.69441"
     inkscape:cy="945.78644"
     inkscape:document-units="mm"
     inkscape:current-layer="layer1"
     showgrid="false"
     units="px"
     inkscape:window-width="1920"
     inkscape:window-height="1016"
     inkscape:window-x="0"
     inkscape:window-y="27"
     inkscape:window-maximized="1"
     inkscape:pagecheckerboard="false"
     showguides="true"
     inkscape:guide-bbox="true">
    <sodipodi:guide
       position="0,105.83333"
       orientation="-0.70710678,0.70710678"
       id="guide834"
       inkscape:locked="false"
       inkscape:label=""
       inkscape:color="rgb(0,0,255)" />
    <sodipodi:guide
       position="0,26.458333"
       orientation="-0.70710678,0.70710678"
       id="guide836"
       inkscape:locked="false"
       inkscape:label=""
       inkscape:color="rgb(0,0,255)" />
    <sodipodi:guide
       position="0,0"
       orientation="1,0"
       id="guide838"
       inkscape:locked="false"
       inkscape:label=""
       inkscape:color="rgb(0,0,255)" />
    <sodipodi:guide
       position="0,677.33334"
       orientation="0,1"
       id="guide840"
       inkscape:locked="false"
       inkscape:label=""
       inkscape:color="rgb(0,0,255)" />
    <sodipodi:guide
       position="423.33334,0"
       orientation="1,0"
       id="guide842"
       inkscape:locked="false"
       inkscape:label=""
       inkscape:color="rgb(0,0,255)" />
    <sodipodi:guide
       position="0,0"
       orientation="0,1"
       id="guide844"
       inkscape:locked="false"
       inkscape:label=""
       inkscape:color="rgb(0,0,255)" />
    <sodipodi:guide
       position="0,0"
       orientation="-0.70710678,0.70710678"
       id="guide846"
       inkscape:locked="false"
       inkscape:label=""
       inkscape:color="rgb(0,0,255)" />
  </sodipodi:namedview>
  <metadata
     id="metadata5">
    <rdf:RDF>
      <cc:Work
         rdf:about="">
        <dc:format>image/svg+xml</dc:format>
        <dc:type
           rdf:resource="http://purl.org/dc/dcmitype/StillImage" />
        <dc:title></dc:title>
      </cc:Work>
    </rdf:RDF>
  </metadata>
  <g
     inkscape:label="Capa 1"
     inkscape:groupmode="layer"
     id="layer1"
     transform="translate(0,380.33337)">
    <text
       xml:space="preserve"
       style="font-style:normal;font-variant:normal;font-weight:normal;font-stretch:normal;font-size:3.34618163px;line-height:1.25;font-family:Cocogoose;-inkscape-font-specification:Cocogoose;letter-spacing:0px;word-spacing:0px;fill:#000000;fill-opacity:1;stroke:none;stroke-width:0.20913635"
       x="23.928606"
       y="-320.7879"
       id="text856"><tspan
         sodipodi:role="line"
         id="tspan854"
         x="23.928606"
         y="-320.7879"
         style="font-size:40.15418243px;text-align:start;text-anchor:start;fill:#88a807;fill-opacity:1;stroke-width:0.20913635">Lo que hacemos</tspan></text>
    <text
       xml:space="preserve"
       style="font-style:normal;font-variant:normal;font-weight:normal;font-stretch:normal;font-size:7.73910904px;line-height:1.25;font-family:Cocogoose;-inkscape-font-specification:Cocogoose;letter-spacing:0px;word-spacing:0px;fill:#000000;fill-opacity:1;stroke:none;stroke-width:0.48369431"
       x="25.680538"
       y="-279.18341"
       id="text860"><tspan
         sodipodi:role="line"
         id="tspan858"
         x="25.680538"
         y="-279.18341"
         style="font-size:23.21732903px;text-align:start;text-anchor:start;fill:#88a807;fill-opacity:1;stroke-width:0.48369431">software libre y</tspan><tspan
         sodipodi:role="line"
         x="25.680538"
         y="-250.16174"
         style="font-size:23.21732903px;text-align:start;text-anchor:start;fill:#88a807;fill-opacity:1;stroke-width:0.48369431"
         id="tspan862">acceso abierto</tspan></text>
    <path
       style="fill:#a61603;stroke:#000000;stroke-width:0.26458332px;stroke-linecap:butt;stroke-linejoin:miter;stroke-opacity:1;fill-opacity:1"
       d="M 0,296.99995 H 423.33333 V -126.33338 Z"
       id="path864"
       inkscape:connector-curvature="0" />
    <path
       style="fill:#f08204;stroke:#000000;stroke-width:0.26458332px;stroke-linecap:butt;stroke-linejoin:miter;stroke-opacity:1;fill-opacity:1"
       d="M 423.33333,-126.33338 0,296.99995 v -26.45833 l 423.33333,-423.33333 z"
       id="path866"
       inkscape:connector-curvature="0" />
    <path
       style="fill:#47193b;stroke:#000000;stroke-width:0.26458332px;stroke-linecap:butt;stroke-linejoin:miter;stroke-opacity:1;fill-opacity:1"
       d="M 423.33333,-152.79171 0,270.54162 v -79.375 l 423.33333,-423.33333 z"
       id="path868"
       inkscape:connector-curvature="0" />
  </g>
</svg>
