\relax 
\providecommand\hyper@newdestlabel[2]{}
\providecommand*{\memsetcounter}[2]{}
\catcode `"\active 
\catcode `<\active 
\catcode `>\active 
\@nameuse{es@quoting}
\providecommand\HyperFirstAtBeginDocument{\AtBeginDocument}
\HyperFirstAtBeginDocument{\ifx\hyper@anchor\@undefined
\global\let\oldcontentsline\contentsline
\gdef\contentsline#1#2#3#4{\oldcontentsline{#1}{#2}{#3}}
\global\let\oldnewlabel\newlabel
\gdef\newlabel#1#2{\newlabelxx{#1}#2}
\gdef\newlabelxx#1#2#3#4#5#6{\oldnewlabel{#1}{{#2}{#3}}}
\AtEndDocument{\ifx\hyper@anchor\@undefined
\let\contentsline\oldcontentsline
\let\newlabel\oldnewlabel
\fi}
\fi}
\global\let\hyper@last\relax 
\gdef\HyperFirstAtBeginDocument#1{#1}
\providecommand\HyField@AuxAddToFields[1]{}
\providecommand\HyField@AuxAddToCoFields[2]{}
\babel@aux{spanish}{}
\@writefile{toc}{\contentsline {chapter}{Descripción}{1}{chapter*.1}\protected@file@percent }
\@writefile{toc}{\contentsline {section}{Antecedentes}{2}{section*.2}\protected@file@percent }
\@writefile{toc}{\contentsline {section}{Proyección}{3}{section*.2}\protected@file@percent }
\@writefile{toc}{\contentsline {chapter}{Información general}{4}{chapter*.3}\protected@file@percent }
\@writefile{toc}{\contentsline {section}{Objetivos}{4}{section*.4}\protected@file@percent }
\@writefile{toc}{\contentsline {section}{Propuesta de cronograma}{5}{Item.8}\protected@file@percent }
\@writefile{toc}{\contentsline {section}{Requisitos previos}{6}{Item.18}\protected@file@percent }
\@writefile{toc}{\contentsline {section}{Necesidades espaciales}{6}{Item.18}\protected@file@percent }
\@writefile{toc}{\contentsline {chapter}{\emph  {Syllabus}}{7}{chapter*.5}\protected@file@percent }
\@writefile{toc}{\contentsline {section}{Sesión 1: Más allá de Adobe}{7}{section*.6}\protected@file@percent }
\@writefile{toc}{\contentsline {section}{Sesión 2: Bienvenido a la edición «desde cero»}{8}{Item.23}\protected@file@percent }
\@writefile{toc}{\contentsline {section}{Sesión 3: ¡Esto es Pecas! \textgreater {} Herramientas editoriales libres}{8}{Item.25}\protected@file@percent }
\@writefile{toc}{\contentsline {section}{Sesión 4: De la planicie y los tornados al bosque y las ramas}{9}{Item.29}\protected@file@percent }
\@writefile{toc}{\contentsline {section}{Sesión 5: Bienvenidos al mundo de Markdown}{10}{Item.36}\protected@file@percent }
\@writefile{toc}{\contentsline {section}{Sesión 6: Nuestro primer proyecto con Markdown}{11}{Item.42}\protected@file@percent }
\@writefile{toc}{\contentsline {section}{Sesión 7: ¿Otra vez Pecas?}{11}{Item.46}\protected@file@percent }
\@writefile{toc}{\contentsline {section}{Sesión 8: Mi primer \textsc  {epub}}{12}{Item.51}\protected@file@percent }
\@writefile{toc}{\contentsline {section}{Sesión 9: Viaje a la exósfera}{13}{Item.55}\protected@file@percent }
\@writefile{toc}{\contentsline {section}{Sesión 10: Regreso a la tierra}{13}{Item.63}\protected@file@percent }
\@writefile{toc}{\contentsline {chapter}{Costos}{15}{chapter*.7}\protected@file@percent }
\memsetcounter{lastsheet}{18}
\memsetcounter{lastpage}{15}
