{
  "words": [
    {"l1": " a", "l2": "à"}, 
    {"l1": " a casa", "l2": "maison"}, 
    {"l1": " a causa de", "l2": "en raison de"}, 
    {"l1": " a continuación", "l2": "ensuite"}, 
    {"l1": " a diferencia de", "l2": "contrairement à"}, 
    {"l1": " a los", "l2": "aux"}, 
    {"l1": " a medida que", "l2": "à mesure que"}, 
    {"l1": " a menudo", "l2": "souvent"}, 
    {"l1": " a pesar de", "l2": "en dépit de"}, 
    {"l1": " a pesar de", "l2": "malgré"}, 
    {"l1": " a través", "l2": "a travers"}, 
    {"l1": " a través de", "l2": "à travers"}, 
    {"l1": " a través de", "l2": "par"}, 
    {"l1": " a veces", "l2": "parfois"}, 
    {"l1": " abajo", "l2": "vers le bas"}, 
    {"l1": " abandonar", "l2": "abandonner"}, 
    {"l1": " abandonar", "l2": "lâcher"}, 
    {"l1": " abandonar", "l2": "quitter"}, 
    {"l1": " abogado", "l2": "avocat"}, 
    {"l1": " abrazar", "l2": "embrasser"}, 
    {"l1": " abril", "l2": "avril"}, 
    {"l1": " abrir", "l2": "ouvrir"}, 
    {"l1": " absolutamente", "l2": "absolument"}, 
    {"l1": " abuela", "l2": "grand-mère"}, 
    {"l1": " abuelo", "l2": "grand-père"}, 
    {"l1": " aburrimiento", "l2": "ennui"}, 
    {"l1": " accidente", "l2": "accident"}, 
    {"l1": " acción", "l2": "action"}, 
    {"l1": " aceptar", "l2": "accepter"}, 
    {"l1": " acerca de", "l2": "sur"}, 
    {"l1": " acercar", "l2": "approcher"}, 
    {"l1": " acompañar", "l2": "accompagner"}, 
    {"l1": " acostar", "l2": "coucher"}, 
    {"l1": " actor", "l2": "acteur"}, 
    {"l1": " actual", "l2": "courant"}, 
    {"l1": " actuar", "l2": "agir"}, 
    {"l1": " acuerdo", "l2": "accord"}, 
    {"l1": " además de", "l2": "en plus de"}, 
    {"l1": " adentro", "l2": "dedans"}, 
    {"l1": " adivinar", "l2": "deviner"}, 
    {"l1": " adolescente", "l2": "garçon"}, 
    {"l1": " adorar", "l2": "adorer"}, 
    {"l1": " advertir", "l2": "prévenir"}, 
    {"l1": " afligir", "l2": "désoler"}, 
    {"l1": " agente", "l2": "agent"}, 
    {"l1": " agosto", "l2": "août"}, 
    {"l1": " agradecer", "l2": "remercier"}, 
    {"l1": " agua", "l2": "eau"}, 
    {"l1": " agujero", "l2": "trou"}, 
    {"l1": " ah", "l2": "ah"}, 
    {"l1": " ahí", "l2": "y"}, 
    {"l1": " ahí", "l2": "là"}, 
    {"l1": " ahora", "l2": "maintenant"}, 
    {"l1": " ahora mismo", "l2": "en ce moment"}, 
    {"l1": " ahora mismo", "l2": "por le moment"}, 
    {"l1": " aire", "l2": "air"}, 
    {"l1": " ajustar", "l2": "régler"}, 
    {"l1": " al", "l2": "au"}, 
    {"l1": " al final", "l2": "enfin"}, 
    {"l1": " al lado de", "l2": "à côté de"}, 
    {"l1": " alegría", "l2": "joie"}, 
    {"l1": " alguien", "l2": "on"}, 
    {"l1": " alguien", "l2": "quelqu’un"}, 
    {"l1": " algún", "l2": "aucun"}, 
    {"l1": " algún", "l2": "certain"}, 
    {"l1": " alguno", "l2": "aucun"}, 
    {"l1": " algunos", "l2": "quelque"}, 
    {"l1": " algunos", "l2": "quelques"}, 
    {"l1": " allá", "l2": "là-bas"}, 
    {"l1": " allá arriba", "l2": "là-haut"}, 
    {"l1": " allí", "l2": "là"}, 
    {"l1": " allí", "l2": "là-bas"}, 
    {"l1": " allí dentro", "l2": "là-dedans"}, 
    {"l1": " alma", "l2": "âme"}, 
    {"l1": " alrededor", "l2": "autour"}, 
    {"l1": " alrededor", "l2": "tour"}, 
    {"l1": " alrededor de", "l2": "vers"}, 
    {"l1": " alrededor de", "l2": "autour de"}, 
    {"l1": " alto", "l2": "grand"}, 
    {"l1": " alto", "l2": "haut"}, 
    {"l1": " alzar", "l2": "lever"}, 
    {"l1": " amable", "l2": "gentil"}, 
    {"l1": " amante", "l2": "amoureux"}, 
    {"l1": " amigo", "l2": "ami"}, 
    {"l1": " amigo", "l2": "pote"}, 
    {"l1": " amor", "l2": "amour"}, 
    {"l1": " ángel", "l2": "ange"}, 
    {"l1": " animal", "l2": "animal"}, 
    {"l1": " animal", "l2": "bête"}, 
    {"l1": " anoche", "l2": "dernière nuit"}, 
    {"l1": " anterior", "l2": "dernier"}, 
    {"l1": " antes", "l2": "avant"}, 
    {"l1": " antes de", "l2": "avant"}, 
    {"l1": " antes que", "l2": "avant"}, 
    {"l1": " anticuado", "l2": "ancien"}, 
    {"l1": " antiguo", "l2": "ancien"}, 
    {"l1": " año", "l2": "an"}, 
    {"l1": " año", "l2": "année"}, 
    {"l1": " apartamento", "l2": "appartement"}, 
    {"l1": " apellido", "l2": "nom"}, 
    {"l1": " apenas", "l2": "juste"}, 
    {"l1": " apreciar", "l2": "apprécier"}, 
    {"l1": " aprender", "l2": "apprendre"}, 
    {"l1": " apresurar", "l2": "dépêcher"}, 
    {"l1": " aprovechar", "l2": "profiter"}, 
    {"l1": " apuesta", "l2": "parier"}, 
    {"l1": " aquel", "l2": "celui"}, 
    {"l1": " aquél", "l2": "celui-là"}, 
    {"l1": " aquella", "l2": "celle"}, 
    {"l1": " aquellos", "l2": "ceux"}, 
    {"l1": " aquí", "l2": "ici"}, 
    {"l1": " aquí", "l2": "là"}, 
    {"l1": " aquí", "l2": "voici"}, 
    {"l1": " aquí", "l2": "voilà"}, 
    {"l1": " árbol", "l2": "arbre"}, 
    {"l1": " arma", "l2": "arme"}, 
    {"l1": " arrebatar", "l2": "ravir"}, 
    {"l1": " arreglar", "l2": "arranger"}, 
    {"l1": " arriba", "l2": "dessus"}, 
    {"l1": " arriba", "l2": "jusqu’à"}, 
    {"l1": " arriesgar", "l2": "risquer"}, 
    {"l1": " arte", "l2": "art"}, 
    {"l1": " asalto", "l2": "vol"}, 
    {"l1": " asegurar", "l2": "assurer"}, 
    {"l1": " asesinato", "l2": "meurtre"}, 
    {"l1": " asesino", "l2": "tueur"}, 
    {"l1": " así", "l2": "ainsi"}, 
    {"l1": " así", "l2": "pareil"}, 
    {"l1": " así como", "l2": "aussi bien que"}, 
    {"l1": " así que", "l2": "ainsi que"}, 
    {"l1": " así que", "l2": "au fur et à mesure"}, 
    {"l1": " así que", "l2": "que"}, 
    {"l1": " asumir", "l2": "supposer"}, 
    {"l1": " asunto", "l2": "affaire"}, 
    {"l1": " asunto", "l2": "sujet"}, 
    {"l1": " atacar", "l2": "attaquer"}, 
    {"l1": " atención", "l2": "attention"}, 
    {"l1": " atraco", "l2": "vol"}, 
    {"l1": " atrapar", "l2": "attraper"}, 
    {"l1": " atreverse", "l2": "oser"}, 
    {"l1": " aún", "l2": "encore"}, 
    {"l1": " aunque", "l2": "quoique"}, 
    {"l1": " avance", "l2": "avance"}, 
    {"l1": " avanzar", "l2": "avancer"}, 
    {"l1": " avión", "l2": "avion"}, 
    {"l1": " ayer", "l2": "hier"}, 
    {"l1": " ayer", "l2": "la vielle"}, 
    {"l1": " ayuda", "l2": "aide"}, 
    {"l1": " ayuda", "l2": "secours"}, 
    {"l1": " ayudar", "l2": "aider"}, 
    {"l1": " azul", "l2": "bleu"}, 
    {"l1": " bailar", "l2": "danser"}, 
    {"l1": " bajar", "l2": "descendre"}, 
    {"l1": " bajo", "l2": "bas"}, 
    {"l1": " bajo", "l2": "sous"}, 
    {"l1": " banco", "l2": "banque"}, 
    {"l1": " baño", "l2": "bain"}, 
    {"l1": " bar", "l2": "bar"}, 
    {"l1": " barco", "l2": "bateau"}, 
    {"l1": " barrio", "l2": "quartier"}, 
    {"l1": " bastante", "l2": "assez"}, 
    {"l1": " bastar", "l2": "suffire"}, 
    {"l1": " batir", "l2": "battre"}, 
    {"l1": " bebé", "l2": "bébé"}, 
    {"l1": " beber", "l2": "boire"}, 
    {"l1": " belleza", "l2": "beauté"}, 
    {"l1": " bello", "l2": "beau"}, 
    {"l1": " besar", "l2": "embrasser"}, 
    {"l1": " beso", "l2": "baiser"}, 
    {"l1": " bestia", "l2": "bête"}, 
    {"l1": " bien", "l2": "bien"}, 
    {"l1": " billete", "l2": "billet"}, 
    {"l1": " blanca", "l2": "blanc"}, 
    {"l1": " blanco", "l2": "blanc"}, 
    {"l1": " boca", "l2": "bouche"}, 
    {"l1": " boca", "l2": "gueule"}, 
    {"l1": " bola", "l2": "balle"}, 
    {"l1": " bolso", "l2": "sac"}, 
    {"l1": " bomba", "l2": "bombe"}, 
    {"l1": " bonito", "l2": "joli"}, 
    {"l1": " bonito", "l2": "mignon"}, 
    {"l1": " borde", "l2": "bord"}, 
    {"l1": " bosque", "l2": "bois"}, 
    {"l1": " brazo", "l2": "bras"}, 
    {"l1": " broma", "l2": "blague"}, 
    {"l1": " bromear", "l2": "plaisanter"}, 
    {"l1": " buenas noches", "l2": "bonsoir"}, 
    {"l1": " bueno", "l2": "bon"}, 
    {"l1": " buenos días", "l2": "bonjour"}, 
    {"l1": " buque", "l2": "vaisseau"}, 
    {"l1": " burdel", "l2": "bordel"}, 
    {"l1": " burlar", "l2": "moquer"}, 
    {"l1": " buscar", "l2": "chercher"}, 
    {"l1": " búsqueda", "l2": "recherche"}, 
    {"l1": " caballo", "l2": "cheval"}, 
    {"l1": " cabeza", "l2": "tête"}, 
    {"l1": " cabrón", "l2": "salaud"}, 
    {"l1": " cada", "l2": "chacun"}, 
    {"l1": " cada", "l2": "chaque"}, 
    {"l1": " caer", "l2": "tomber"}, 
    {"l1": " caerse", "l2": "tomber"}, 
    {"l1": " café", "l2": "café"}, 
    {"l1": " cagar", "l2": "chier"}, 
    {"l1": " caja", "l2": "boîte"}, 
    {"l1": " calcular", "l2": "compter"}, 
    {"l1": " caliente", "l2": "chaud"}, 
    {"l1": " callar", "l2": "taire"}, 
    {"l1": " callarse", "l2": "taire"}, 
    {"l1": " calle", "l2": "rue"}, 
    {"l1": " calma", "l2": "calme"}, 
    {"l1": " calmar", "l2": "calmer"}, 
    {"l1": " cama", "l2": "lit"}, 
    {"l1": " camarada", "l2": "camarade"}, 
    {"l1": " cambiar", "l2": "changer"}, 
    {"l1": " caminar", "l2": "marcher"}, 
    {"l1": " camino", "l2": "chemin"}, 
    {"l1": " campamento", "l2": "camp"}, 
    {"l1": " canción", "l2": "chanson"}, 
    {"l1": " cantar", "l2": "chanter"}, 
    {"l1": " capaz", "l2": "capable"}, 
    {"l1": " capitán", "l2": "capitaine"}, 
    {"l1": " capturar", "l2": "attraper"}, 
    {"l1": " cara", "l2": "face"}, 
    {"l1": " cara", "l2": "gueule"}, 
    {"l1": " cara", "l2": "visage"}, 
    {"l1": " carga", "l2": "charger"}, 
    {"l1": " carpeta", "l2": "dossier"}, 
    {"l1": " carretera", "l2": "route"}, 
    {"l1": " carta", "l2": "carte"}, 
    {"l1": " carta", "l2": "lettre"}, 
    {"l1": " casa", "l2": "maison"}, 
    {"l1": " casar", "l2": "épouser"}, 
    {"l1": " casarse", "l2": "marier"}, 
    {"l1": " casi", "l2": "presque"}, 
    {"l1": " caso", "l2": "cas"}, 
    {"l1": " castigo", "l2": "peine"}, 
    {"l1": " causa", "l2": "cause"}, 
    {"l1": " ceder", "l2": "lâcher"}, 
    {"l1": " celebración", "l2": "fête"}, 
    {"l1": " cenar", "l2": "dîner"}, 
    {"l1": " cerca", "l2": "près"}, 
    {"l1": " cerca de", "l2": "près de"}, 
    {"l1": " cerrar", "l2": "fermer"}, 
    {"l1": " cerveza", "l2": "bière"}, 
    {"l1": " cesar", "l2": "cesser"}, 
    {"l1": " chef", "l2": "chef"}, 
    {"l1": " chica", "l2": "fille"}, 
    {"l1": " cielo", "l2": "ciel"}, 
    {"l1": " cierto", "l2": "certain"}, 
    {"l1": " cigarrillo", "l2": "cigarette"}, 
    {"l1": " cinco", "l2": "cinq"}, 
    {"l1": " cinta", "l2": "bande"}, 
    {"l1": " cita", "l2": "rendez-vous"}, 
    {"l1": " ciudad", "l2": "ville"}, 
    {"l1": " claro", "l2": "clair"}, 
    {"l1": " clase", "l2": "classe"}, 
    {"l1": " clase", "l2": "cours"}, 
    {"l1": " clase", "l2": "espèce"}, 
    {"l1": " clase", "l2": "sorte"}, 
    {"l1": " clave", "l2": "clé"}, 
    {"l1": " cliente", "l2": "client"}, 
    {"l1": " club", "l2": "club"}, 
    {"l1": " coche", "l2": "voiture"}, 
    {"l1": " cocina", "l2": "cuisine"}, 
    {"l1": " colega", "l2": "pote"}, 
    {"l1": " cólera", "l2": "colère"}, 
    {"l1": " colocar", "l2": "poser"}, 
    {"l1": " color", "l2": "couleur"}, 
    {"l1": " comenzar", "l2": "commencer"}, 
    {"l1": " comer", "l2": "manger"}, 
    {"l1": " como", "l2": "comme"}, 
    {"l1": " cómo", "l2": "comme"}, 
    {"l1": " cómo", "l2": "comment"}, 
    {"l1": " como (conjunción)", "l2": "comme"}, 
    {"l1": " como si", "l2": "comme si"}, 
    {"l1": " compañero", "l2": "camarade"}, 
    {"l1": " compañero", "l2": "copain"}, 
    {"l1": " compañía", "l2": "compagnie"}, 
    {"l1": " compartir", "l2": "partager"}, 
    {"l1": " completamente", "l2": "complètement"}, 
    {"l1": " completo", "l2": "entier"}, 
    {"l1": " comprar", "l2": "acheter"}, 
    {"l1": " comprender", "l2": "comprendre"}, 
    {"l1": " comprobar", "l2": "vérifier"}, 
    {"l1": " con", "l2": "avec"}, 
    {"l1": " conducir", "l2": "conduire"}, 
    {"l1": " confianza", "l2": "confiance"}, 
    {"l1": " conocer", "l2": "connaître"}, 
    {"l1": " consejo", "l2": "conseil"}, 
    {"l1": " conservar", "l2": "retenir"}, 
    {"l1": " construir", "l2": "construire"}, 
    {"l1": " contacto", "l2": "contact"}, 
    {"l1": " contar", "l2": "compter"}, 
    {"l1": " contar", "l2": "raconter"}, 
    {"l1": " contenido", "l2": "content"}, 
    {"l1": " contento", "l2": "heureux"}, 
    {"l1": " continuación", "l2": "suite"}, 
    {"l1": " continuar", "l2": "continuer"}, 
    {"l1": " continuar siendo", "l2": "rester"}, 
    {"l1": " contra", "l2": "contre"}, 
    {"l1": " contratar", "l2": "engager"}, 
    {"l1": " control", "l2": "contrôle"}, 
    {"l1": " convertirse en", "l2": "devenir"}, 
    {"l1": " coraje", "l2": "courage"}, 
    {"l1": " corazón", "l2": "coeur"}, 
    {"l1": " coronel", "l2": "colonel"}, 
    {"l1": " correa", "l2": "laisse"}, 
    {"l1": " correos", "l2": "poste"}, 
    {"l1": " correr", "l2": "courir"}, 
    {"l1": " cortar", "l2": "couper"}, 
    {"l1": " corte", "l2": "cour"}, 
    {"l1": " cosa", "l2": "chose"}, 
    {"l1": " cosa", "l2": "truc"}, 
    {"l1": " costar", "l2": "coûter"}, 
    {"l1": " costumbre", "l2": "habitude"}, 
    {"l1": " crear", "l2": "créer"}, 
    {"l1": " crecer", "l2": "grandir"}, 
    {"l1": " creer", "l2": "croire"}, 
    {"l1": " crimen", "l2": "crime"}, 
    {"l1": " cristal", "l2": "verre"}, 
    {"l1": " cruzar", "l2": "passer"}, 
    {"l1": " cruzar", "l2": "traverser"}, 
    {"l1": " cual", "l2": "quel"}, 
    {"l1": " cuál", "l2": "quelle"}, 
    {"l1": " cuando", "l2": "quand"}, 
    {"l1": " cuándo", "l2": "quand"}, 
    {"l1": " cuánto", "l2": "combien"}, 
    {"l1": " cuatro", "l2": "quatre"}, 
    {"l1": " cubrir", "l2": "couvrir"}, 
    {"l1": " cuenta", "l2": "compte"}, 
    {"l1": " cuerpo", "l2": "corps"}, 
    {"l1": " cuidado", "l2": "soin"}, 
    {"l1": " culo", "l2": "cul"}, 
    {"l1": " culpa", "l2": "faute"}, 
    {"l1": " cumpleaños", "l2": "anniversaire"}, 
    {"l1": " curioso", "l2": "drôle"}, 
    {"l1": " cursillo", "l2": "cours"}, 
    {"l1": " curso", "l2": "cours"}, 
    {"l1": " curso", "l2": "course"}, 
    {"l1": " cuya", "l2": "dont"}, 
    {"l1": " cuyo", "l2": "dont"}, 
    {"l1": " dama", "l2": "dame"}, 
    {"l1": " danzar", "l2": "danser"}, 
    {"l1": " dar", "l2": "donner"}, 
    {"l1": " dar un beso", "l2": "embrasser"}, 
    {"l1": " darse cuenta", "l2": "réaliser"}, 
    {"l1": " darse cuenta", "l2": "remarquer"}, 
    {"l1": " de", "l2": "d’"}, 
    {"l1": " de", "l2": "de"}, 
    {"l1": " de", "l2": "du"}, 
    {"l1": " de", "l2": "à partir de"}, 
    {"l1": " de acuerdo", "l2": "ok"}, 
    {"l1": " de acuerdo con", "l2": "selon"}, 
    {"l1": " de este modo", "l2": "ainsi"}, 
    {"l1": " de manera que", "l2": "de façon (à ce) que"}, 
    {"l1": " de manera que", "l2": "de même que"}, 
    {"l1": " de otras cosas", "l2": "d’autres"}, 
    {"l1": " de pie", "l2": "debout"}, 
    {"l1": " de tal manera", "l2": "de (telle) mainère"}, 
    {"l1": " de tal manera", "l2": "de (telle) sorte que"}, 
    {"l1": " de tal manera", "l2": "que"}, 
    {"l1": " de verdad", "l2": "vraiment"}, 
    {"l1": " de vez en cuando", "l2": "de temps en temps"}, 
    {"l1": " debajo de", "l2": "sous"}, 
    {"l1": " deber", "l2": "devoir"}, 
    {"l1": " debido a", "l2": "à cause de"}, 
    {"l1": " début", "l2": "début"}, 
    {"l1": " decidir", "l2": "décider"}, 
    {"l1": " decir", "l2": "dire"}, 
    {"l1": " decir", "l2": "raconter"}, 
    {"l1": " decisión", "l2": "décision"}, 
    {"l1": " dedo", "l2": "doigt"}, 
    {"l1": " defender", "l2": "défendre"}, 
    {"l1": " dejar", "l2": "laisser"}, 
    {"l1": " dejar", "l2": "quitter"}, 
    {"l1": " delante", "l2": "devant"}, 
    {"l1": " delante de", "l2": "en face de"}, 
    {"l1": " demanda", "l2": "demande"}, 
    {"l1": " demasiado", "l2": "trop"}, 
    {"l1": " demostrar", "l2": "prouver"}, 
    {"l1": " dentro", "l2": "dedans"}, 
    {"l1": " dentro", "l2": "à l’intérieur"}, 
    {"l1": " dentro de", "l2": "dans"}, 
    {"l1": " dentro de", "l2": "l’intérieur de"}, 
    {"l1": " derecho", "l2": "droit"}, 
    {"l1": " desaparecer", "l2": "disparaître"}, 
    {"l1": " descansar", "l2": "reposer"}, 
    {"l1": " descender", "l2": "descendre"}, 
    {"l1": " descubrir", "l2": "découvrir"}, 
    {"l1": " desde", "l2": "depuis"}, 
    {"l1": " desde", "l2": "dès"}, 
    {"l1": " desde hace", "l2": "depuis"}, 
    {"l1": " desear", "l2": "désirer"}, 
    {"l1": " desear", "l2": "souhaiter"}, 
    {"l1": " desocupar", "l2": "dégager"}, 
    {"l1": " desolado", "l2": "désolé"}, 
    {"l1": " despacho", "l2": "bureau"}, 
    {"l1": " despedir", "l2": "virer"}, 
    {"l1": " despejar", "l2": "dégager"}, 
    {"l1": " despertar", "l2": "réveiller"}, 
    {"l1": " después", "l2": "après"}, 
    {"l1": " después", "l2": "puis"}, 
    {"l1": " después de", "l2": "après"}, 
    {"l1": " destruir", "l2": "détruire"}, 
    {"l1": " detener", "l2": "arrêter"}, 
    {"l1": " detener", "l2": "cesser"}, 
    {"l1": " detestar", "l2": "détester"}, 
    {"l1": " detrás de", "l2": "derrière"}, 
    {"l1": " devolver", "l2": "ramener"}, 
    {"l1": " devolver", "l2": "remettre"}, 
    {"l1": " devolver", "l2": "rendre"}, 
    {"l1": " día", "l2": "jour"}, 
    {"l1": " día", "l2": "journée"}, 
    {"l1": " diablo", "l2": "diable"}, 
    {"l1": " diciembre", "l2": "décembre"}, 
    {"l1": " diente", "l2": "dent"}, 
    {"l1": " diez", "l2": "dix"}, 
    {"l1": " diferente", "l2": "différent"}, 
    {"l1": " difícil", "l2": "difficile"}, 
    {"l1": " dificultad", "l2": "peine"}, 
    {"l1": " dinero", "l2": "argent"}, 
    {"l1": " dinero", "l2": "fric"}, 
    {"l1": " dios", "l2": "dieu"}, 
    {"l1": " dirección", "l2": "adresse"}, 
    {"l1": " director", "l2": "directeur"}, 
    {"l1": " dirigir", "l2": "diriger"}, 
    {"l1": " discurso", "l2": "parole"}, 
    {"l1": " discutir", "l2": "discuter"}, 
    {"l1": " disparar", "l2": "tirer"}, 
    {"l1": " divertir", "l2": "amuser"}, 
    {"l1": " divertirse", "l2": "amuser"}, 
    {"l1": " doctor", "l2": "docteur"}, 
    {"l1": " dólar", "l2": "dollar"}, 
    {"l1": " dolor", "l2": "douleur"}, 
    {"l1": " domingo", "l2": "dimanche"}, 
    {"l1": " domingo", "l2": "dimanch"}, 
    {"l1": " donde", "l2": "où"}, 
    {"l1": " dondequiera", "l2": "n’importe où"}, 
    {"l1": " dormir", "l2": "dormir"}, 
    {"l1": " dorso", "l2": "dessus"}, 
    {"l1": " dos", "l2": "deux"}, 
    {"l1": " dos palabras", "l2": "deux mots"}, 
    {"l1": " duda", "l2": "doute"}, 
    {"l1": " dudar", "l2": "douter"}, 
    {"l1": " dulce", "l2": "doux"}, 
    {"l1": " dulcemente", "l2": "doucement"}, 
    {"l1": " durante", "l2": "pendant"}, 
    {"l1": " durante", "l2": "au cours de"}, 
    {"l1": " durar", "l2": "durer"}, 
    {"l1": " duro", "l2": "dur"}, 
    {"l1": " e", "l2": "et"}, 
    {"l1": " echar de menos", "l2": "manquer"}, 
    {"l1": " echar un polvo", "l2": "baiser"}, 
    {"l1": " edad", "l2": "âge"}, 
    {"l1": " efecto", "l2": "effet"}, 
    {"l1": " eh", "l2": "eh"}, 
    {"l1": " eh", "l2": "hé"}, 
    {"l1": " eh", "l2": "hein"}, 
    {"l1": " ejemplo", "l2": "exemple"}, 
    {"l1": " ejército", "l2": "armée"}, 
    {"l1": " el", "l2": "le"}, 
    {"l1": " él", "l2": "il"}, 
    {"l1": " el cual", "l2": "lequel"}, 
    {"l1": " el invierno", "l2": "l’hiver"}, 
    {"l1": " el mediodía", "l2": "le midi"}, 
    {"l1": " el otoño", "l2": "l’automne"}, 
    {"l1": " el uno", "l2": "l’un"}, 
    {"l1": " el verano", "l2": "l’été"}, 
    {"l1": " elección", "l2": "choix"}, 
    {"l1": " elegir", "l2": "choisir"}, 
    {"l1": " ella", "l2": "elle"}, 
    {"l1": " ellas", "l2": "elles"}, 
    {"l1": " ellos", "l2": "eux"}, 
    {"l1": " ellos", "l2": "ils"}, 
    {"l1": " embelesar", "l2": "ravir"}, 
    {"l1": " empezar", "l2": "commencer"}, 
    {"l1": " empezar de nuevo", "l2": "recommencer"}, 
    {"l1": " empresa", "l2": "compagnie"}, 
    {"l1": " empresa", "l2": "société"}, 
    {"l1": " empujar", "l2": "pousser"}, 
    {"l1": " en", "l2": "chez"}, 
    {"l1": " en", "l2": "dans"}, 
    {"l1": " en", "l2": "en"}, 
    {"l1": " en", "l2": "à"}, 
    {"l1": " en", "l2": "sur"}, 
    {"l1": " en casa de", "l2": "chez"}, 
    {"l1": " en lo que", "l2": "autant que"}, 
    {"l1": " en lugar de", "l2": "au lieu de"}, 
    {"l1": " en ninguna parte", "l2": "nulle part"}, 
    {"l1": " en nombre de", "l2": "au nom de"}, 
    {"l1": " en otra parte", "l2": "ailleurs"}, 
    {"l1": " en primer lugar", "l2": "d’abord"}, 
    {"l1": " en todas partes", "l2": "partout"}, 
    {"l1": " enamorado", "l2": "amoureux"}, 
    {"l1": " encantar", "l2": "adorer"}, 
    {"l1": " encima", "l2": "sur"}, 
    {"l1": " encima de", "l2": "au sommet de"}, 
    {"l1": " encontrar", "l2": "rencontrer"}, 
    {"l1": " encontrar", "l2": "retrouver"}, 
    {"l1": " encontrar", "l2": "trouver"}, 
    {"l1": " enemigo", "l2": "ennemi"}, 
    {"l1": " enero", "l2": "janvier"}, 
    {"l1": " enfermedad", "l2": "maladie"}, 
    {"l1": " enfermo", "l2": "malade"}, 
    {"l1": " engañar", "l2": "tromper"}, 
    {"l1": " entender", "l2": "comprendre"}, 
    {"l1": " entero", "l2": "entier"}, 
    {"l1": " entonces", "l2": "alors"}, 
    {"l1": " entonces", "l2": "donc"}, 
    {"l1": " entonces", "l2": "puis"}, 
    {"l1": " entrar", "l2": "entrer"}, 
    {"l1": " entre", "l2": "entre"}, 
    {"l1": " entre", "l2": "parmi"}, 
    {"l1": " entrenar", "l2": "traîner"}, 
    {"l1": " entristecer", "l2": "désoler"}, 
    {"l1": " enviar", "l2": "dépêcher"}, 
    {"l1": " enviar", "l2": "envoyer"}, 
    {"l1": " envidia", "l2": "envie"}, 
    {"l1": " época", "l2": "époque"}, 
    {"l1": " equipo", "l2": "équipe"}, 
    {"l1": " equivocarse", "l2": "tromper"}, 
    {"l1": " error", "l2": "erreur"}, 
    {"l1": " error", "l2": "faute"}, 
    {"l1": " error", "l2": "tort"}, 
    {"l1": " es", "l2": "est"}, 
    {"l1": " esa", "l2": "celle"}, 
    {"l1": " escalar", "l2": "monter"}, 
    {"l1": " escapar", "l2": "échapper"}, 
    {"l1": " escena", "l2": "scène"}, 
    {"l1": " escoger", "l2": "choisir"}, 
    {"l1": " esconder", "l2": "cacher"}, 
    {"l1": " escribir", "l2": "écrire"}, 
    {"l1": " escritorio", "l2": "bureau"}, 
    {"l1": " escuchar", "l2": "écouter"}, 
    {"l1": " escuela", "l2": "école"}, 
    {"l1": " eso", "l2": "ça"}, 
    {"l1": " eso", "l2": "qui"}, 
    {"l1": " esos", "l2": "ces"}, 
    {"l1": " esos", "l2": "ceux"}, 
    {"l1": " espalda", "l2": "dos"}, 
    {"l1": " especial", "l2": "spécial"}, 
    {"l1": " especie", "l2": "espèce"}, 
    {"l1": " espejo", "l2": "glace"}, 
    {"l1": " esperanza", "l2": "espoir"}, 
    {"l1": " esperar", "l2": "attendre"}, 
    {"l1": " esperar", "l2": "espérer"}, 
    {"l1": " espíritu", "l2": "esprit"}, 
    {"l1": " esquina", "l2": "coin"}, 
    {"l1": " esta", "l2": "cette"}, 
    {"l1": " esta mañana", "l2": "ce matin"}, 
    {"l1": " esta noche", "l2": "ce soir"}, 
    {"l1": " estado", "l2": "état"}, 
    {"l1": " estar", "l2": "être"}, 
    {"l1": " este", "l2": "ce"}, 
    {"l1": " este", "l2": "ceci"}, 
    {"l1": " este", "l2": "cela"}, 
    {"l1": " este", "l2": "cet"}, 
    {"l1": " este", "l2": "est"}, 
    {"l1": " esto", "l2": "ça"}, 
    {"l1": " esto", "l2": "cette"}, 
    {"l1": " estos", "l2": "ces"}, 
    {"l1": " estudio", "l2": "étudier"}, 
    {"l1": " estupendo", "l2": "génial"}, 
    {"l1": " estupendo", "l2": "super"}, 
    {"l1": " estupidez", "l2": "connerie"}, 
    {"l1": " estúpido", "l2": "bête"}, 
    {"l1": " estúpido", "l2": "con"}, 
    {"l1": " estúpido", "l2": "stupide"}, 
    {"l1": " evidencia", "l2": "preuve"}, 
    {"l1": " evitar", "l2": "éviter"}, 
    {"l1": " exactamente", "l2": "exactement"}, 
    {"l1": " exacto", "l2": "exact"}, 
    {"l1": " excelente", "l2": "excellent"}, 
    {"l1": " excepto", "l2": "hors"}, 
    {"l1": " excepto", "l2": "sauf"}, 
    {"l1": " excusar", "l2": "excuser"}, 
    {"l1": " existir", "l2": "exister"}, 
    {"l1": " experiencia", "l2": "expérience"}, 
    {"l1": " experimentar", "l2": "ressentir"}, 
    {"l1": " explicar", "l2": "expliquer"}, 
    {"l1": " extrañar", "l2": "manquer"}, 
    {"l1": " extraño", "l2": "bizarre"}, 
    {"l1": " extraño", "l2": "étrange"}, 
    {"l1": " fácil", "l2": "facile"}, 
    {"l1": " fallar", "l2": "rater"}, 
    {"l1": " fallo", "l2": "tort"}, 
    {"l1": " falso", "l2": "faux"}, 
    {"l1": " falta", "l2": "faute"}, 
    {"l1": " faltar", "l2": "manquer"}, 
    {"l1": " faltar", "l2": "rater"}, 
    {"l1": " familia", "l2": "famille"}, 
    {"l1": " familiar", "l2": "parent"}, 
    {"l1": " fatigar", "l2": "fatiguer"}, 
    {"l1": " febrero", "l2": "février"}, 
    {"l1": " felicidad", "l2": "bonheur"}, 
    {"l1": " feliz", "l2": "heureux"}, 
    {"l1": " fichar", "l2": "ficher"}, 
    {"l1": " fiesta", "l2": "fête"}, 
    {"l1": " fijar", "l2": "ficher"}, 
    {"l1": " final", "l2": "bout"}, 
    {"l1": " final", "l2": "fin"}, 
    {"l1": " firmar", "l2": "signer"}, 
    {"l1": " firme", "l2": "ferme"}, 
    {"l1": " flor", "l2": "fleur"}, 
    {"l1": " follar", "l2": "baiser"}, 
    {"l1": " follar", "l2": "foutre"}, 
    {"l1": " fondo", "l2": "fond"}, 
    {"l1": " forma", "l2": "forme"}, 
    {"l1": " foto", "l2": "photo"}, 
    {"l1": " frecuente", "l2": "souvent"}, 
    {"l1": " frío", "l2": "froid"}, 
    {"l1": " fuego", "l2": "feu"}, 
    {"l1": " fuera", "l2": "dehors"}, 
    {"l1": " fuera", "l2": "à"}, 
    {"l1": " fuera", "l2": "à l’extérieur"}, 
    {"l1": " fuera de", "l2": "de dehors des"}, 
    {"l1": " fuerte", "l2": "fort"}, 
    {"l1": " fuerza", "l2": "force"}, 
    {"l1": " fuerza", "l2": "forcer"}, 
    {"l1": " fumar", "l2": "fumer"}, 
    {"l1": " futuro", "l2": "avenir"}, 
    {"l1": " ganar", "l2": "gagner"}, 
    {"l1": " ganas", "l2": "envie"}, 
    {"l1": " gato", "l2": "chat"}, 
    {"l1": " gendarme", "l2": "garde"}, 
    {"l1": " general", "l2": "général"}, 
    {"l1": " genero", "l2": "genre"}, 
    {"l1": " gente", "l2": "gens"}, 
    {"l1": " girar", "l2": "tourner"}, 
    {"l1": " gol", "l2": "but"}, 
    {"l1": " golfa", "l2": "salope"}, 
    {"l1": " golpe", "l2": "coup"}, 
    {"l1": " golpear", "l2": "frapper"}, 
    {"l1": " gracia", "l2": "grâce"}, 
    {"l1": " gracias", "l2": "merci"}, 
    {"l1": " gracioso", "l2": "drôle"}, 
    {"l1": " grande", "l2": "grand"}, 
    {"l1": " grave", "l2": "grave"}, 
    {"l1": " grave", "l2": "sérieux"}, 
    {"l1": " gritar", "l2": "crier"}, 
    {"l1": " grueso", "l2": "gros"}, 
    {"l1": " grupo", "l2": "groupe"}, 
    {"l1": " guapo", "l2": "beau"}, 
    {"l1": " guarda", "l2": "garde"}, 
    {"l1": " guardar", "l2": "sauver"}, 
    {"l1": " guardia", "l2": "garde"}, 
    {"l1": " guerra", "l2": "guerre"}, 
    {"l1": " gustar", "l2": "plaire"}, 
    {"l1": " haber", "l2": "avoir"}, 
    {"l1": " habitación", "l2": "chambre"}, 
    {"l1": " habitar", "l2": "habiter"}, 
    {"l1": " hábito", "l2": "habitude"}, 
    {"l1": " hablar", "l2": "parler"}, 
    {"l1": " hace…", "l2": "il y a"}, 
    {"l1": " hacer", "l2": "faire"}, 
    {"l1": " hacer", "l2": "ficher"}, 
    {"l1": " hacer daño", "l2": "blesser"}, 
    {"l1": " hacerse responsable", "l2": "engager"}, 
    {"l1": " hacia", "l2": "vers"}, 
    {"l1": " hambre", "l2": "faim"}, 
    {"l1": " hasta", "l2": "jusqu’à"}, 
    {"l1": " hasta", "l2": "jusqu’à ce que"}, 
    {"l1": " hay", "l2": "y"}, 
    {"l1": " hecho", "l2": "fait"}, 
    {"l1": " herir", "l2": "blesser"}, 
    {"l1": " hermana", "l2": "soeur"}, 
    {"l1": " hermano", "l2": "frère"}, 
    {"l1": " héroe", "l2": "héros"}, 
    {"l1": " hijo", "l2": "fils"}, 
    {"l1": " hijo de puta", "l2": "salaud"}, 
    {"l1": " hilar", "l2": "filer"}, 
    {"l1": " hilo", "l2": "fil"}, 
    {"l1": " historia", "l2": "histoire"}, 
    {"l1": " hola", "l2": "allô"}, 
    {"l1": " hola", "l2": "bonjour"}, 
    {"l1": " hola", "l2": "salut"}, 
    {"l1": " hombre", "l2": "homme"}, 
    {"l1": " honor", "l2": "honneur"}, 
    {"l1": " hora", "l2": "heure"}, 
    {"l1": " horrible", "l2": "horrible"}, 
    {"l1": " hospital", "l2": "hôpital"}, 
    {"l1": " hotel", "l2": "hôtel"}, 
    {"l1": " hoy", "l2": "aujourd’hui"}, 
    {"l1": " huir", "l2": "enfuir"}, 
    {"l1": " huir", "l2": "fuir"}, 
    {"l1": " humano", "l2": "humain"}, 
    {"l1": " hurto", "l2": "vol"}, 
    {"l1": " idea", "l2": "idée"}, 
    {"l1": " idioma", "l2": "langue"}, 
    {"l1": " idiota", "l2": "idiot"}, 
    {"l1": " iglesia", "l2": "église"}, 
    {"l1": " ignorar", "l2": "ignorer"}, 
    {"l1": " igual", "l2": "pareil"}, 
    {"l1": " igual que", "l2": "autant"}, 
    {"l1": " imagen", "l2": "image"}, 
    {"l1": " imaginar", "l2": "imaginer"}, 
    {"l1": " impedir", "l2": "empêcher"}, 
    {"l1": " importante", "l2": "important"}, 
    {"l1": " importar", "l2": "importer"}, 
    {"l1": " imposible", "l2": "impossible"}, 
    {"l1": " impresión", "l2": "impression"}, 
    {"l1": " incluido", "l2": "compris"}, 
    {"l1": " incluso", "l2": "même"}, 
    {"l1": " increíble", "l2": "incroyable"}, 
    {"l1": " infierno", "l2": "enfer"}, 
    {"l1": " inmediatamente", "l2": "immédiatement"}, 
    {"l1": " inspector", "l2": "inspecteur"}, 
    {"l1": " instalar", "l2": "installer"}, 
    {"l1": " instante", "l2": "instant"}, 
    {"l1": " intención", "l2": "propos"}, 
    {"l1": " intentar", "l2": "essayer"}, 
    {"l1": " intentar", "l2": "tenter"}, 
    {"l1": " interés", "l2": "intérêt"}, 
    {"l1": " interesante", "l2": "intéressant"}, 
    {"l1": " interesar", "l2": "intéresser"}, 
    {"l1": " interesarse", "l2": "intéresser"}, 
    {"l1": " interior", "l2": "intérieur"}, 
    {"l1": " inútil", "l2": "inutile"}, 
    {"l1": " investigación", "l2": "recherche"}, 
    {"l1": " invitar", "l2": "inviter"}, 
    {"l1": " ir", "l2": "aller"}, 
    {"l1": " irse", "l2": "partir"}, 
    {"l1": " izquierdo", "l2": "gauche"}, 
    {"l1": " jamás", "l2": "jamais"}, 
    {"l1": " jefe", "l2": "chef"}, 
    {"l1": " jefe", "l2": "patron"}, 
    {"l1": " joder", "l2": "foutre"}, 
    {"l1": " jornada", "l2": "journée"}, 
    {"l1": " joven", "l2": "jeune"}, 
    {"l1": " juego", "l2": "jeu"}, 
    {"l1": " jueves", "l2": "jeudi"}, 
    {"l1": " juez", "l2": "juge"}, 
    {"l1": " jugar", "l2": "jouer"}, 
    {"l1": " juicio", "l2": "avis"}, 
    {"l1": " julio", "l2": "juillet"}, 
    {"l1": " junio", "l2": "juin"}, 
    {"l1": " junto", "l2": "ensemble"}, 
    {"l1": " juntos", "l2": "ensemble"}, 
    {"l1": " jurar", "l2": "jurer"}, 
    {"l1": " justo", "l2": "juste"}, 
    {"l1": " la", "l2": "l’"}, 
    {"l1": " la", "l2": "la"}, 
    {"l1": " la cual", "l2": "laquelle"}, 
    {"l1": " la manera", "l2": "manière"}, 
    {"l1": " la mañana", "l2": "le matin"}, 
    {"l1": " la medianoche", "l2": "la minuit"}, 
    {"l1": " la noche", "l2": "le soir"}, 
    {"l1": " la noche (después de la cena)", "l2": "la nuit"}, 
    {"l1": " la primavera", "l2": "le printemps"}, 
    {"l1": " la tarde", "l2": "l’après-midi"}, 
    {"l1": " lado", "l2": "côté"}, 
    {"l1": " lado", "l2": "face"}, 
    {"l1": " ladrón", "l2": "voleur"}, 
    {"l1": " lamentar", "l2": "regretter"}, 
    {"l1": " lanzar", "l2": "jeter"}, 
    {"l1": " lanzar", "l2": "lancer"}, 
    {"l1": " largo", "l2": "long"}, 
    {"l1": " las", "l2": "les"}, 
    {"l1": " lástima", "l2": "con"}, 
    {"l1": " lástima", "l2": "dommage"}, 
    {"l1": " lástima", "l2": "pitié"}, 
    {"l1": " lavar", "l2": "laver"}, 
    {"l1": " le", "l2": "l’"}, 
    {"l1": " leer", "l2": "lire"}, 
    {"l1": " lejos", "l2": "loin"}, 
    {"l1": " lejos de", "l2": "loin d’être"}, 
    {"l1": " lengua", "l2": "langue"}, 
    {"l1": " leña", "l2": "bois"}, 
    {"l1": " levantar", "l2": "lever"}, 
    {"l1": " ley", "l2": "loi"}, 
    {"l1": " liberar", "l2": "libérer"}, 
    {"l1": " libertad", "l2": "liberté"}, 
    {"l1": " libre", "l2": "libre"}, 
    {"l1": " libro", "l2": "livre"}, 
    {"l1": " limpio", "l2": "propre"}, 
    {"l1": " lindo", "l2": "beau"}, 
    {"l1": " lindo", "l2": "joli"}, 
    {"l1": " lindo", "l2": "mignon"}, 
    {"l1": " línea", "l2": "ligne"}, 
    {"l1": " lista", "l2": "liste"}, 
    {"l1": " listo", "l2": "prêt"}, 
    {"l1": " llamada", "l2": "appel"}, 
    {"l1": " llamar", "l2": "appeler"}, 
    {"l1": " llamar", "l2": "sonner"}, 
    {"l1": " llave", "l2": "clé"}, 
    {"l1": " llegar", "l2": "arriver"}, 
    {"l1": " llevar", "l2": "apporter"}, 
    {"l1": " llevar", "l2": "emmener"}, 
    {"l1": " llevar", "l2": "emporter"}, 
    {"l1": " llevar", "l2": "mener"}, 
    {"l1": " llevar", "l2": "porter"}, 
    {"l1": " llorar", "l2": "crier"}, 
    {"l1": " llorar", "l2": "pleurer"}, 
    {"l1": " llover", "l2": "pleuvoir"}, 
    {"l1": " loco", "l2": "fou"}, 
    {"l1": " lograr", "l2": "réussir"}, 
    {"l1": " lucha", "l2": "combat"}, 
    {"l1": " luego", "l2": "puis"}, 
    {"l1": " lugar", "l2": "endroit"}, 
    {"l1": " lugar", "l2": "lieu"}, 
    {"l1": " lunes", "l2": "lundi"}, 
    {"l1": " luz", "l2": "lumière"}, 
    {"l1": " madera", "l2": "bois"}, 
    {"l1": " madre", "l2": "mère"}, 
    {"l1": " maestro", "l2": "maître"}, 
    {"l1": " magnífico", "l2": "magnifique"}, 
    {"l1": " mal", "l2": "mal"}, 
    {"l1": " malo", "l2": "mauvais"}, 
    {"l1": " mamá", "l2": "maman"}, 
    {"l1": " mandar", "l2": "dépêcher"}, 
    {"l1": " mandar", "l2": "envoyer"}, 
    {"l1": " manera", "l2": "façon"}, 
    {"l1": " mano", "l2": "main"}, 
    {"l1": " mantener", "l2": "garder"}, 
    {"l1": " mantener", "l2": "maintenir"}, 
    {"l1": " mantener", "l2": "tenir"}, 
    {"l1": " mañana", "l2": "demain"}, 
    {"l1": " mañana", "l2": "matin"}, 
    {"l1": " mapa", "l2": "carte"}, 
    {"l1": " máquina", "l2": "machine"}, 
    {"l1": " mar", "l2": "mer"}, 
    {"l1": " maravilloso", "l2": "merveilleux"}, 
    {"l1": " marcharse", "l2": "partir"}, 
    {"l1": " marido", "l2": "époux"}, 
    {"l1": " marido", "l2": "mari"}, 
    {"l1": " martes", "l2": "mardi"}, 
    {"l1": " marzo", "l2": "mars"}, 
    {"l1": " más", "l2": "plus"}, 
    {"l1": " mas", "l2": "mais"}, 
    {"l1": " más allá de", "l2": "au-delà"}, 
    {"l1": " más bien", "l2": "plutôt"}, 
    {"l1": " más tarde", "l2": "plus tard"}, 
    {"l1": " matar", "l2": "tuer"}, 
    {"l1": " matrimonio", "l2": "mariage"}, 
    {"l1": " mayo", "l2": "mai"}, 
    {"l1": " me", "l2": "me"}, 
    {"l1": " me", "l2": "moi"}, 
    {"l1": " médico", "l2": "docteur"}, 
    {"l1": " médico", "l2": "médecin"}, 
    {"l1": " medio", "l2": "milieu"}, 
    {"l1": " medio", "l2": "moyen"}, 
    {"l1": " mejor", "l2": "meilleur"}, 
    {"l1": " mejor", "l2": "mieux"}, 
    {"l1": " menos", "l2": "moins"}, 
    {"l1": " mensaje", "l2": "message"}, 
    {"l1": " mente", "l2": "esprit"}, 
    {"l1": " mentira", "l2": "mentir"}, 
    {"l1": " menú", "l2": "carte"}, 
    {"l1": " mercado", "l2": "marché"}, 
    {"l1": " merecer", "l2": "mériter"}, 
    {"l1": " mesa", "l2": "table"}, 
    {"l1": " meses", "l2": "mois"}, 
    {"l1": " meta", "l2": "but"}, 
    {"l1": " mi", "l2": "ma"}, 
    {"l1": " mi", "l2": "mon"}, 
    {"l1": " miedo", "l2": "peur"}, 
    {"l1": " mientras que", "l2": "pendant"}, 
    {"l1": " miércoles", "l2": "mercredi"}, 
    {"l1": " mierda", "l2": "merde"}, 
    {"l1": " millón", "l2": "million"}, 
    {"l1": " minuto", "l2": "minute"}, 
    {"l1": " mirar", "l2": "regarder"}, 
    {"l1": " mis", "l2": "mes"}, 
    {"l1": " misión", "l2": "mission"}, 
    {"l1": " mitad", "l2": "moitié"}, 
    {"l1": " modo", "l2": "façon"}, 
    {"l1": " molestar", "l2": "déranger"}, 
    {"l1": " momento", "l2": "instant"}, 
    {"l1": " momento", "l2": "moment"}, 
    {"l1": " montón", "l2": "tas"}, 
    {"l1": " morir", "l2": "mourir"}, 
    {"l1": " mostrar", "l2": "montrer"}, 
    {"l1": " mover", "l2": "bouger"}, 
    {"l1": " mucha", "l2": "beaucoup"}, 
    {"l1": " mucho", "l2": "beaucoup"}, 
    {"l1": " mucho tiempo", "l2": "longtemps"}, 
    {"l1": " muerte", "l2": "mort"}, 
    {"l1": " mujer", "l2": "femme"}, 
    {"l1": " mundo", "l2": "monde"}, 
    {"l1": " música", "l2": "musique"}, 
    {"l1": " muy", "l2": "très"}, 
    {"l1": " nacer", "l2": "naître"}, 
    {"l1": " nada", "l2": "rien"}, 
    {"l1": " nariz", "l2": "nez"}, 
    {"l1": " necesitar", "l2": "besoin"}, 
    {"l1": " negocio", "l2": "affaire"}, 
    {"l1": " negro", "l2": "noir"}, 
    {"l1": " ni", "l2": "ni"}, 
    {"l1": " ninguna", "l2": "aucune"}, 
    {"l1": " niño", "l2": "enfant"}, 
    {"l1": " niño", "l2": "gamin"}, 
    {"l1": " niño", "l2": "garçon"}, 
    {"l1": " niño", "l2": "gosse"}, 
    {"l1": " no", "l2": "ne"}, 
    {"l1": " no", "l2": "non"}, 
    {"l1": " no", "l2": "pas"}, 
    {"l1": " no obstante", "l2": "toutefois"}, 
    {"l1": " noche", "l2": "nuit"}, 
    {"l1": " noche", "l2": "soir"}, 
    {"l1": " noche", "l2": "soirée"}, 
    {"l1": " normal", "l2": "normal"}, 
    {"l1": " nosotros", "l2": "nous"}, 
    {"l1": " notar", "l2": "remarquer"}, 
    {"l1": " noticia", "l2": "nouvelle"}, 
    {"l1": " novela", "l2": "nouvelle"}, 
    {"l1": " noviembre", "l2": "novembre"}, 
    {"l1": " novio", "l2": "copain"}, 
    {"l1": " nuestro", "l2": "notre"}, 
    {"l1": " nuestros", "l2": "nos"}, 
    {"l1": " nueva", "l2": "nouvelle"}, 
    {"l1": " nuevo", "l2": "neuf"}, 
    {"l1": " nuevo", "l2": "nouveau"}, 
    {"l1": " número", "l2": "numéro"}, 
    {"l1": " nunca", "l2": "jamais"}, 
    {"l1": " o", "l2": "ou"}, 
    {"l1": " o bien", "l2": "ou bien"}, 
    {"l1": " obligar", "l2": "obliger"}, 
    {"l1": " obra", "l2": "pièce"}, 
    {"l1": " observar", "l2": "remarquer"}, 
    {"l1": " obtener", "l2": "obtenir"}, 
    {"l1": " octubre", "l2": "octobre"}, 
    {"l1": " ocupar", "l2": "occuper"}, 
    {"l1": " oficina", "l2": "bureau"}, 
    {"l1": " ofrecer", "l2": "offrir"}, 
    {"l1": " oh", "l2": "oh"}, 
    {"l1": " oír", "l2": "entendre"}, 
    {"l1": " ojo", "l2": "oeil"}, 
    {"l1": " oler", "l2": "sentir"}, 
    {"l1": " olvidar", "l2": "oublier"}, 
    {"l1": " opinión", "l2": "avis"}, 
    {"l1": " oportunidad", "l2": "chance"}, 
    {"l1": " opuesto", "l2": "opposé"}, 
    {"l1": " orar", "l2": "prier"}, 
    {"l1": " orden", "l2": "ordre"}, 
    {"l1": " oreja", "l2": "oreille"}, 
    {"l1": " organizar", "l2": "arranger"}, 
    {"l1": " orgulloso", "l2": "fier"}, 
    {"l1": " orilla", "l2": "bord"}, 
    {"l1": " oro", "l2": "or"}, 
    {"l1": " osar", "l2": "oser"}, 
    {"l1": " otro", "l2": "autre"}, 
    {"l1": " otros", "l2": "autres"}, 
    {"l1": " otros", "l2": "d’autres"}, 
    {"l1": " padre", "l2": "parent"}, 
    {"l1": " padre", "l2": "père"}, 
    {"l1": " pagar", "l2": "payer"}, 
    {"l1": " país", "l2": "pays"}, 
    {"l1": " pájaro", "l2": "oiseau"}, 
    {"l1": " palabra", "l2": "mot"}, 
    {"l1": " palabra", "l2": "parole"}, 
    {"l1": " pan", "l2": "pain"}, 
    {"l1": " papá", "l2": "papa"}, 
    {"l1": " papel", "l2": "papier"}, 
    {"l1": " papel", "l2": "rôle"}, 
    {"l1": " para", "l2": "à"}, 
    {"l1": " para", "l2": "pour"}, 
    {"l1": " parecer", "l2": "avis"}, 
    {"l1": " parecer", "l2": "paraître"}, 
    {"l1": " parecer", "l2": "ressembler"}, 
    {"l1": " parecer", "l2": "sembler"}, 
    {"l1": " parecerse", "l2": "ressembler"}, 
    {"l1": " pared", "l2": "mur"}, 
    {"l1": " pariente", "l2": "parent"}, 
    {"l1": " parte", "l2": "part"}, 
    {"l1": " parte", "l2": "partie"}, 
    {"l1": " parte superior", "l2": "dessus"}, 
    {"l1": " partida", "l2": "départ"}, 
    {"l1": " partitivo", "l2": "du"}, 
    {"l1": " pasado", "l2": "dernier"}, 
    {"l1": " pasado", "l2": "passé"}, 
    {"l1": " pasar", "l2": "passer"}, 
    {"l1": " pasar por alto", "l2": "ignorer"}, 
    {"l1": " paseo", "l2": "tour"}, 
    {"l1": " patio", "l2": "cour"}, 
    {"l1": " paz", "l2": "paix"}, 
    {"l1": " pedir", "l2": "demander"}, 
    {"l1": " película", "l2": "film"}, 
    {"l1": " peligro", "l2": "danger"}, 
    {"l1": " peligroso", "l2": "dangereux"}, 
    {"l1": " pelo", "l2": "cheveu"}, 
    {"l1": " pelota", "l2": "balle"}, 
    {"l1": " pena", "l2": "peine"}, 
    {"l1": " pensar", "l2": "penser"}, 
    {"l1": " pensar", "l2": "réfléchir"}, 
    {"l1": " peor", "l2": "pire"}, 
    {"l1": " pequeño", "l2": "petit"}, 
    {"l1": " percibir", "l2": "sentir"}, 
    {"l1": " perder", "l2": "perdre"}, 
    {"l1": " perder", "l2": "rater"}, 
    {"l1": " perdón", "l2": "pardon"}, 
    {"l1": " perdonar", "l2": "pardonner"}, 
    {"l1": " periódico", "l2": "journal"}, 
    {"l1": " perjuicio", "l2": "tort"}, 
    {"l1": " permanecer", "l2": "rester"}, 
    {"l1": " permitir", "l2": "permettre"}, 
    {"l1": " pero", "l2": "mais"}, 
    {"l1": " perro", "l2": "chien"}, 
    {"l1": " perseguir", "l2": "poursuivre"}, 
    {"l1": " persona", "l2": "personne"}, 
    {"l1": " personas", "l2": "gens"}, 
    {"l1": " pertenecer", "l2": "appartenir"}, 
    {"l1": " pescado", "l2": "poisson"}, 
    {"l1": " pez", "l2": "poisson"}, 
    {"l1": " pie", "l2": "pied"}, 
    {"l1": " piedad", "l2": "pitié"}, 
    {"l1": " piedra", "l2": "pierre"}, 
    {"l1": " piel", "l2": "peau"}, 
    {"l1": " pierna", "l2": "jambe"}, 
    {"l1": " pieza", "l2": "morceau"}, 
    {"l1": " pieza", "l2": "pièce"}, 
    {"l1": " pinchar", "l2": "crever"}, 
    {"l1": " placer", "l2": "plaisir"}, 
    {"l1": " plan", "l2": "plan"}, 
    {"l1": " plan", "l2": "propos"}, 
    {"l1": " pleno", "l2": "plein"}, 
    {"l1": " pobre", "l2": "pauvre"}, 
    {"l1": " poco", "l2": "peu"}, 
    {"l1": " poder", "l2": "pouvoir"}, 
    {"l1": " poli", "l2": "flic"}, 
    {"l1": " policía", "l2": "police"}, 
    {"l1": " poner", "l2": "mettre"}, 
    {"l1": " poner", "l2": "poser"}, 
    {"l1": " por", "l2": "par"}, 
    {"l1": " por ahí", "l2": "là-bas"}, 
    {"l1": " por debajo de", "l2": "en dessous"}, 
    {"l1": " por encima", "l2": "au-dessus"}, 
    {"l1": " por lo demás", "l2": "sinon"}, 
    {"l1": " por lo general", "l2": "habituellement"}, 
    {"l1": " por qué", "l2": "pourquoi"}, 
    {"l1": " porque", "l2": "parce que"}, 
    {"l1": " porqué", "l2": "pourquoi"}, 
    {"l1": " posible", "l2": "possible"}, 
    {"l1": " precio", "l2": "prix"}, 
    {"l1": " predecir", "l2": "prévoir"}, 
    {"l1": " preferir", "l2": "préférer"}, 
    {"l1": " pregunta", "l2": "question"}, 
    {"l1": " preguntar", "l2": "demander"}, 
    {"l1": " preocupar", "l2": "inquiéter"}, 
    {"l1": " preparado", "l2": "prêt"}, 
    {"l1": " preparar", "l2": "préparer"}, 
    {"l1": " presentar", "l2": "présenter"}, 
    {"l1": " presente", "l2": "présent"}, 
    {"l1": " presidente", "l2": "président"}, 
    {"l1": " prevenir", "l2": "prévenir"}, 
    {"l1": " primero", "l2": "d’abord"}, 
    {"l1": " primero", "l2": "premier"}, 
    {"l1": " primo", "l2": "cousin"}, 
    {"l1": " príncipe", "l2": "prince"}, 
    {"l1": " principio", "l2": "début"}, 
    {"l1": " prisión", "l2": "prison"}, 
    {"l1": " probablemente", "l2": "probablement"}, 
    {"l1": " probar", "l2": "essayer"}, 
    {"l1": " problema", "l2": "problème"}, 
    {"l1": " profesor", "l2": "professeur"}, 
    {"l1": " prometer", "l2": "promettre"}, 
    {"l1": " pronto", "l2": "bientôt"}, 
    {"l1": " pronto", "l2": "tôt"}, 
    {"l1": " pronto", "l2": "bientót"}, 
    {"l1": " propio", "l2": "propre"}, 
    {"l1": " proponer", "l2": "proposer"}, 
    {"l1": " propósito", "l2": "propos"}, 
    {"l1": " proteger", "l2": "protéger"}, 
    {"l1": " próximo", "l2": "prochain"}, 
    {"l1": " proyecto", "l2": "projet"}, 
    {"l1": " prueba", "l2": "preuve"}, 
    {"l1": " pueblo", "l2": "peuple"}, 
    {"l1": " pueblo", "l2": "village"}, 
    {"l1": " puede ser", "l2": "peut-être"}, 
    {"l1": " puerta", "l2": "porte"}, 
    {"l1": " pues", "l2": "donc"}, 
    {"l1": " pues", "l2": "car"}, 
    {"l1": " puesto que", "l2": "car"}, 
    {"l1": " punto", "l2": "point"}, 
    {"l1": " puta", "l2": "putain"}, 
    {"l1": " puta", "l2": "pute"}, 
    {"l1": " que", "l2": "que"}, 
    {"l1": " que", "l2": "quoi"}, 
    {"l1": " qué", "l2": "comment"}, 
    {"l1": " qué", "l2": "quelle"}, 
    {"l1": " quedar con", "l2": "rejoindre"}, 
    {"l1": " quedarse", "l2": "rester"}, 
    {"l1": " quemar", "l2": "brûler"}, 
    {"l1": " querer", "l2": "aimer"}, 
    {"l1": " querer", "l2": "vouloir"}, 
    {"l1": " querido", "l2": "cher"}, 
    {"l1": " querido", "l2": "chéri"}, 
    {"l1": " quien", "l2": "qui"}, 
    {"l1": " quitar", "l2": "enlever"}, 
    {"l1": " quitarse", "l2": "poser"}, 
    {"l1": " quizás", "l2": "peut-être"}, 
    {"l1": " radio", "l2": "radio"}, 
    {"l1": " rápidamente", "l2": "vite"}, 
    {"l1": " rara vez", "l2": "rarement"}, 
    {"l1": " raramente", "l2": "rarement"}, 
    {"l1": " rasgar", "l2": "filer"}, 
    {"l1": " rato", "l2": "moment"}, 
    {"l1": " razón", "l2": "raison"}, 
    {"l1": " realizar", "l2": "réaliser"}, 
    {"l1": " realmente", "l2": "vraiment"}, 
    {"l1": " rechazar", "l2": "refuser"}, 
    {"l1": " recibir", "l2": "recevoir"}, 
    {"l1": " recientemente", "l2": "récemment"}, 
    {"l1": " reconocer", "l2": "reconnaître"}, 
    {"l1": " recordar", "l2": "rappeler"}, 
    {"l1": " recuerdo", "l2": "souvenir"}, 
    {"l1": " recuperar", "l2": "récupérer"}, 
    {"l1": " reflexionar", "l2": "réfléchir"}, 
    {"l1": " regalar", "l2": "offrir"}, 
    {"l1": " regalo", "l2": "cadeau"}, 
    {"l1": " regla", "l2": "règle"}, 
    {"l1": " regresar", "l2": "rentrer"}, 
    {"l1": " regresar", "l2": "retourner"}, 
    {"l1": " regresar", "l2": "revenir"}, 
    {"l1": " regreso", "l2": "retour"}, 
    {"l1": " reír", "l2": "rire"}, 
    {"l1": " relación", "l2": "relation"}, 
    {"l1": " relajarse", "l2": "lâcher"}, 
    {"l1": " remontar", "l2": "remonter"}, 
    {"l1": " reparar", "l2": "réparer"}, 
    {"l1": " repetir", "l2": "répéter"}, 
    {"l1": " respecto", "l2": "rapport"}, 
    {"l1": " respetar", "l2": "respecter"}, 
    {"l1": " respirar", "l2": "respirer"}, 
    {"l1": " responder", "l2": "répondre"}, 
    {"l1": " respuesta", "l2": "réponse"}, 
    {"l1": " restablecer", "l2": "remettre"}, 
    {"l1": " resto", "l2": "reste"}, 
    {"l1": " retener", "l2": "retenir"}, 
    {"l1": " retirar", "l2": "retirer"}, 
    {"l1": " retirarse", "l2": "retirer"}, 
    {"l1": " retomar", "l2": "reprendre"}, 
    {"l1": " retorno", "l2": "retour"}, 
    {"l1": " retraso", "l2": "retard"}, 
    {"l1": " reunirse con", "l2": "rejoindre"}, 
    {"l1": " reventar", "l2": "crever"}, 
    {"l1": " revisar", "l2": "revoir"}, 
    {"l1": " rey", "l2": "roi"}, 
    {"l1": " rezar", "l2": "prier"}, 
    {"l1": " rico", "l2": "riche"}, 
    {"l1": " riesgo", "l2": "risque"}, 
    {"l1": " robar", "l2": "voler"}, 
    {"l1": " robo", "l2": "vol"}, 
    {"l1": " rogar", "l2": "prier"}, 
    {"l1": " rojo", "l2": "rouge"}, 
    {"l1": " romper", "l2": "casser"}, 
    {"l1": " ruido", "l2": "bruit"}, 
    {"l1": " s’", "l2": "s’"}, 
    {"l1": " sábado", "l2": "samedi"}, 
    {"l1": " saber", "l2": "savoir"}, 
    {"l1": " sacar", "l2": "enlever"}, 
    {"l1": " sala", "l2": "salle"}, 
    {"l1": " salida", "l2": "départ"}, 
    {"l1": " salir", "l2": "sortir"}, 
    {"l1": " salir bien", "l2": "réussir"}, 
    {"l1": " salir con prisas", "l2": "filer"}, 
    {"l1": " saltar", "l2": "sauter"}, 
    {"l1": " salud", "l2": "santé"}, 
    {"l1": " salvar", "l2": "sauver"}, 
    {"l1": " salvo", "l2": "sauf"}, 
    {"l1": " salvo", "l2": "à l’exception de"}, 
    {"l1": " sangre", "l2": "sang"}, 
    {"l1": " se", "l2": "on"}, 
    {"l1": " secreto", "l2": "secret"}, 
    {"l1": " seguir", "l2": "suivre"}, 
    {"l1": " según", "l2": "selon"}, 
    {"l1": " según", "l2": "selon que"}, 
    {"l1": " segundo", "l2": "seconde"}, 
    {"l1": " seguramente", "l2": "sûrement"}, 
    {"l1": " seguridad", "l2": "sécurité"}, 
    {"l1": " seguro", "l2": "sûr"}, 
    {"l1": " seis", "l2": "six"}, 
    {"l1": " semana", "l2": "semaine"}, 
    {"l1": " semaña próxima", "l2": "semaine prochaine"}, 
    {"l1": " semejante", "l2": "pareil"}, 
    {"l1": " sencillo", "l2": "simple"}, 
    {"l1": " sentar", "l2": "asseoir"}, 
    {"l1": " sentido", "l2": "sens"}, 
    {"l1": " sentimiento", "l2": "sentiment"}, 
    {"l1": " sentir", "l2": "ressentir"}, 
    {"l1": " sentir", "l2": "sentir"}, 
    {"l1": " señor", "l2": "monsieur"}, 
    {"l1": " señor", "l2": "seigneur"}, 
    {"l1": " señora", "l2": "madame"}, 
    {"l1": " señorita", "l2": "mademoiselle"}, 
    {"l1": " separar", "l2": "séparer"}, 
    {"l1": " septiembre", "l2": "septembre"}, 
    {"l1": " ser", "l2": "être"}, 
    {"l1": " ser necesario", "l2": "falloir"}, 
    {"l1": " serio", "l2": "sérieux"}, 
    {"l1": " servicio", "l2": "service"}, 
    {"l1": " servir", "l2": "servir"}, 
    {"l1": " si", "l2": "si"}, 
    {"l1": " sí", "l2": "oui"}, 
    {"l1": " sí", "l2": "se"}, 
    {"l1": " si no", "l2": "sinon"}, 
    {"l1": " si no", "l2": "mais"}, 
    {"l1": " siempre", "l2": "toujours"}, 
    {"l1": " siete", "l2": "sept"}, 
    {"l1": " significado", "l2": "sens"}, 
    {"l1": " significar", "l2": "signifier"}, 
    {"l1": " signo", "l2": "signe"}, 
    {"l1": " siguiente", "l2": "prochain"}, 
    {"l1": " silencio", "l2": "silence"}, 
    {"l1": " simpático", "l2": "gentil"}, 
    {"l1": " simpático", "l2": "sympa"}, 
    {"l1": " simple", "l2": "simple"}, 
    {"l1": " simplemente", "l2": "simplement"}, 
    {"l1": " sin", "l2": "sans"}, 
    {"l1": " sin embargo", "l2": "pourtant"}, 
    {"l1": " sin embargo", "l2": "cependant"}, 
    {"l1": " sin embargo", "l2": "néanmoins"}, 
    {"l1": " sin incluir", "l2": "hors"}, 
    {"l1": " sin que", "l2": "sans que"}, 
    {"l1": " sino", "l2": "sinon"}, 
    {"l1": " sistema", "l2": "système"}, 
    {"l1": " sitio", "l2": "place"}, 
    {"l1": " situación", "l2": "situation"}, 
    {"l1": " sobre", "l2": "sur"}, 
    {"l1": " sobre todo", "l2": "surtout"}, 
    {"l1": " sociedad", "l2": "société"}, 
    {"l1": " sol", "l2": "soleil"}, 
    {"l1": " solamente", "l2": "seul"}, 
    {"l1": " solamente", "l2": "seulement"}, 
    {"l1": " soldado", "l2": "soldat"}, 
    {"l1": " solicitud", "l2": "demande"}, 
    {"l1": " sonar", "l2": "sonner"}, 
    {"l1": " soñar", "l2": "rêver"}, 
    {"l1": " soportar", "l2": "supporter"}, 
    {"l1": " sorpresa", "l2": "surprise"}, 
    {"l1": " souvenir", "l2": "souvenir"}, 
    {"l1": " su", "l2": "leur"}, 
    {"l1": " su", "l2": "leurs"}, 
    {"l1": " su", "l2": "sa"}, 
    {"l1": " su", "l2": "son"}, 
    {"l1": " suavemente", "l2": "doucement"}, 
    {"l1": " subir", "l2": "lever"}, 
    {"l1": " subir", "l2": "monter"}, 
    {"l1": " sucio", "l2": "sale"}, 
    {"l1": " sueño", "l2": "rêve"}, 
    {"l1": " suerte", "l2": "chance"}, 
    {"l1": " suficiente", "l2": "assez"}, 
    {"l1": " sufrir", "l2": "souffrir"}, 
    {"l1": " sujetar", "l2": "tenir"}, 
    {"l1": " súper", "l2": "super"}, 
    {"l1": " superar", "l2": "casser"}, 
    {"l1": " suponer", "l2": "supposer"}, 
    {"l1": " sus", "l2": "ses"}, 
    {"l1": " sus", "l2": "vos"}, 
    {"l1": " tal", "l2": "tel"}, 
    {"l1": " también", "l2": "aussi"}, 
    {"l1": " tan", "l2": "tant"}, 
    {"l1": " tan", "l2": "tellement"}, 
    {"l1": " tan bien como", "l2": "aussi bien que"}, 
    {"l1": " tanto", "l2": "tant"}, 
    {"l1": " tanto como", "l2": "autant"}, 
    {"l1": " tarde", "l2": "tard"}, 
    {"l1": " tarjeta", "l2": "carte"}, 
    {"l1": " te", "l2": "t’"}, 
    {"l1": " té", "l2": "thé"}, 
    {"l1": " tele", "l2": "télé"}, 
    {"l1": " teléfono", "l2": "téléphone"}, 
    {"l1": " tema", "l2": "sujet"}, 
    {"l1": " temer", "l2": "craindre"}, 
    {"l1": " temprano", "l2": "tôt"}, 
    {"l1": " tener", "l2": "avoir"}, 
    {"l1": " tener", "l2": "tenir"}, 
    {"l1": " tener éxito", "l2": "réussir"}, 
    {"l1": " tener que", "l2": "devoir"}, 
    {"l1": " tener que", "l2": "falloir"}, 
    {"l1": " teniente", "l2": "lieutenant"}, 
    {"l1": " terminar", "l2": "finir"}, 
    {"l1": " terminar", "l2": "terminer"}, 
    {"l1": " terrible", "l2": "terrible"}, 
    {"l1": " testigo", "l2": "témoin"}, 
    {"l1": " ti", "l2": "te"}, 
    {"l1": " ti", "l2": "toi"}, 
    {"l1": " tía", "l2": "tante"}, 
    {"l1": " tiempo", "l2": "temps"}, 
    {"l1": " tiene", "l2": "a"}, 
    {"l1": " tierra", "l2": "terre"}, 
    {"l1": " tío", "l2": "gars"}, 
    {"l1": " tío", "l2": "mec"}, 
    {"l1": " tío", "l2": "oncle"}, 
    {"l1": " tipo", "l2": "type"}, 
    {"l1": " tira", "l2": "bande"}, 
    {"l1": " tirar", "l2": "tirer"}, 
    {"l1": " tocar", "l2": "toucher"}, 
    {"l1": " tocar el timbre", "l2": "sonner"}, 
    {"l1": " toda", "l2": "toute"}, 
    {"l1": " todavia", "l2": "encore"}, 
    {"l1": " todavía", "l2": "encore"}, 
    {"l1": " todo", "l2": "tout"}, 
    {"l1": " todos", "l2": "tous"}, 
    {"l1": " tomar", "l2": "prendre"}, 
    {"l1": " tomar asiento", "l2": "asseoir"}, 
    {"l1": " tontería", "l2": "connerie"}, 
    {"l1": " tonto", "l2": "bête"}, 
    {"l1": " tonto", "l2": "con"}, 
    {"l1": " tonto", "l2": "idiot"}, 
    {"l1": " torpe", "l2": "gauche"}, 
    {"l1": " trabajar", "l2": "bosser"}, 
    {"l1": " trabajar", "l2": "travailler"}, 
    {"l1": " trabajo", "l2": "boulot"}, 
    {"l1": " trabajo", "l2": "travail"}, 
    {"l1": " traer", "l2": "amener"}, 
    {"l1": " tranquilo", "l2": "tranquille"}, 
    {"l1": " transcurrir", "l2": "passer"}, 
    {"l1": " transferir", "l2": "virer"}, 
    {"l1": " transportar", "l2": "emporter"}, 
    {"l1": " tras", "l2": "après"}, 
    {"l1": " tratar", "l2": "agir"}, 
    {"l1": " tratar", "l2": "traiter"}, 
    {"l1": " tratar de", "l2": "tenter"}, 
    {"l1": " tren", "l2": "train"}, 
    {"l1": " trepar", "l2": "monter"}, 
    {"l1": " tres", "l2": "trois"}, 
    {"l1": " tres palabras", "l2": "trois mots"}, 
    {"l1": " triste", "l2": "triste"}, 
    {"l1": " trozo", "l2": "morceau"}, 
    {"l1": " trozo", "l2": "part"}, 
    {"l1": " tu", "l2": "ta"}, 
    {"l1": " tu", "l2": "tu"}, 
    {"l1": " tú", "l2": "tu"}, 
    {"l1": " tus", "l2": "tes"}, 
    {"l1": " u", "l2": "ou"}, 
    {"l1": " últimamente", "l2": "récemment"}, 
    {"l1": " último", "l2": "dernier"}, 
    {"l1": " un", "l2": "un"}, 
    {"l1": " una", "l2": "une"}, 
    {"l1": " unas", "l2": "des"}, 
    {"l1": " único", "l2": "seul"}, 
    {"l1": " uno", "l2": "l’un"}, 
    {"l1": " uno", "l2": "un"}, 
    {"l1": " unos", "l2": "des"}, 
    {"l1": " usted", "l2": "vous"}, 
    {"l1": " utilizar", "l2": "utiliser"}, 
    {"l1": " vacante", "l2": "vacance"}, 
    {"l1": " vacío", "l2": "vacance"}, 
    {"l1": " valentía", "l2": "courage"}, 
    {"l1": " valer", "l2": "valoir"}, 
    {"l1": " varios", "l2": "plusieurs"}, 
    {"l1": " varios", "l2": "suite"}, 
    {"l1": " velada", "l2": "soirée"}, 
    {"l1": " vencer", "l2": "casser"}, 
    {"l1": " vender", "l2": "vendre"}, 
    {"l1": " venir", "l2": "venir"}, 
    {"l1": " ventana", "l2": "fenêtre"}, 
    {"l1": " ver", "l2": "voir"}, 
    {"l1": " verano", "l2": "été"}, 
    {"l1": " verdad", "l2": "vérité"}, 
    {"l1": " verdad", "l2": "vrai"}, 
    {"l1": " verdadero", "l2": "vrai"}, 
    {"l1": " vergüenza", "l2": "honte"}, 
    {"l1": " verificar", "l2": "vérifier"}, 
    {"l1": " vestido", "l2": "robe"}, 
    {"l1": " vez", "l2": "fois"}, 
    {"l1": " vía", "l2": "via"}, 
    {"l1": " viaje", "l2": "tour"}, 
    {"l1": " viaje", "l2": "voyage"}, 
    {"l1": " víctima", "l2": "victime"}, 
    {"l1": " vida", "l2": "vie"}, 
    {"l1": " vidrio", "l2": "verre"}, 
    {"l1": " viejo", "l2": "vieux"}, 
    {"l1": " viento", "l2": "vent"}, 
    {"l1": " viernes", "l2": "vendredi"}, 
    {"l1": " vigilar", "l2": "ficher"}, 
    {"l1": " vigilar", "l2": "surveiller"}, 
    {"l1": " vino", "l2": "vin"}, 
    {"l1": " visita", "l2": "visite"}, 
    {"l1": " vista", "l2": "vue"}, 
    {"l1": " viviente", "l2": "vivant"}, 
    {"l1": " vivir", "l2": "habiter"}, 
    {"l1": " vivir", "l2": "vivre"}, 
    {"l1": " volar", "l2": "voler"}, 
    {"l1": " volver", "l2": "retourner"}, 
    {"l1": " volver a", "l2": "rentrer"}, 
    {"l1": " volver a llamar", "l2": "rappeler"}, 
    {"l1": " volver a poner", "l2": "remettre"}, 
    {"l1": " volver a subir", "l2": "remonter"}, 
    {"l1": " volver a ver", "l2": "revoir"}, 
    {"l1": " vosotros", "l2": "vous"}, 
    {"l1": " voz", "l2": "voix"}, 
    {"l1": " vuelta", "l2": "tour"}, 
    {"l1": " vuestros", "l2": "vos"}, 
    {"l1": " y", "l2": "et"}, 
    {"l1": " y después", "l2": "et puis"}, 
    {"l1": " y luego", "l2": "et puis"}, 
    {"l1": " ya", "l2": "déjà"}, 
    {"l1": " ya qué", "l2": "car"}, 
    {"l1": " yo", "l2": "je"}, 
    {"l1": " yo mismo", "l2": "moi-même"}, 
    {"l1": " zapato", "l2": "chaussure"}, 
    {"l1": " zorra", "l2": "salope"}
  ]
}
