{
  "data": [
    {
      "rooms": 5,
      "bonus": {
        "kind_ratio": 0.5,
        "range_rest": [
          1,
          2
        ],
        "range_damage": [
          1,
          2
        ]
      },
      "mobs": [
        "z_virus"
      ]
    },
    {
      "rooms": 8,
      "bonus": {
        "kind_ratio": 0.5,
        "range_rest": [
          1,
          3
        ],
        "range_damage": [
          1,
          2
        ]
      },
      "mobs": [
        "z_virus",
        "flesh_eater"
      ]
    },
    {
      "rooms": 10,
      "bonus": {
        "kind_ratio": 0.6,
        "range_rest": [
          1,
          3
        ],
        "range_damage": [
          1,
          3
        ]
      },
      "mobs": [
        "flesh_eater",
        "spring_virus"
      ]
    },
    {
      "rooms": 12,
      "bonus": {
        "kind_ratio": 0.6,
        "range_rest": [
          1,
          4
        ],
        "range_damage": [
          1,
          3
        ]
      },
      "mobs": [
        "flesh_eater",
        "spring_virus",
        "t_virus"
      ]
    },
    {
      "rooms": 15,
      "bonus": {
        "kind_ratio": 0.7,
        "range_rest": [
          1,
          4
        ],
        "range_damage": [
          1,
          4
        ]
      },
      "mobs": [
        "spring_virus",
        "t_virus",
        "borax"
      ]
    },
    {
      "rooms": 15,
      "bonus": {
        "kind_ratio": 0.5,
        "range_rest": [
          2,
          3
        ],
        "range_damage": [
          1,
          3
        ]
      },
      "mobs": [
        "lis"
      ]
    },
    {
      "rooms": 17,
      "bonus": {
        "kind_ratio": 0.6,
        "range_rest": [
          2,
          4
        ],
        "range_damage": [
          1,
          3
        ]
      },
      "mobs": [
        "lis",
        "heg"
      ]
    },
    {
      "rooms": 20,
      "bonus": {
        "kind_ratio": 0.7,
        "range_rest": [
          2,
          5
        ],
        "range_damage": [
          1,
          3
        ]
      },
      "mobs": [
        "heg",
        "pte"
      ]
    },
    {
      "rooms": 23,
      "bonus": {
        "kind_ratio": 0.7,
        "range_rest": [
          3,
          5
        ],
        "range_damage": [
          1,
          4
        ]
      },
      "mobs": [
        "heg",
        "pte",
        "tri"
      ]
    },
    {
      "rooms": 25,
      "bonus": {
        "kind_ratio": 0.8,
        "range_rest": [
          3,
          5
        ],
        "range_damage": [
          1,
          5
        ]
      },
      "mobs": [
        "pte",
        "tri",
        "rex"
      ]
    }
  ]
}
