digraph gem {
	compound=true
	rankdir=LR
	node [shape=record style=rounded]

	subgraph cluster1 {
		in_string [label="String"]
		in_file [label="File"]
		subgraph cluster2 {
			in_files	[label="Files"]
			label="stdin"
		}
		label="inputs"
		fontname=mono
	}
	
	subgraph cluster3 {
		cli_program [label="{<c1>syntaxchecker | {ARGV | help | <c3>path/to/files}}"]
		label="cli"
		fontname=mono
	}

	subgraph cluster4 {
		module [label="SyntaxChecker"]
		class1 [label="::Get"]
		class2 [label="::Test"]
		class3 [label="::Rule"]
		class4 [label="::Dictionary"]
		class5 [label="::Printer"]
		label="gem"
		fontname=mono
	}
	
	subgraph cluster5 {
		out_callback [label="Callback"]
		label="outputs"
		fontname=mono
		subgraph cluster6 {
			out_file [label="\>File"]
			out_string [label="String"]
			label="stdout"
			fontname=mono
		}
	}
	
	in_files -> cli_program:c3 [ltail="cluster2"]
	cli_program:c1 -> module
	in_file -> module [ltail="cluster1"]
	module -> {class1 class2 class3 class4 class5}
	{class1 class3} -> class2
	class4 -> class3
	class2 -> class5
	class2 -> out_callback
	class5 -> out_string [lhead="cluster6"]
}