<?xml version="1.0" encoding="UTF-8" standalone="no"?>
<!-- Created with Inkscape (http://www.inkscape.org/) -->

<svg
   xmlns:dc="http://purl.org/dc/elements/1.1/"
   xmlns:cc="http://creativecommons.org/ns#"
   xmlns:rdf="http://www.w3.org/1999/02/22-rdf-syntax-ns#"
   xmlns:svg="http://www.w3.org/2000/svg"
   xmlns="http://www.w3.org/2000/svg"
   xmlns:sodipodi="http://sodipodi.sourceforge.net/DTD/sodipodi-0.dtd"
   xmlns:inkscape="http://www.inkscape.org/namespaces/inkscape"
   width="760"
   height="730"
   viewBox="0 0 201.08334 193.14585"
   version="1.1"
   id="svg8"
   inkscape:version="0.92.4 5da689c313, 2019-01-14"
   sodipodi:docname="p001_i002_en.svg"
   inkscape:export-filename="/home/nika-zhenya/Repositorios/perro-tuerto/publishing-is-coding/img/001_img002.png"
   inkscape:export-xdpi="100"
   inkscape:export-ydpi="100">
  <defs
     id="defs2" />
  <sodipodi:namedview
     id="base"
     pagecolor="#ffffff"
     bordercolor="#666666"
     borderopacity="1.0"
     inkscape:pageopacity="0"
     inkscape:pageshadow="2"
     inkscape:zoom="0.7"
     inkscape:cx="83.616337"
     inkscape:cy="525.97557"
     inkscape:document-units="mm"
     inkscape:current-layer="layer1"
     showgrid="false"
     inkscape:window-width="1920"
     inkscape:window-height="1016"
     inkscape:window-x="0"
     inkscape:window-y="27"
     inkscape:window-maximized="1"
     units="px" />
  <metadata
     id="metadata5">
    <rdf:RDF>
      <cc:Work
         rdf:about="">
        <dc:format>image/svg+xml</dc:format>
        <dc:type
           rdf:resource="http://purl.org/dc/dcmitype/StillImage" />
        <dc:title></dc:title>
      </cc:Work>
    </rdf:RDF>
  </metadata>
  <g
     inkscape:label="Capa 1"
     inkscape:groupmode="layer"
     id="layer1"
     transform="translate(0,-103.85414)">
    <g
       id="g896">
      <circle
         style="opacity:1;fill:#ff0000;fill-opacity:0.39215686;stroke:#000000;stroke-width:1.32291663;stroke-miterlimit:4;stroke-dasharray:none;stroke-dashoffset:0;stroke-opacity:1"
         id="circle882"
         cx="69.736603"
         cy="173.66635"
         r="61.459846" />
      <circle
         r="61.459846"
         cy="174.04433"
         cx="131.34673"
         id="circle884"
         style="opacity:1;fill:#00ff00;fill-opacity:0.39215686;stroke:#000000;stroke-width:1.32291663;stroke-miterlimit:4;stroke-dasharray:none;stroke-dashoffset:0;stroke-opacity:1" />
      <circle
         r="61.459846"
         cy="227.18776"
         cx="100.88184"
         id="path880"
         style="opacity:1;fill:#0000ff;fill-opacity:0.39215686;stroke:#000000;stroke-width:1.32291663;stroke-miterlimit:4;stroke-dasharray:none;stroke-dashoffset:0;stroke-opacity:1" />
      <circle
         style="opacity:1;fill:#0000ff;fill-opacity:0;stroke:#000000;stroke-width:1.32291663;stroke-miterlimit:4;stroke-dasharray:none;stroke-dashoffset:0;stroke-opacity:1"
         id="circle866"
         cx="100.88184"
         cy="227.18776"
         r="61.459846" />
      <circle
         r="61.459846"
         cy="173.66635"
         cx="69.736603"
         id="circle868"
         style="opacity:1;fill:#ff0000;fill-opacity:0;stroke:#000000;stroke-width:1.32291663;stroke-miterlimit:4;stroke-dasharray:none;stroke-dashoffset:0;stroke-opacity:1" />
      <circle
         style="opacity:1;fill:#00ff00;fill-opacity:0;stroke:#000000;stroke-width:1.32291663;stroke-miterlimit:4;stroke-dasharray:none;stroke-dashoffset:0;stroke-opacity:1"
         id="circle870"
         cx="131.34673"
         cy="174.04433"
         r="61.459846" />
    </g>
    <g
       id="g915">
      <text
         xml:space="preserve"
         style="font-style:normal;font-variant:normal;font-weight:normal;font-stretch:normal;font-size:1.41111112px;line-height:1.25;font-family:Cocogoose;-inkscape-font-specification:Cocogoose;letter-spacing:0px;word-spacing:0px;fill:#000000;fill-opacity:1;stroke:none;stroke-width:0.26458332"
         x="87.274712"
         y="263.47348"
         id="text897"><tspan
           sodipodi:role="line"
           id="tspan895"
           x="87.274712"
           y="263.47348"
           style="font-size:7.05555534px;stroke-width:0.26458332">Politics</tspan></text>
      <text
         id="text893"
         y="159.15205"
         x="20.372923"
         style="font-style:normal;font-variant:normal;font-weight:normal;font-stretch:normal;font-size:1.41111112px;line-height:1.25;font-family:Cocogoose;-inkscape-font-specification:Cocogoose;letter-spacing:0px;word-spacing:0px;fill:#000000;fill-opacity:1;stroke:none;stroke-width:0.26458332"
         xml:space="preserve"><tspan
           style="font-size:7.05555534px;stroke-width:0.26458332"
           y="159.15205"
           x="20.372923"
           id="tspan891"
           sodipodi:role="line">Publishing</tspan></text>
      <text
         xml:space="preserve"
         style="font-style:normal;font-variant:normal;font-weight:normal;font-stretch:normal;font-size:1.41111112px;line-height:1.25;font-family:Cocogoose;-inkscape-font-specification:Cocogoose;letter-spacing:0px;word-spacing:0px;fill:#000000;fill-opacity:1;stroke:none;stroke-width:0.26458332"
         x="160.06851"
         y="150.83658"
         id="text901"><tspan
           sodipodi:role="line"
           id="tspan899"
           x="160.06851"
           y="150.83658"
           style="font-size:7.05555534px;text-align:center;text-anchor:middle;stroke-width:0.26458332">Free</tspan><tspan
           id="tspan903"
           sodipodi:role="line"
           x="160.06851"
           y="159.65602"
           style="font-size:7.05555534px;text-align:center;text-anchor:middle;stroke-width:0.26458332">software</tspan></text>
      <text
         id="text907"
         y="150.4586"
         x="83.494942"
         style="font-style:normal;font-variant:normal;font-weight:normal;font-stretch:normal;font-size:1.41111112px;line-height:1.25;font-family:Cocogoose;-inkscape-font-specification:Cocogoose;letter-spacing:0px;word-spacing:0px;fill:#000000;fill-opacity:1;stroke:none;stroke-width:0.26458332"
         xml:space="preserve"><tspan
           style="font-size:4.23333311px;stroke-width:0.26458332"
           y="150.4586"
           x="83.494942"
           id="tspan905"
           sodipodi:role="line">Publishing with</tspan><tspan
           id="tspan940"
           style="font-size:4.23333311px;stroke-width:0.26458332"
           y="155.75026"
           x="83.494942"
           sodipodi:role="line">free software</tspan></text>
      <text
         xml:space="preserve"
         style="font-style:normal;font-variant:normal;font-weight:normal;font-stretch:normal;font-size:1.41111112px;line-height:1.25;font-family:Cocogoose;-inkscape-font-specification:Cocogoose;letter-spacing:0px;word-spacing:0px;fill:#000000;fill-opacity:1;stroke:none;stroke-width:0.26458332"
         x="53.63483"
         y="209.04491"
         id="text911"><tspan
           sodipodi:role="line"
           id="tspan909"
           x="53.63483"
           y="209.04491"
           style="font-size:4.23333311px;stroke-width:0.26458332">Cultural</tspan><tspan
           id="tspan942"
           sodipodi:role="line"
           x="53.63483"
           y="214.33658"
           style="font-size:4.23333311px;stroke-width:0.26458332">policies</tspan></text>
      <text
         id="text915"
         y="215.4705"
         x="125.45031"
         style="font-style:normal;font-variant:normal;font-weight:normal;font-stretch:normal;font-size:1.41111112px;line-height:1.25;font-family:Cocogoose;-inkscape-font-specification:Cocogoose;letter-spacing:0px;word-spacing:0px;fill:#000000;fill-opacity:1;stroke:none;stroke-width:0.26458332"
         xml:space="preserve"><tspan
           style="font-size:4.23333311px;stroke-width:0.26458332"
           y="215.4705"
           x="125.45031"
           id="tspan913"
           sodipodi:role="line">Hacktivism</tspan></text>
      <text
         xml:space="preserve"
         style="font-style:normal;font-variant:normal;font-weight:normal;font-stretch:normal;font-size:1.41111112px;line-height:1.25;font-family:Cocogoose;-inkscape-font-specification:Cocogoose;letter-spacing:0px;word-spacing:0px;fill:#000000;fill-opacity:1;stroke:none;stroke-width:0.26458332"
         x="81.669365"
         y="195.98425"
         id="text938"><tspan
           sodipodi:role="line"
           id="tspan936"
           x="81.669365"
           y="195.98425"
           style="font-size:4.23333311px;stroke-width:0.26458332">Free publishing</tspan></text>
    </g>
  </g>
</svg>
