{
  "name": "pecas-menu",
  "description": "Emulate ereader navigation on any HTML file",
  "filename": "pecas-menu.min.js",
  "repository": {
    "type": "git",
    "url": "https://gitlab.com/programando-libreros/herramientas/pecas-reader"
  },
  "keywords": [
    "pecas-menu",
    "pecas",
    "libro",
    "libros",
    "libro electrónico",
    "lector",
    "book",
    "books",
    "ebook",
    "ereader",
    "navegación",
    "nav",
    "navigation",
    "índice",
    "toc",
    "edición",
    "publishing"
  ],
  "autoupdate": {
    "source": "git",
    "target": "git://gitlab.com/programando-libreros/herramientas/pecas-reader.git",
    "fileMap": [
      {
        "basePath": "dist",
        "files": "**/*"
      }
    ]
  },
  "license": "GPL",
  "authors": [
    {
      "name": "Nika Zhenya",
      "email": "hi@perrotuerto.blog",
      "homepage": "https://perrotuerto.blog",
      "gitlab": "NikaZhenya"
    }
  ]
}