[
  {
    "e": "Universidad Nacional Autónoma de México",
    "i": 865
  },
  {
    "e": "Penguin Random House Grupo Editorial",
    "i": 785
  },
  {
    "e": "Pearson Educación de México",
    "i": 685
  },
  {
    "e": "SM de Ediciones",
    "i": 466
  },
  {
    "e": "Editorial Trillas",
    "i": 363
  },
  {
    "e": "Santillana Ediciones Generales",
    "i": 333
  },
  {
    "e": "Editorial Santillana",
    "i": 327
  },
  {
    "e": "Dirección General de Materiales Educativos",
    "i": 302
  },
  {
    "e": "Editores Mexicanos Unidos",
    "i": 277
  },
  {
    "e": "Editorial Porrúa",
    "i": 271
  },
  {
    "e": "Richmond Publishing",
    "i": 262
  },
  {
    "e": "Editorial Planeta Mexicana",
    "i": 228
  },
  {
    "e": "Consejo Nacional para la Cultura y las Artes",
    "i": 227
  },
  {
    "e": "Cengage Learning Editores",
    "i": 221
  },
  {
    "e": "Universidad Autónoma Metropolitana",
    "i": 210
  },
  {
    "e": "Macmillan Publishers",
    "i": 207
  },
  {
    "e": "Editorial Progreso",
    "i": 194
  },
  {
    "e": "Instituto Nacional de Investigaciones Forestales Agrícolas y Pecuarias",
    "i": 186
  },
  {
    "e": "Universidad de Guadalajara",
    "i": 173
  },
  {
    "e": "Universidad Autónoma de Nuevo León",
    "i": 173
  },
  {
    "e": "Ediciones Larousse",
    "i": 169
  },
  {
    "e": "Ediciones Castillo",
    "i": 163
  },
  {
    "e": "Alfaomega Grupo Editor",
    "i": 163
  },
  {
    "e": "Editorial Océano México",
    "i": 150
  },
  {
    "e": "Benemérita Universidad Autónoma de Puebla",
    "i": 150
  },
  {
    "e": "Ediciones Fiscales ISEF",
    "i": 145
  },
  {
    "e": "Editorial Limusa",
    "i": 142
  },
  {
    "e": "Grupo Editorial Patria",
    "i": 137
  },
  {
    "e": "Mc Graw-Hill Interamericana Editores",
    "i": 134
  },
  {
    "e": "Grupo Editorial Miguel Ángel Porrúa",
    "i": 134
  },
  {
    "e": "Instituto Politécnico Nacional",
    "i": 110
  },
  {
    "e": "Suprema Corte de Justicia de la Nación",
    "i": 104
  },
  {
    "e": "Plaza y Valdés",
    "i": 103
  },
  {
    "e": "Instituto Tecnológico y de Estudios Superiores de Monterrey",
    "i": 100
  },
  {
    "e": "Advanced Marketing",
    "i": 99
  },
  {
    "e": "Universidad Autónoma del Estado de Hidalgo",
    "i": 98
  },
  {
    "e": "Secretaría de Salud",
    "i": 97
  },
  {
    "e": "Panorama Editorial",
    "i": 91
  },
  {
    "e": "Intersistemas",
    "i": 90
  },
  {
    "e": "Book Mart",
    "i": 90
  },
  {
    "e": "Siglo XXI Editores",
    "i": 88
  },
  {
    "e": "El Colegio de México",
    "i": 87
  },
  {
    "e": "Agencia Promotora de Publicaciones",
    "i": 87
  },
  {
    "e": "Instituto Nacional de Estadística y Geografía",
    "i": 76
  },
  {
    "e": "Grupo Editorial Tomo",
    "i": 74
  },
  {
    "e": "Universidad Veracruzana",
    "i": 72
  },
  {
    "e": "Tax Editores Unidos",
    "i": 72
  },
  {
    "e": "La Torre del Vigía",
    "i": 72
  },
  {
    "e": "Asociación de Scouts de México",
    "i": 71
  },
  {
    "e": "Editorial Morevalladolid",
    "i": 70
  },
  {
    "e": "Alborez Garcia, Ricardo",
    "i": 70
  },
  {
    "e": "Fondo de Cultura Económica",
    "i": 68
  },
  {
    "e": "Editorial Andres Bello Mexicana",
    "i": 63
  },
  {
    "e": "Ediciones B México",
    "i": 63
  },
  {
    "e": "Oxford University Press México",
    "i": 62
  },
  {
    "e": "Instituto Nacional de Antropología e Historia",
    "i": 62
  },
  {
    "e": "Apoyo al Desarrollo de Archivos y Bibliotecas de México",
    "i": 62
  },
  {
    "e": "Innovación Editorial Lagares de México",
    "i": 61
  },
  {
    "e": "Guia Roji",
    "i": 61
  },
  {
    "e": "Editorial Nueva Palabra",
    "i": 61
  },
  {
    "e": "Fernández Educación",
    "i": 60
  },
  {
    "e": "Editorial El Arca",
    "i": 60
  },
  {
    "e": "Tribunal Electoral del Poder Judicial de la Federación",
    "i": 57
  },
  {
    "e": "Editorial Esfinge",
    "i": 56
  },
  {
    "e": "Universidad Autónoma del Estado de Baja California",
    "i": 55
  },
  {
    "e": "Umbral Editorial",
    "i": 55
  },
  {
    "e": "Dofiscal Editores",
    "i": 55
  },
  {
    "e": "Colofón",
    "i": 55
  },
  {
    "e": "Universidad Juárez del Estado de Durango",
    "i": 54
  },
  {
    "e": "Secretaría de Gobernación",
    "i": 54
  },
  {
    "e": "Educa Inventia",
    "i": 54
  },
  {
    "e": "Editorial Lectorum",
    "i": 54
  },
  {
    "e": "Editorial Nuevo Mexico",
    "i": 53
  },
  {
    "e": "Universidad Iberoamericana",
    "i": 52
  },
  {
    "e": "Universidad Autónoma Chapingo",
    "i": 52
  },
  {
    "e": "Instituto Nacional de Salud Pública",
    "i": 50
  },
  {
    "e": "Instituto Nacional de Bellas Artes y Literatura",
    "i": 50
  },
  {
    "e": "Universidad Autónoma de Coahuila",
    "i": 49
  },
  {
    "e": "Minos Tercer Milenio",
    "i": 49
  },
  {
    "e": "Editorial Cordillera de los Andes",
    "i": 49
  },
  {
    "e": "Centro de Investigaciones y Estudios Superiores en Antropología Social",
    "i": 49
  },
  {
    "e": "Selector",
    "i": 47
  },
  {
    "e": "Fondo Editorial de Nuevo León",
    "i": 46
  },
  {
    "e": "Artes de México y del Mundo",
    "i": 46
  },
  {
    "e": "Universidad Autónoma del Estado de México",
    "i": 44
  },
  {
    "e": "Editorial Alfil",
    "i": 44
  },
  {
    "e": "Juan Pablos Editor",
    "i": 43
  },
  {
    "e": "Instituto Internacional de Investigación de Tecnología Educativa",
    "i": 43
  },
  {
    "e": "Editorial Jus",
    "i": 43
  },
  {
    "e": "Ediciones Paulinas",
    "i": 43
  },
  {
    "e": "Movimiento Ciudadano (Partido Político Nacional)",
    "i": 41
  },
  {
    "e": "Editorial Themis",
    "i": 41
  },
  {
    "e": "Ediciones y Gráficos Eón",
    "i": 40
  },
  {
    "e": "Instituto Estatal de las Mujeres",
    "i": 39
  },
  {
    "e": "ST Distribución",
    "i": 37
  },
  {
    "e": "El Colegio Nacional",
    "i": 37
  },
  {
    "e": "Universidad de Ciencias y Artes de Chiapas",
    "i": 36
  },
  {
    "e": "Universidad de Colima",
    "i": 35
  },
  {
    "e": "Universidad Pedagógica Nacional",
    "i": 35
  },
  {
    "e": "Universidad Autónoma de Ciudad Juárez",
    "i": 34
  },
  {
    "e": "Universidad Autónoma de Chihuahua",
    "i": 34
  },
  {
    "e": "Editorial Terracota",
    "i": 34
  },
  {
    "e": "Editorial El Manual Moderno",
    "i": 34
  },
  {
    "e": "Secretaría de Cultura de Michoacán",
    "i": 33
  },
  {
    "e": "Ediciones Punto Fijo",
    "i": 33
  },
  {
    "e": "Nostra Ediciones",
    "i": 32
  },
  {
    "e": "El Colegio de Michoacán",
    "i": 32
  },
  {
    "e": "Jaramillo Mejía, Ana María",
    "i": 31
  },
  {
    "e": "Universidad Autónoma de la Ciudad de México",
    "i": 30
  },
  {
    "e": "Universidad Autónoma de Querétaro",
    "i": 30
  },
  {
    "e": "Editorial RM",
    "i": 30
  },
  {
    "e": "Solar, Servicios Editoriales",
    "i": 29
  },
  {
    "e": "Universidad Autónoma de Guerrero",
    "i": 28
  },
  {
    "e": "Universidad Autónoma de Aguascalientes",
    "i": 28
  },
  {
    "e": "Obra Nacional de la Buena Prensa",
    "i": 28
  },
  {
    "e": "Mendoza Ruiz, Fortino Ramón",
    "i": 28
  },
  {
    "e": "Ediciones Tecolote",
    "i": 28
  },
  {
    "e": "Comisión Nacional de los Derechos Humanos",
    "i": 28
  },
  {
    "e": "Secretaría de Educación del Gobierno del Estado de México",
    "i": 27
  },
  {
    "e": "Instituto Tecnológico y de Estudios Superiores de Occidente",
    "i": 27
  },
  {
    "e": "VR Editoras",
    "i": 26
  },
  {
    "e": "Secretaría de Cultura del Estado de México",
    "i": 26
  },
  {
    "e": "Ediciones Viman",
    "i": 26
  },
  {
    "e": "Consejo de Ciencia y Tecnología del Estado de Querétaro",
    "i": 26
  },
  {
    "e": "CL Editorial Praxis",
    "i": 26
  },
  {
    "e": "Secretaría de Cultura de Chihuahua",
    "i": 25
  },
  {
    "e": "Mundilibros",
    "i": 25
  },
  {
    "e": "Editorial Almadia",
    "i": 25
  },
  {
    "e": "Universidad de Guanajuato",
    "i": 24
  },
  {
    "e": "Secretaría de Cultura del Gobierno del Distrito Federal",
    "i": 24
  },
  {
    "e": "Instituto Tecnológico de Sonora",
    "i": 24
  },
  {
    "e": "Gutierrez Ramirez, Alfredo",
    "i": 24
  },
  {
    "e": "Universidad de Sonora",
    "i": 23
  },
  {
    "e": "Universidad Autónoma de Tlaxcala",
    "i": 23
  },
  {
    "e": "Tellez Reyes, Armando",
    "i": 23
  },
  {
    "e": "Hamui Picciotto, Jeannette",
    "i": 23
  },
  {
    "e": "Grupo Educare",
    "i": 23
  },
  {
    "e": "Fernández Educacion",
    "i": 23
  },
  {
    "e": "El Colegio de la Frontera Norte",
    "i": 23
  },
  {
    "e": "Editorial Alfa Futuro",
    "i": 23
  },
  {
    "e": "Editorial  Lumen",
    "i": 23
  },
  {
    "e": "Colmenares y Vargas, Octavio Antonio",
    "i": 23
  },
  {
    "e": "Nexos-Sociedad, Ciencia y Literatura",
    "i": 22
  },
  {
    "e": "Instituto Carlos Slim de la Salud",
    "i": 22
  },
  {
    "e": "Editorial Ediciones Escolares de Occidente",
    "i": 22
  },
  {
    "e": "Ediciones Dabar",
    "i": 22
  },
  {
    "e": "Zurita Campos, Jaime Manuel",
    "i": 21
  },
  {
    "e": "Universidad Autónoma de Chiapas",
    "i": 21
  },
  {
    "e": "Comisión Nacional para el Conocimiento y Uso de la Biodiversidad",
    "i": 21
  },
  {
    "e": "Agencia de Publicaciones México Central",
    "i": 21
  },
  {
    "e": "Universidad Juárez Autónoma de Tabasco",
    "i": 20
  },
  {
    "e": "Universidad Autónoma de Yucatán",
    "i": 20
  },
  {
    "e": "Subsecretaría del Desarrollo Artesanal",
    "i": 20
  },
  {
    "e": "Secretaría de Turismo y Cultura del Poder Ejecutivo del Gobierno del Estado de Morelos",
    "i": 20
  },
  {
    "e": "Facultad Latinoamericana de Ciencias Sociales",
    "i": 20
  },
  {
    "e": "Compañía Inmobiliaria La Campana",
    "i": 20
  },
  {
    "e": "Armenta Malpica, Luis",
    "i": 20
  },
  {
    "e": "PLM México",
    "i": 19
  },
  {
    "e": "Instituto Nacional para la Evaluación de la Educación",
    "i": 19
  },
  {
    "e": "Gobierno del Estado de Puebla",
    "i": 19
  },
  {
    "e": "Flores Editor y Distribuidor",
    "i": 19
  },
  {
    "e": "U.D. Publishing",
    "i": 18
  },
  {
    "e": "Medina Gómez, Patricia",
    "i": 18
  },
  {
    "e": "Instituto Nacional de las Mujeres",
    "i": 18
  },
  {
    "e": "Fomento Cultural Banamex",
    "i": 18
  },
  {
    "e": "Ediciones Era",
    "i": 18
  },
  {
    "e": "Colegio de Postgraduados",
    "i": 18
  },
  {
    "e": "Universidad de Quintana Roo",
    "i": 17
  },
  {
    "e": "Universidad Autónoma Agraria Antonio Narro",
    "i": 17
  },
  {
    "e": "Sistemas de Información Contable y Administrativa Computarizados",
    "i": 17
  },
  {
    "e": "Proveedora Gráfica de Oaxaca",
    "i": 17
  },
  {
    "e": "Mercamétrica Ediciones",
    "i": 17
  },
  {
    "e": "La Cabra Ediciones",
    "i": 17
  },
  {
    "e": "Gobierno del Estado de Guanajuato",
    "i": 17
  },
  {
    "e": "Ediciones Excelencia",
    "i": 17
  },
  {
    "e": "Compañía Editorial Nueva Imagen",
    "i": 17
  },
  {
    "e": "Azafrán y Cinabrio",
    "i": 17
  },
  {
    "e": "Astra Ediciones",
    "i": 17
  },
  {
    "e": "Universidad Autónoma del Estado de Morelos",
    "i": 16
  },
  {
    "e": "Sánchez Jiménez, Miguel Ángel",
    "i": 16
  },
  {
    "e": "Publicaciones Administrativas Contables Jurídicas",
    "i": 16
  },
  {
    "e": "Fierro Villavicencio, Merari",
    "i": 16
  },
  {
    "e": "El Colegio de la Frontera Sur",
    "i": 16
  },
  {
    "e": "Editorial Pax México, Librería Carlos Cesarman",
    "i": 16
  },
  {
    "e": "Ediciones Leyenda",
    "i": 16
  },
  {
    "e": "Ediciones Culturales Internacionales",
    "i": 16
  },
  {
    "e": "Dirección General de Educación en Ciencia y Tecnología del Mar",
    "i": 16
  },
  {
    "e": "Universidad Autónoma de San Luis Potosí",
    "i": 15
  },
  {
    "e": "Instituto Mexicano de Contadores Públicos",
    "i": 15
  },
  {
    "e": "Instituto Electoral de la Ciudad de México",
    "i": 15
  },
  {
    "e": "Editorial Prado",
    "i": 15
  },
  {
    "e": "Editorial Dante",
    "i": 15
  },
  {
    "e": "Ediciones Urano de México",
    "i": 15
  },
  {
    "e": "Dirección General de Desarrollo Curricular SEP",
    "i": 15
  },
  {
    "e": "Cidcli",
    "i": 15
  },
  {
    "e": "Secretaría del Trabajo y Previsión Social",
    "i": 14
  },
  {
    "e": "Méndez Editores",
    "i": 14
  },
  {
    "e": "Moreno Soto, David",
    "i": 14
  },
  {
    "e": "Global Business University",
    "i": 14
  },
  {
    "e": "Ficticia",
    "i": 14
  },
  {
    "e": "Editorial Jurídica de las Américas",
    "i": 14
  },
  {
    "e": "Editorial Eman",
    "i": 14
  },
  {
    "e": "Editorial Alba",
    "i": 14
  },
  {
    "e": "Ediciones Selectas Diamante",
    "i": 14
  },
  {
    "e": "Ediciones ILCSA",
    "i": 14
  },
  {
    "e": "Ediciones Euroméxico",
    "i": 14
  },
  {
    "e": "Casa Aldo Manuzio",
    "i": 14
  },
  {
    "e": "Sotirova Zlateva, Vania",
    "i": 13
  },
  {
    "e": "Secretaría de Hacienda y Credito Publico/ Unidad de Comunicacion Social y Vocero",
    "i": 13
  },
  {
    "e": "Navarro Cruz, Jorge Raúl",
    "i": 13
  },
  {
    "e": "Municipio de Mérida Yucatán",
    "i": 13
  },
  {
    "e": "Instituto Sinaloense de Cultura",
    "i": 13
  },
  {
    "e": "Editorial Santa Teresa México",
    "i": 13
  },
  {
    "e": "Editora del Gobierno del Estado Libre y Soberano de Veracruz Llave",
    "i": 13
  },
  {
    "e": "Consejo Nacional de Fomento Educativo",
    "i": 13
  },
  {
    "e": "Bonilla Artigas Editores",
    "i": 13
  },
  {
    "e": "Asociación Nacional de Universidades e Instituciones de Educación Superior de la República",
    "i": 13
  },
  {
    "e": "Andraval Ediciones",
    "i": 13
  },
  {
    "e": "Trilce Ediciones",
    "i": 12
  },
  {
    "e": "Secretaría de las Culturas y Artes del Gobierno del Estado de Oaxaca",
    "i": 12
  },
  {
    "e": "Poder Ejecutivo del Estado de Querétaro",
    "i": 12
  },
  {
    "e": "Plazas Belausteguigoitia, Maite",
    "i": 12
  },
  {
    "e": "Instituto Hidalguense de las Mujeres",
    "i": 12
  },
  {
    "e": "Instituto Cultural de Aguascalientes",
    "i": 12
  },
  {
    "e": "Grupo Azabache",
    "i": 12
  },
  {
    "e": "Estrada San Miguel, Francisco Javier",
    "i": 12
  },
  {
    "e": "El Colegio de San Luis",
    "i": 12
  },
  {
    "e": "Editorial Legis de Mexico",
    "i": 12
  },
  {
    "e": "Editora Laguna",
    "i": 12
  },
  {
    "e": "Ediciones Quinto Sol",
    "i": 12
  },
  {
    "e": "Ediciones Libuk",
    "i": 12
  },
  {
    "e": "Ediciones El Naranjo",
    "i": 12
  },
  {
    "e": "Ediciones Culturales Paidós",
    "i": 12
  },
  {
    "e": "Edere",
    "i": 12
  },
  {
    "e": "Eddiver",
    "i": 12
  },
  {
    "e": "Cofradía de Coyotes",
    "i": 12
  },
  {
    "e": "Suárez Arriaga, Amelia",
    "i": 11
  },
  {
    "e": "Regina Editores",
    "i": 11
  },
  {
    "e": "Olguín Reza, Hermenegildo",
    "i": 11
  },
  {
    "e": "Mendoza Lara, José",
    "i": 11
  },
  {
    "e": "Instituto de Investigaciones Dr. José María Luis Mora",
    "i": 11
  },
  {
    "e": "Honorable Cámara de Diputados",
    "i": 11
  },
  {
    "e": "Editorial Sista",
    "i": 11
  },
  {
    "e": "Editorial Didáctica",
    "i": 11
  },
  {
    "e": "Editorial ACD",
    "i": 11
  },
  {
    "e": "Ediciones Juridicas Alma",
    "i": 11
  },
  {
    "e": "Dirección General de Formación Continua de Maestros en Servicio",
    "i": 11
  },
  {
    "e": "Consejo Estatal para la Cultura y las Artes de Hidalgo",
    "i": 11
  },
  {
    "e": "Centro Cultural de España en México",
    "i": 11
  },
  {
    "e": "AM Editores",
    "i": 11
  },
  {
    "e": "AGT Editor",
    "i": 11
  },
  {
    "e": "Unidos por la Lectura",
    "i": 10
  },
  {
    "e": "Torres, Jose Alfredo",
    "i": 10
  },
  {
    "e": "Suárez Sánchez, José María",
    "i": 10
  },
  {
    "e": "Navarro Ortega, Roberto",
    "i": 10
  },
  {
    "e": "Grupo Editorial Gudiño Cicero",
    "i": 10
  },
  {
    "e": "Gobierno del Estado de Tamaulipas",
    "i": 10
  },
  {
    "e": "El Colegio Mexiquense",
    "i": 10
  },
  {
    "e": "Editorial Serpentina",
    "i": 10
  },
  {
    "e": "Editorial Ges",
    "i": 10
  },
  {
    "e": "Editorial Everest Mexicana",
    "i": 10
  },
  {
    "e": "Editores e Impresores Profesionales EDIMPRO",
    "i": 10
  },
  {
    "e": "Ediciones Felou",
    "i": 10
  },
  {
    "e": "Documentacion y Estudios de Mujeres",
    "i": 10
  },
  {
    "e": "Corporativo Intermédica",
    "i": 10
  },
  {
    "e": "Comité Regional Norte de la Comisión Mexicana de Cooperación con la UNESCO",
    "i": 10
  },
  {
    "e": "Comisión de Derechos Humanos del Distrito Federal",
    "i": 10
  },
  {
    "e": "Centro de Estudios Filosóficos Políticos y Sociales Vicente Lombardo Toledano",
    "i": 10
  },
  {
    "e": "Vidales Delgado, Ismael",
    "i": 9
  },
  {
    "e": "Universidad Autónoma de Zacatecas",
    "i": 9
  },
  {
    "e": "Universidad Autónoma de Tamaulipas",
    "i": 9
  },
  {
    "e": "Universidad Autónoma de Nayarit",
    "i": 9
  },
  {
    "e": "Textofilia",
    "i": 9
  },
  {
    "e": "Secretaría de Cultura de Querétaro",
    "i": 9
  },
  {
    "e": "Pantoja de Luna, Jocelyn Alejandra",
    "i": 9
  },
  {
    "e": "Orendain Caldera, Jorge Antonio",
    "i": 9
  },
  {
    "e": "Montenegro Editores",
    "i": 9
  },
  {
    "e": "Instituto Mexicano de Tecnología del Agua",
    "i": 9
  },
  {
    "e": "Instituto Estatal de Educación Pública de Oaxaca",
    "i": 9
  },
  {
    "e": "El Colegio de Jalisco",
    "i": 9
  },
  {
    "e": "Editorial Médica Panamericana",
    "i": 9
  },
  {
    "e": "Ediciones y Distribuciones Universum",
    "i": 9
  },
  {
    "e": "Ediciones Papiro Omega",
    "i": 9
  },
  {
    "e": "Ediciones Del Lirio",
    "i": 9
  },
  {
    "e": "Ediciones Alborada",
    "i": 9
  },
  {
    "e": "Dimar Editores",
    "i": 9
  },
  {
    "e": "DGE Equilibrista",
    "i": 9
  },
  {
    "e": "Consejo para la Cultura y las Artes de Nuevo León",
    "i": 9
  },
  {
    "e": "Centro de Formación Integral a través del Deporte",
    "i": 9
  },
  {
    "e": "Capital BG",
    "i": 9
  },
  {
    "e": "Cabarga Sonnenberger, Alexandra Lucienne",
    "i": 9
  },
  {
    "e": "Arlequín Editorial y Servicios",
    "i": 9
  },
  {
    "e": "Ángel Solis, Juan Jesús",
    "i": 8
  },
  {
    "e": "Universidad Autónoma de Occidente",
    "i": 8
  },
  {
    "e": "Universidad Autónoma de Campeche",
    "i": 8
  },
  {
    "e": "Secretaría de Relaciones Exteriores",
    "i": 8
  },
  {
    "e": "Secretaría de Cultura de Quintana Roo",
    "i": 8
  },
  {
    "e": "Robles Gil, Patricio Roberto",
    "i": 8
  },
  {
    "e": "Quiñones Hernández, Luis Carlos",
    "i": 8
  },
  {
    "e": "Promoción de Arte Mexicano",
    "i": 8
  },
  {
    "e": "Procuraduría General de la República",
    "i": 8
  },
  {
    "e": "Petra Ediciones",
    "i": 8
  },
  {
    "e": "Neri Quevedo, Edgar",
    "i": 8
  },
  {
    "e": "Méndez Cortés Editores",
    "i": 8
  },
  {
    "e": "Multiguia Cultural",
    "i": 8
  },
  {
    "e": "Montiel & Soriano Editores",
    "i": 8
  },
  {
    "e": "Los Libros de Homero",
    "i": 8
  },
  {
    "e": "Lid Editorial Mexicana",
    "i": 8
  },
  {
    "e": "Instituto Nacional de Administración Pública",
    "i": 8
  },
  {
    "e": "Iniciativa Ciudadana y Desarrollo Social, INCIDE Social",
    "i": 8
  },
  {
    "e": "Imprejal",
    "i": 8
  },
  {
    "e": "Eugenia Montalván Proyectos Culturales",
    "i": 8
  },
  {
    "e": "El Colegio de Veracruz",
    "i": 8
  },
  {
    "e": "Educación y Cultura Asesoría y Promoción",
    "i": 8
  },
  {
    "e": "Editorial Diana",
    "i": 8
  },
  {
    "e": "Editores de Textos Mexicanos",
    "i": 8
  },
  {
    "e": "Cortés Arévalo, Saulo Alfredo",
    "i": 8
  },
  {
    "e": "Centro de Estudios para el Desarrollo Rural Sustentable y la Soberanía Alimentaria",
    "i": 8
  },
  {
    "e": "Centro de Estudios Monetarios Latinoamericanos",
    "i": 8
  },
  {
    "e": "Castro Mondragón, Alfredo",
    "i": 8
  },
  {
    "e": "Bravo Cortes, Braulio",
    "i": 8
  },
  {
    "e": "Bernal Trejo, Paola",
    "i": 8
  },
  {
    "e": "Asociación de Escritores de México",
    "i": 8
  },
  {
    "e": "Asociación Mexicana de Promoción y Cultura Social",
    "i": 8
  },
  {
    "e": "Arte y Escena Ediciones",
    "i": 8
  },
  {
    "e": "Archivo Histórico Municipal de Irapuato",
    "i": 8
  },
  {
    "e": "Visto Bueno Editores",
    "i": 7
  },
  {
    "e": "Universidad Popular Autónoma del Estado de Puebla",
    "i": 7
  },
  {
    "e": "Universidad Autónoma de Baja California Sur",
    "i": 7
  },
  {
    "e": "Tumbona Ediciones",
    "i": 7
  },
  {
    "e": "Taller de Comunicación Gráfica",
    "i": 7
  },
  {
    "e": "Ríos de Tinta",
    "i": 7
  },
  {
    "e": "Reyes González, Martín",
    "i": 7
  },
  {
    "e": "Publicaciones Paulinas",
    "i": 7
  },
  {
    "e": "Prometeo Editores",
    "i": 7
  },
  {
    "e": "Porrúa del Villar, Rosa Maria Guadalupe",
    "i": 7
  },
  {
    "e": "Organización Gráfica Lore",
    "i": 7
  },
  {
    "e": "Lopez Razgado, Maria Irma",
    "i": 7
  },
  {
    "e": "Instituto de Cultura de Baja California",
    "i": 7
  },
  {
    "e": "Instituto Nacional de Lenguas Indígenas",
    "i": 7
  },
  {
    "e": "Instituto Nacional de Ciencias Penales",
    "i": 7
  },
  {
    "e": "Instituto Literario de Veracruz",
    "i": 7
  },
  {
    "e": "Instituto Colimense de las Mujeres",
    "i": 7
  },
  {
    "e": "Instituto Aguascalentense de las Mujeres",
    "i": 7
  },
  {
    "e": "Flores Marquez, Eloisa",
    "i": 7
  },
  {
    "e": "Editorial Sexto Piso",
    "i": 7
  },
  {
    "e": "Editorial Imágenes de Sonora",
    "i": 7
  },
  {
    "e": "Editorial Clío, Libros y Videos",
    "i": 7
  },
  {
    "e": "Dirección General de Evalución de Politicas Educativas",
    "i": 7
  },
  {
    "e": "Consejo Mexicano para la Acreditación de la Educación Médica",
    "i": 7
  },
  {
    "e": "Centro Nacional de Prevención de Desastres",
    "i": 7
  },
  {
    "e": "Ambar Diseño",
    "i": 7
  },
  {
    "e": "Alvarez Serrano, Benito",
    "i": 7
  },
  {
    "e": "Academia Veracruzana de las Lenguas Indígenas",
    "i": 7
  },
  {
    "e": "Universidad Autónoma del Carmen",
    "i": 6
  },
  {
    "e": "Soto Icaza, Mónica",
    "i": 6
  },
  {
    "e": "Siddha Yoga Dham de México",
    "i": 6
  },
  {
    "e": "San Sebastián Méndez, Jaime Porfirio",
    "i": 6
  },
  {
    "e": "Resendiz Garcia, Ayax Alejandro",
    "i": 6
  },
  {
    "e": "Reflejo GM Medios",
    "i": 6
  },
  {
    "e": "Planeación Educación y Asesoría",
    "i": 6
  },
  {
    "e": "Pinacoteca 2000",
    "i": 6
  },
  {
    "e": "Peart Cuevas, Alejandra",
    "i": 6
  },
  {
    "e": "Palma Silva, Guillermo",
    "i": 6
  },
  {
    "e": "Olivares Correa, Marta",
    "i": 6
  },
  {
    "e": "Novelo Uribe, Ada Patricia",
    "i": 6
  },
  {
    "e": "Mundi-Prensa México",
    "i": 6
  },
  {
    "e": "Masferrer Kan, Elio Roberto",
    "i": 6
  },
  {
    "e": "Martínez Salgado, Víctor Manuel",
    "i": 6
  },
  {
    "e": "Libros de Sawade",
    "i": 6
  },
  {
    "e": "Instituto Sudcaliforniano de Cultura",
    "i": 6
  },
  {
    "e": "Flores Soria, Francisco",
    "i": 6
  },
  {
    "e": "El Colegio de Tlaxcala",
    "i": 6
  },
  {
    "e": "Editorial Verdehalago",
    "i": 6
  },
  {
    "e": "Editorial Triscele",
    "i": 6
  },
  {
    "e": "Editorial Sefirot",
    "i": 6
  },
  {
    "e": "Editorial Página Seis",
    "i": 6
  },
  {
    "e": "Editorial Picolo",
    "i": 6
  },
  {
    "e": "Editorial Cobrica",
    "i": 6
  },
  {
    "e": "Editorial Cervantes",
    "i": 6
  },
  {
    "e": "Ediciones Jirafa",
    "i": 6
  },
  {
    "e": "Edebé, Ediciones Internacionales",
    "i": 6
  },
  {
    "e": "Díaz Córdoba, Miriam de los Angeles",
    "i": 6
  },
  {
    "e": "De Letreo Ediciones",
    "i": 6
  },
  {
    "e": "Compañía Editorial de la Península",
    "i": 6
  },
  {
    "e": "Comisión Estatal de Derechos Humanos del Estado de San Luis Potosi",
    "i": 6
  },
  {
    "e": "Cerón Flores Rocío Jazmín",
    "i": 6
  },
  {
    "e": "Centro Toluqueño de Escritores",
    "i": 6
  },
  {
    "e": "Alternativas y Capacidades",
    "i": 6
  },
  {
    "e": "Alom Editores",
    "i": 6
  },
  {
    "e": "Alanis González, Amalia Cecilia",
    "i": 6
  },
  {
    "e": "Yussim Santoyo, Sergio Nicolas",
    "i": 5
  },
  {
    "e": "Tinoco Álvarez, Marco Antonio",
    "i": 5
  },
  {
    "e": "Sánchez Muñoz, Luis Manuel",
    "i": 5
  },
  {
    "e": "Sosa Fonseca, José Alfredo",
    "i": 5
  },
  {
    "e": "Servicios de Comunicación Empresarial",
    "i": 5
  },
  {
    "e": "Rebora Gomez, Roberto Eduardo",
    "i": 5
  },
  {
    "e": "Raynal Villaseñor, José Ángel",
    "i": 5
  },
  {
    "e": "Pérez Ocaña, Mariana",
    "i": 5
  },
  {
    "e": "ONG Contraloría Ciudadana para la Rendición de Cuentas",
    "i": 5
  },
  {
    "e": "Noriega Alvarez, María del Rocío",
    "i": 5
  },
  {
    "e": "Montalvo Adame, Rocío Maybé",
    "i": 5
  },
  {
    "e": "Martínez Casillas, Jesús Antonio",
    "i": 5
  },
  {
    "e": "López  López, Maritza Isabel",
    "i": 5
  },
  {
    "e": "Laguna Caballero, Hilario",
    "i": 5
  },
  {
    "e": "Investigaciones y Estudios Superiores",
    "i": 5
  },
  {
    "e": "Instituto de Ecología",
    "i": 5
  },
  {
    "e": "Instituto Nacional de Migración",
    "i": 5
  },
  {
    "e": "Instituto Nacional de Estudios Superiores en Derecho Penal",
    "i": 5
  },
  {
    "e": "Instituto Mexicano del Seguro Social",
    "i": 5
  },
  {
    "e": "Horcasitas Editores",
    "i": 5
  },
  {
    "e": "Gómez Valdés, Homero",
    "i": 5
  },
  {
    "e": "G.M. Editores",
    "i": 5
  },
  {
    "e": "Fundación Mexicana para la Salud",
    "i": 5
  },
  {
    "e": "Fundación Manuel Buendía",
    "i": 5
  },
  {
    "e": "Empresas Ruz",
    "i": 5
  },
  {
    "e": "El Colegio de Sonora",
    "i": 5
  },
  {
    "e": "El Aleph Digital",
    "i": 5
  },
  {
    "e": "Editorial Viadas",
    "i": 5
  },
  {
    "e": "Editorial Resistencia",
    "i": 5
  },
  {
    "e": "Editorial Medano",
    "i": 5
  },
  {
    "e": "Editorial Lenguaraz",
    "i": 5
  },
  {
    "e": "Edición y Farmacia",
    "i": 5
  },
  {
    "e": "Ediciones hombre y mundo",
    "i": 5
  },
  {
    "e": "Ediciones Promoautin",
    "i": 5
  },
  {
    "e": "Ediciones Fiscales y Jurídicas",
    "i": 5
  },
  {
    "e": "Dirección General de Educación Tecnológica Industrial",
    "i": 5
  },
  {
    "e": "Consejo Veracruzano de Arte Popular",
    "i": 5
  },
  {
    "e": "Consejo Nacional para Prevenir la Discriminación",
    "i": 5
  },
  {
    "e": "Comisión Nacional de Libros de Texto Gratuitos",
    "i": 5
  },
  {
    "e": "Colín y Asociados",
    "i": 5
  },
  {
    "e": "Colegio de Notarios del Distrito Federal",
    "i": 5
  },
  {
    "e": "Celtic Publishing",
    "i": 5
  },
  {
    "e": "Casa Juan Pablos Centro Cultural",
    "i": 5
  },
  {
    "e": "Camacho Vargas, José Luis",
    "i": 5
  },
  {
    "e": "Calvo Lugo, César Mauricio",
    "i": 5
  },
  {
    "e": "Calderón Sánchez, Luis Arturo",
    "i": 5
  },
  {
    "e": "Asociación Cultural Onir",
    "i": 5
  },
  {
    "e": "Ascencio Gómez, Esteban",
    "i": 5
  },
  {
    "e": "Arteletra Literatura Iberoamericana",
    "i": 5
  },
  {
    "e": "Afinita Editorial México",
    "i": 5
  },
  {
    "e": "Valencia Avila, Vidal",
    "i": 4
  },
  {
    "e": "Universidad de La Ciénega del Estado de Michoacán de Ocampo",
    "i": 4
  },
  {
    "e": "Universidad Tecnológica de San Juan del Río",
    "i": 4
  },
  {
    "e": "Tudor Producciones",
    "i": 4
  },
  {
    "e": "Sociedad Matemática Mexicana",
    "i": 4
  },
  {
    "e": "Secretaría de Medio Ambiente y Recursos Naturales",
    "i": 4
  },
  {
    "e": "Secretaría de Cultura de Tabasco",
    "i": 4
  },
  {
    "e": "Reverté Ediciones",
    "i": 4
  },
  {
    "e": "Palabra de Clío",
    "i": 4
  },
  {
    "e": "Opus Editorial",
    "i": 4
  },
  {
    "e": "Obregon Diaz, Carlos Federico",
    "i": 4
  },
  {
    "e": "Museo del Salón de la Fama del F.B.A. de México",
    "i": 4
  },
  {
    "e": "Murillo Amaro, José Luis",
    "i": 4
  },
  {
    "e": "Mejía González, Marcial Antonio",
    "i": 4
  },
  {
    "e": "Martínez Jover, María del Carmen Dorotea",
    "i": 4
  },
  {
    "e": "Martinez Moreno, Mizraim Urias",
    "i": 4
  },
  {
    "e": "Magaña Magaña, Francisco",
    "i": 4
  },
  {
    "e": "Luque Rojas, José Manuel",
    "i": 4
  },
  {
    "e": "Lito-Grapo",
    "i": 4
  },
  {
    "e": "León Calixto, Quetzatl",
    "i": 4
  },
  {
    "e": "Larios Guzmán, Antonio",
    "i": 4
  },
  {
    "e": "Landucci",
    "i": 4
  },
  {
    "e": "Instituto para la Equidad de Género en Yucatán",
    "i": 4
  },
  {
    "e": "Instituto de Estudios Constitucionales del Estado de Querétaro",
    "i": 4
  },
  {
    "e": "Instituto de Cultura del Estado de Durango",
    "i": 4
  },
  {
    "e": "Instituto Hidalguense de Educación",
    "i": 4
  },
  {
    "e": "Gabriel García, Marco Antonio",
    "i": 4
  },
  {
    "e": "Fundación para la Implementación, Diseño, Evaluación y Análisis de Políticas Públicas, Fundación Idea",
    "i": 4
  },
  {
    "e": "Escuela Normal Oficial de Guanajuato",
    "i": 4
  },
  {
    "e": "Editorial la Cruz",
    "i": 4
  },
  {
    "e": "Editorial Vanguardia Educativa",
    "i": 4
  },
  {
    "e": "Editorial Televisa",
    "i": 4
  },
  {
    "e": "Editorial Leto",
    "i": 4
  },
  {
    "e": "Díez de Urdanivia Serrano, Fernando",
    "i": 4
  },
  {
    "e": "Dirección General de Planeación",
    "i": 4
  },
  {
    "e": "Cordero Vázquez, Donato",
    "i": 4
  },
  {
    "e": "Comisión Organizadora del Estado de Veracruz de Ignacio de la Llave para la Conmemoración del Bicentenario de la Independencia Nacional y del Centenario de la Revolución Mexicana",
    "i": 4
  },
  {
    "e": "Centro de Orientación Vocacional Juvenil",
    "i": 4
  },
  {
    "e": "Centro de Estudios Espinosa Yglesias",
    "i": 4
  },
  {
    "e": "Castillo Tovar, Alfonso",
    "i": 4
  },
  {
    "e": "Casa de Estudios de Literatura y Talleres Artísticos Amaquemecan",
    "i": 4
  },
  {
    "e": "Cabello Alcerreca, Alejandro",
    "i": 4
  },
  {
    "e": "Bordes Pacheco, Ana Maria Pilar",
    "i": 4
  },
  {
    "e": "Bildunc Ediciones",
    "i": 4
  },
  {
    "e": "Banco de México",
    "i": 4
  },
  {
    "e": "Archivo Histórico del Estado de San Luis Potosí",
    "i": 4
  },
  {
    "e": "Arachana Ediciones",
    "i": 4
  },
  {
    "e": "Albarran Hernandez, Einar",
    "i": 4
  },
  {
    "e": "Academia Mexicana de Derechos Humanos",
    "i": 4
  },
  {
    "e": "Zaldumbide Ceceña, Flor Guadalupe",
    "i": 3
  },
  {
    "e": "Zafra Pinacho, David",
    "i": 3
  },
  {
    "e": "Villanueva Mukul, Eric Eber",
    "i": 3
  },
  {
    "e": "Tribunal Electoral del Distrito Federal",
    "i": 3
  },
  {
    "e": "Travesías Editores",
    "i": 3
  },
  {
    "e": "Torre Medina Mora, Fernando",
    "i": 3
  },
  {
    "e": "Tecnológico Nacional de México",
    "i": 3
  },
  {
    "e": "Sánchez Velázquez, María del Rosario",
    "i": 3
  },
  {
    "e": "Sánchez González, Celia",
    "i": 3
  },
  {
    "e": "Sánchez Anzúres, Rosa del Carmen",
    "i": 3
  },
  {
    "e": "Sociedad Mexicana de la Ciencia del Suelo",
    "i": 3
  },
  {
    "e": "Sentido Giratorio Ediciones",
    "i": 3
  },
  {
    "e": "Rrecca Comercializadora",
    "i": 3
  },
  {
    "e": "Robles Palacios, Brunilda",
    "i": 3
  },
  {
    "e": "Rivera Ramírez, Ana Luisa",
    "i": 3
  },
  {
    "e": "Reyes Oliva, José Leopoldo Enrique",
    "i": 3
  },
  {
    "e": "Red Analítica Lacaniana",
    "i": 3
  },
  {
    "e": "Razo García, Juan Antonio",
    "i": 3
  },
  {
    "e": "Promoción de la Cultura y la Educación Superior del Bajío",
    "i": 3
  },
  {
    "e": "Promoarte",
    "i": 3
  },
  {
    "e": "Pluralia Ediciones e Impresiones",
    "i": 3
  },
  {
    "e": "Planeación y Desarrollo Editorial",
    "i": 3
  },
  {
    "e": "Patronato del Museo Nacional de Arte",
    "i": 3
  },
  {
    "e": "Nueva Editorial Lucero",
    "i": 3
  },
  {
    "e": "Normalización y Certificación Electrónica",
    "i": 3
  },
  {
    "e": "Museo del Acero",
    "i": 3
  },
  {
    "e": "Morales González, José Antonio",
    "i": 3
  },
  {
    "e": "Monclem Ediciones",
    "i": 3
  },
  {
    "e": "Molino de Letras",
    "i": 3
  },
  {
    "e": "Medina Díaz, Edgar",
    "i": 3
  },
  {
    "e": "Marín Ronzón, Manuela Moraima",
    "i": 3
  },
  {
    "e": "Madrosc Casa Editorial",
    "i": 3
  },
  {
    "e": "Madero Gámez, Magdalena",
    "i": 3
  },
  {
    "e": "Línea Continua",
    "i": 3
  },
  {
    "e": "Lindero Ediciones",
    "i": 3
  },
  {
    "e": "Instituto de Transparencia, Acceso a la Información Pública y Protección de Datos Personales del Estado de México y Municipios",
    "i": 3
  },
  {
    "e": "Instituto de Psicoterapia Alinde",
    "i": 3
  },
  {
    "e": "Instituto de Educación de Aguascalientes",
    "i": 3
  },
  {
    "e": "Instituto Panamericano de Geografía e Historia",
    "i": 3
  },
  {
    "e": "Instituto Electoral de Quintana Roo",
    "i": 3
  },
  {
    "e": "INFOTEC Centro de Investigación e Innovación en Tecnologías de la Información y Comunicación",
    "i": 3
  },
  {
    "e": "Hernández Pedroza, José Mario",
    "i": 3
  },
  {
    "e": "Gómez Miranda, Pilar",
    "i": 3
  },
  {
    "e": "Gutiérrez Torres, Karina Guadalupe",
    "i": 3
  },
  {
    "e": "Grupo Comercial y Editor Roma",
    "i": 3
  },
  {
    "e": "Gaia Editores",
    "i": 3
  },
  {
    "e": "Fundar Centro de Análisis e Investigación",
    "i": 3
  },
  {
    "e": "Fundación para la Libertad de Expresión",
    "i": 3
  },
  {
    "e": "Fundación Friedrich Ebert",
    "i": 3
  },
  {
    "e": "Fundación Centro Cultural del México Contemporáneo",
    "i": 3
  },
  {
    "e": "Fundacion Manuel Arango",
    "i": 3
  },
  {
    "e": "Franco Padilla, Eduardo",
    "i": 3
  },
  {
    "e": "Esparza Zavala, Penélope Yanira",
    "i": 3
  },
  {
    "e": "Engrupo Editores",
    "i": 3
  },
  {
    "e": "El Colegio de Sinaloa",
    "i": 3
  },
  {
    "e": "Edufam Ediciones",
    "i": 3
  },
  {
    "e": "Editorial Sopa de Letras",
    "i": 3
  },
  {
    "e": "Editorial Multimedia Educativa",
    "i": 3
  },
  {
    "e": "Editorial Me Cayo el Veinte",
    "i": 3
  },
  {
    "e": "Editorial Juventud",
    "i": 3
  },
  {
    "e": "Editorial Hiperlibro",
    "i": 3
  },
  {
    "e": "Editorial Garabatos",
    "i": 3
  },
  {
    "e": "Editorial Avante",
    "i": 3
  },
  {
    "e": "Editoras Los Miércoles",
    "i": 3
  },
  {
    "e": "Editora y Distribuidora Yug",
    "i": 3
  },
  {
    "e": "Editora Cronos",
    "i": 3
  },
  {
    "e": "Ediciones Raya en el Agua",
    "i": 3
  },
  {
    "e": "E Libro Red Americas",
    "i": 3
  },
  {
    "e": "Derechos Infancia México",
    "i": 3
  },
  {
    "e": "Couto Arenas, Guadalupe Fátima",
    "i": 3
  },
  {
    "e": "Couto  Arenas, Manuel Benjamín",
    "i": 3
  },
  {
    "e": "Consejo de Ciencia y Tecnología del Estado de Guanajuato",
    "i": 3
  },
  {
    "e": "Consejo Estatal para las Culturas y las Artes de Chiapas",
    "i": 3
  },
  {
    "e": "Cisneros de la Cruz, Juan Andrés",
    "i": 3
  },
  {
    "e": "Cervantes Turrubiates, Leticia Arcelia",
    "i": 3
  },
  {
    "e": "Centro de Investigación y de Estudios Avanzados del I.P.N.",
    "i": 3
  },
  {
    "e": "Centro de Investigación y Docencia Económicas",
    "i": 3
  },
  {
    "e": "Centro de Investigación Científica de Yucatán",
    "i": 3
  },
  {
    "e": "Centro de Estudios e Investigación en Desarrollo y Asistencia Social",
    "i": 3
  },
  {
    "e": "Centro de Estudios e Investigación Guestálticos",
    "i": 3
  },
  {
    "e": "Centro de Estudios Independientes a Distancia",
    "i": 3
  },
  {
    "e": "Centro de Estudios Avanzados de Diseño",
    "i": 3
  },
  {
    "e": "Centro Estatal de Investigacion de la Vialidad y el Transporte",
    "i": 3
  },
  {
    "e": "Central Mexicana de Servicios Generales de Alcohólicos Anónimos",
    "i": 3
  },
  {
    "e": "Castro Maravilla, Rosalinda",
    "i": 3
  },
  {
    "e": "Callis Niños",
    "i": 3
  },
  {
    "e": "Bravo Montes, Gisela Maria Teresa",
    "i": 3
  },
  {
    "e": "Benitez Mojica, David",
    "i": 3
  },
  {
    "e": "Banco Nacional de México, S.A. Integrante del Grupo Financiero Banamex",
    "i": 3
  },
  {
    "e": "Avance-Análisis, Investigación y Estudios para el Desarrollo",
    "i": 3
  },
  {
    "e": "Auditoría Superior de la Federación",
    "i": 3
  },
  {
    "e": "Arriaga González, Mónica Guadalupe",
    "i": 3
  },
  {
    "e": "Architecthum Plus",
    "i": 3
  },
  {
    "e": "Anaya Sarmiento, Humberto",
    "i": 3
  },
  {
    "e": "Amézaga Heiras, Armando Gustavo",
    "i": 3
  },
  {
    "e": "Amigos de Editorial Calamus",
    "i": 3
  },
  {
    "e": "Acosta Meléndez, Raúl",
    "i": 3
  },
  {
    "e": "Academia Mexicana de Ciencias Artes Tecnología y Humanidades",
    "i": 3
  },
  {
    "e": "ADN Editores",
    "i": 3
  },
  {
    "e": "Villegas Martinez, Cristobal Daniel",
    "i": 2
  },
  {
    "e": "Universidad del Claustro de Sor Juana",
    "i": 2
  },
  {
    "e": "Universidad Tecnológica de la Mixteca",
    "i": 2
  },
  {
    "e": "Universidad Pontificia de México",
    "i": 2
  },
  {
    "e": "Universidad Politécnica de Chiapas",
    "i": 2
  },
  {
    "e": "Universidad Pedagógica de Durango",
    "i": 2
  },
  {
    "e": "Universidad Obrera de México Vicente Lombardo Toledano",
    "i": 2
  },
  {
    "e": "Universidad Madero",
    "i": 2
  },
  {
    "e": "Universidad Autónoma de Sinaloa",
    "i": 2
  },
  {
    "e": "Tristan Lopez, Agustin",
    "i": 2
  },
  {
    "e": "Tiempo Imaginario",
    "i": 2
  },
  {
    "e": "Sánchez Pozos, Juan Miguel",
    "i": 2
  },
  {
    "e": "Sueños y Quimeras",
    "i": 2
  },
  {
    "e": "Subsecretaría de Planeación, Evaluación y Coordinación",
    "i": 2
  },
  {
    "e": "Stivalet Stivalet, Egda Josefina",
    "i": 2
  },
  {
    "e": "Soka Gakkai de México",
    "i": 2
  },
  {
    "e": "Sociedad Panamericana de Estudios Empresariales",
    "i": 2
  },
  {
    "e": "Sociedad Mexicana de Termodinámica",
    "i": 2
  },
  {
    "e": "Sociedad Mexicana de Inteligencia Artificial",
    "i": 2
  },
  {
    "e": "Sociedad Mexicana de Ingeniería Mecánica",
    "i": 2
  },
  {
    "e": "Sistema de Enseñanza Computacional",
    "i": 2
  },
  {
    "e": "Servicios Educativos Editoriales",
    "i": 2
  },
  {
    "e": "Seminario de Cultura Mexicana",
    "i": 2
  },
  {
    "e": "Samaan, Chadi",
    "i": 2
  },
  {
    "e": "Safont Magnani, Pilar Leticia",
    "i": 2
  },
  {
    "e": "S Y G Editores",
    "i": 2
  },
  {
    "e": "Rueda López, Ismael",
    "i": 2
  },
  {
    "e": "Romo Reyes, Jorge Luis",
    "i": 2
  },
  {
    "e": "Romans Road Productions",
    "i": 2
  },
  {
    "e": "Rojas Mancera, Pablo Gabriel",
    "i": 2
  },
  {
    "e": "Rodríguez Téllez, Sergio José",
    "i": 2
  },
  {
    "e": "Rodríguez Ríos, Rafael Manuel",
    "i": 2
  },
  {
    "e": "Rezza Editores",
    "i": 2
  },
  {
    "e": "Religiosas de la Cruz del Sagrado Corazón de Jesús en México",
    "i": 2
  },
  {
    "e": "Red de Investigadoras por la Vida y la Libertad de las Mujeres",
    "i": 2
  },
  {
    "e": "Ramirez Melo, Carlos Federico",
    "i": 2
  },
  {
    "e": "Pérez Lizaur, Ana Berta",
    "i": 2
  },
  {
    "e": "Proyecto Mina Estrella",
    "i": 2
  },
  {
    "e": "Proyección Cultural Mexicana",
    "i": 2
  },
  {
    "e": "Promotora de Valores Sociales Plata",
    "i": 2
  },
  {
    "e": "Primero La A",
    "i": 2
  },
  {
    "e": "Posadas Mendoza, Claudia",
    "i": 2
  },
  {
    "e": "Poder Legislativo del Estado de México",
    "i": 2
  },
  {
    "e": "Plazola Editores",
    "i": 2
  },
  {
    "e": "Palabras y Plumas Editores",
    "i": 2
  },
  {
    "e": "Ortega Pérez, Irma",
    "i": 2
  },
  {
    "e": "Organización Educativa Más",
    "i": 2
  },
  {
    "e": "Orantes Villarreal, Arturo",
    "i": 2
  },
  {
    "e": "Olán Pérez, Samuel",
    "i": 2
  },
  {
    "e": "Olguin Martínez, Laura Esther",
    "i": 2
  },
  {
    "e": "Oficina Editorial",
    "i": 2
  },
  {
    "e": "Núñez Hernández, Marco Antonio",
    "i": 2
  },
  {
    "e": "Navarro Hernández, Rodrigo",
    "i": 2
  },
  {
    "e": "Narro Etchegaray, Beatriz Martha",
    "i": 2
  },
  {
    "e": "Méndez Pérez, Oralia",
    "i": 2
  },
  {
    "e": "Museo de Historia Mexicana",
    "i": 2
  },
  {
    "e": "Museo Iconográfico del Quijote",
    "i": 2
  },
  {
    "e": "Moya Delgado, Octaviano",
    "i": 2
  },
  {
    "e": "Morales Melendez, Poluquih",
    "i": 2
  },
  {
    "e": "Misioneros del Espíritu Santo, Provincia de México",
    "i": 2
  },
  {
    "e": "Medina Magaña, Indalecio Dante",
    "i": 2
  },
  {
    "e": "Medina Jaime, Rubén Darío",
    "i": 2
  },
  {
    "e": "Martínez Villarreal, María Eugenia",
    "i": 2
  },
  {
    "e": "Mandato Antiguo Colegio de San Ildefonso",
    "i": 2
  },
  {
    "e": "Macías Valadez Tamayo, Guido",
    "i": 2
  },
  {
    "e": "López Valdez, Elizabeth Victoria",
    "i": 2
  },
  {
    "e": "López Báez, Orlando",
    "i": 2
  },
  {
    "e": "Luis Jorge Tomasini y Salcedo",
    "i": 2
  },
  {
    "e": "Lozano Aguirre, Diana",
    "i": 2
  },
  {
    "e": "Loyden Sosa, Esmeralda",
    "i": 2
  },
  {
    "e": "Loto Dorado",
    "i": 2
  },
  {
    "e": "Lopez Fuentevilla, Amelia",
    "i": 2
  },
  {
    "e": "Libros para Imaginar",
    "i": 2
  },
  {
    "e": "Libros Magenta",
    "i": 2
  },
  {
    "e": "Lepe Zúñiga, María del Socorro",
    "i": 2
  },
  {
    "e": "Leal Fernández, Gustavo",
    "i": 2
  },
  {
    "e": "Lartigue Becerra, María Teresa de Jesús",
    "i": 2
  },
  {
    "e": "Kadima",
    "i": 2
  },
  {
    "e": "Juárez Cacho, Ángel Julián",
    "i": 2
  },
  {
    "e": "Johnson Jenkins, John Buford",
    "i": 2
  },
  {
    "e": "Jiménez Torres, Oscar",
    "i": 2
  },
  {
    "e": "Iure Editores",
    "i": 2
  },
  {
    "e": "Instituto de Evaluación en Gran Escala",
    "i": 2
  },
  {
    "e": "Instituto de Estudios y Divulgación sobre Migración",
    "i": 2
  },
  {
    "e": "Instituto Nacional para el Federalismo y el Desarrollo Municipal",
    "i": 2
  },
  {
    "e": "Instituto Mexicano de la Propiedad Industrial",
    "i": 2
  },
  {
    "e": "Instituto Mexicano de Flebología",
    "i": 2
  },
  {
    "e": "Instituto Mexicano de Ejecutivos de Finanzas",
    "i": 2
  },
  {
    "e": "Impresiones Aéreas",
    "i": 2
  },
  {
    "e": "Illanes Bernal, Olga Inés",
    "i": 2
  },
  {
    "e": "Ibarra Salazar, Jorge Aurelio",
    "i": 2
  },
  {
    "e": "Hegewisch Aznar, Andrea",
    "i": 2
  },
  {
    "e": "Hacia una Cultura Democrática",
    "i": 2
  },
  {
    "e": "Gutiérrez Garcia-Puere, Andrik Oswaldo",
    "i": 2
  },
  {
    "e": "Gutiérrez Deaibis, Luz María",
    "i": 2
  },
  {
    "e": "Gutiérrez Arce, Carlos  Eduardo",
    "i": 2
  },
  {
    "e": "Grupo de Educación Popular con Mujeres",
    "i": 2
  },
  {
    "e": "Grupo Ixel Editores",
    "i": 2
  },
  {
    "e": "Grupo Editor Orfila Valentini",
    "i": 2
  },
  {
    "e": "Grupo Difusion Cientifica",
    "i": 2
  },
  {
    "e": "Grapondi de México",
    "i": 2
  },
  {
    "e": "Googol",
    "i": 2
  },
  {
    "e": "García y Moisés, Enrique",
    "i": 2
  },
  {
    "e": "García Romo, Sergio Eduardo",
    "i": 2
  },
  {
    "e": "García García, Jaime",
    "i": 2
  },
  {
    "e": "García Eudocia, José Nicanor",
    "i": 2
  },
  {
    "e": "Garcin Mireles, Luis Cesar",
    "i": 2
  },
  {
    "e": "Garabato Editorial",
    "i": 2
  },
  {
    "e": "Galván Hernández, José Luis",
    "i": 2
  },
  {
    "e": "Fundación Universidad de las Américas, Puebla",
    "i": 2
  },
  {
    "e": "Fundación Friedrich Naumann",
    "i": 2
  },
  {
    "e": "Fundación Espinosa Rugarcia",
    "i": 2
  },
  {
    "e": "Fundación Cultural Federico Hoth",
    "i": 2
  },
  {
    "e": "Fundación Amparo",
    "i": 2
  },
  {
    "e": "Fundacion Abatony Pro Combate a la Artritis",
    "i": 2
  },
  {
    "e": "Fuenlabrada Velázquez, Irma Rosa",
    "i": 2
  },
  {
    "e": "Franco Carcedo, Maria Elena",
    "i": 2
  },
  {
    "e": "Fortis Hernández, Manuel",
    "i": 2
  },
  {
    "e": "Floresta Ediciones",
    "i": 2
  },
  {
    "e": "Flores Magallon, Rebeca",
    "i": 2
  },
  {
    "e": "Flores García, Maria Luisa",
    "i": 2
  },
  {
    "e": "Fideicomiso del Espacio Cultural y Educativo Betlemitas",
    "i": 2
  },
  {
    "e": "Ferrer Guaita, Felipe Manuel",
    "i": 2
  },
  {
    "e": "Esquivel Reyes, Ma. de Jesús",
    "i": 2
  },
  {
    "e": "Espinosa Castañeda, Sergio Arturo",
    "i": 2
  },
  {
    "e": "Editorial Planeta DeAgostini",
    "i": 2
  },
  {
    "e": "Editorial Paralelo 21",
    "i": 2
  },
  {
    "e": "Editorial Fata Morgana",
    "i": 2
  },
  {
    "e": "Editorial Enrique de Ossó de México",
    "i": 2
  },
  {
    "e": "Editorial Domzen",
    "i": 2
  },
  {
    "e": "Editorial Constitucionalista",
    "i": 2
  },
  {
    "e": "Edimisio",
    "i": 2
  },
  {
    "e": "Ediciones el Tucán de Virginia",
    "i": 2
  },
  {
    "e": "Ediciones Ve",
    "i": 2
  },
  {
    "e": "Díaz Guerrero, Raúl",
    "i": 2
  },
  {
    "e": "Díaz Garay, Alejandro",
    "i": 2
  },
  {
    "e": "Distribuidora Marín",
    "i": 2
  },
  {
    "e": "Dirección de Educación Especial",
    "i": 2
  },
  {
    "e": "Dirección General de Evaluaciones Políticas",
    "i": 2
  },
  {
    "e": "Dirección General de Educación Indígena",
    "i": 2
  },
  {
    "e": "Del Olmo Linares, Gerardo",
    "i": 2
  },
  {
    "e": "De los Reyes Villarreal, Natán Cenobio",
    "i": 2
  },
  {
    "e": "De la Cueva García Teruel, Paulina Ximena",
    "i": 2
  },
  {
    "e": "De la Calleja López, Miguel Ángel",
    "i": 2
  },
  {
    "e": "De Montanaro Hoyo, Jorge Federico",
    "i": 2
  },
  {
    "e": "Córdoba Lobo, Víctor Manuel Rafael",
    "i": 2
  },
  {
    "e": "Cárdenas Villareal, Carlos",
    "i": 2
  },
  {
    "e": "Corporativo Reyes Mora Advisors",
    "i": 2
  },
  {
    "e": "Compañía Editora del Manual Azucarero",
    "i": 2
  },
  {
    "e": "Comité Pro-Construcción y Conservación de las Obras Materiales y Sociales de la Basílica de Santa María de Guadalupe",
    "i": 2
  },
  {
    "e": "Comisión Nacional de Acuacultura y Pesca",
    "i": 2
  },
  {
    "e": "Comisión Estatal Electoral de Nuevo León",
    "i": 2
  },
  {
    "e": "Colegio de Estudios de Posgrado de la Ciudad de México",
    "i": 2
  },
  {
    "e": "Cobar Spross Diaz, David",
    "i": 2
  },
  {
    "e": "Centros de Integración Juvenil",
    "i": 2
  },
  {
    "e": "Centro de Investigación y Docencia en Humanidades del Estado de Morelos",
    "i": 2
  },
  {
    "e": "Centro de Investigación en Materiales Avanzados",
    "i": 2
  },
  {
    "e": "Centro de Investigación e Innovación para la Enseñanza y el Aprendizaje",
    "i": 2
  },
  {
    "e": "Centro de Investigaciones Biológicas del Noroeste",
    "i": 2
  },
  {
    "e": "Centro de Estudios del Autoconocimiento",
    "i": 2
  },
  {
    "e": "Centro Mexicano para la Filantropía",
    "i": 2
  },
  {
    "e": "Centro Internacional de Ingeniería y Formación Avanzada para el Desarrollo Industrial y Comercial",
    "i": 2
  },
  {
    "e": "Cañedo Dorantes, Adrian Lorenzo",
    "i": 2
  },
  {
    "e": "Caudillo Joya, Tomás",
    "i": 2
  },
  {
    "e": "Castañon Villalobos, Agustín",
    "i": 2
  },
  {
    "e": "Canún Rojas, Mara Paola",
    "i": 2
  },
  {
    "e": "Campillo Rodríguez, Marta",
    "i": 2
  },
  {
    "e": "Camargo Peraita, María Patricia Virginia",
    "i": 2
  },
  {
    "e": "Caligrama Editores",
    "i": 2
  },
  {
    "e": "Bioacademia",
    "i": 2
  },
  {
    "e": "Best Trading",
    "i": 2
  },
  {
    "e": "Becerril Miranda, Elsa",
    "i": 2
  },
  {
    "e": "Bayardo Dodge, María Lucía",
    "i": 2
  },
  {
    "e": "Baray Tarango, Marcelo",
    "i": 2
  },
  {
    "e": "Asociación de Ingenieros de Minas, Metalurgistas y Geólogos de México",
    "i": 2
  },
  {
    "e": "Asociación Mexicana de Mecatrónica",
    "i": 2
  },
  {
    "e": "Asociación Mexicana de Derecho a la Información",
    "i": 2
  },
  {
    "e": "Asociación Latinoamericana de Organizaciones de Promoción al Desarrollo",
    "i": 2
  },
  {
    "e": "Asesoría Capacitación y Asistencia en Salud",
    "i": 2
  },
  {
    "e": "Arriaga Álvarez, Emilio Gerardo",
    "i": 2
  },
  {
    "e": "Arriaga Stransky, Leticia María",
    "i": 2
  },
  {
    "e": "Arreguin Medina, Salvador",
    "i": 2
  },
  {
    "e": "Arias Orozco, Carlos Alberto",
    "i": 2
  },
  {
    "e": "Arellano Gutiérrez, Marco Antonio",
    "i": 2
  },
  {
    "e": "Almanza Chavarrieta, Rafael",
    "i": 2
  },
  {
    "e": "Alejandría Distribución Bibliográfica",
    "i": 2
  },
  {
    "e": "Alcalá Gómez, Nelida Eugenia",
    "i": 2
  },
  {
    "e": "Ala de Avispa Editores",
    "i": 2
  },
  {
    "e": "Aguilar García, Ernesto",
    "i": 2
  },
  {
    "e": "Administración y Promoción de Proyectos",
    "i": 2
  },
  {
    "e": "Academia de Ingeniería",
    "i": 2
  },
  {
    "e": "Academia Mexicana de Ciencias",
    "i": 2
  },
  {
    "e": "Álvarez García, José Guadalupe",
    "i": 1
  },
  {
    "e": "Zurita Lopez, Manuel Aniano",
    "i": 1
  },
  {
    "e": "Zumaya Ahumada, Norma",
    "i": 1
  },
  {
    "e": "Zumaquero Rios, José Lino",
    "i": 1
  },
  {
    "e": "Zimbron Romero, Juan Rafael",
    "i": 1
  },
  {
    "e": "Zenago Editores",
    "i": 1
  },
  {
    "e": "Zaragoza Ocaña, Diana Minerva",
    "i": 1
  },
  {
    "e": "Yinshan",
    "i": 1
  },
  {
    "e": "Yecolti",
    "i": 1
  },
  {
    "e": "Yamazaki Endo, Benito",
    "i": 1
  },
  {
    "e": "Witker Velásquez, Jorge Alberto",
    "i": 1
  },
  {
    "e": "Voces Contra el Silencio. Video Independiente",
    "i": 1
  },
  {
    "e": "Vive el Tiempo",
    "i": 1
  },
  {
    "e": "Vite Gómez, Cuauhtémoc Teodoro",
    "i": 1
  },
  {
    "e": "Villanueva Salazar, Lucia",
    "i": 1
  },
  {
    "e": "Villalpando Carrillos, Mario",
    "i": 1
  },
  {
    "e": "Victoria Jardón, Ana María",
    "i": 1
  },
  {
    "e": "Vergara Villamil, Antoeván",
    "i": 1
  },
  {
    "e": "Vera Cervantes, Eugenia Erica",
    "i": 1
  },
  {
    "e": "Velázquez Martínez, José Luis",
    "i": 1
  },
  {
    "e": "Velázquez Cortés, Julio",
    "i": 1
  },
  {
    "e": "Velázquez  Rodríguez, Juana",
    "i": 1
  },
  {
    "e": "Velazquez Quijada, Baltazar",
    "i": 1
  },
  {
    "e": "Velasco Mendoza, Gloria Guadalupe",
    "i": 1
  },
  {
    "e": "Vega Mendoza, Moises",
    "i": 1
  },
  {
    "e": "Vargas Morgado, Jorge",
    "i": 1
  },
  {
    "e": "Vargas Alvarado, Maricela",
    "i": 1
  },
  {
    "e": "Vargas Aguayo, Gabriel",
    "i": 1
  },
  {
    "e": "Varela Jimenez, Jorge",
    "i": 1
  },
  {
    "e": "Valle Galindo, José Luis",
    "i": 1
  },
  {
    "e": "Valera Saá, José Antonio",
    "i": 1
  },
  {
    "e": "Valenzuela Ramírez, Gonzalo",
    "i": 1
  },
  {
    "e": "Valdivia Marín, Esteban Adrián",
    "i": 1
  },
  {
    "e": "Utrilla Tello, David Alonso",
    "i": 1
  },
  {
    "e": "Usabiaga González, Martha Elena",
    "i": 1
  },
  {
    "e": "Urrutia Solórzano, Alejandro",
    "i": 1
  },
  {
    "e": "Urquiza Almanza, Humberto",
    "i": 1
  },
  {
    "e": "Urbina Alonso, Marco Polo",
    "i": 1
  },
  {
    "e": "Universidad del Valle de México",
    "i": 1
  },
  {
    "e": "Universidad del Mar",
    "i": 1
  },
  {
    "e": "Universidad del Istmo",
    "i": 1
  },
  {
    "e": "Universidad del Caribe",
    "i": 1
  },
  {
    "e": "Universidad de Montemorelos",
    "i": 1
  },
  {
    "e": "Universidad de Cuautitlán Izcalli",
    "i": 1
  },
  {
    "e": "Universidad Tecnológica del Valle de Chalco",
    "i": 1
  },
  {
    "e": "Universidad Tecnológica de Tecámac",
    "i": 1
  },
  {
    "e": "Universidad Popular de la Chontalpa",
    "i": 1
  },
  {
    "e": "Universidad Politécnica de Pachuca",
    "i": 1
  },
  {
    "e": "Universidad México Americana del Norte",
    "i": 1
  },
  {
    "e": "Universidad Motolinía del Pedregal",
    "i": 1
  },
  {
    "e": "Universidad La Salle",
    "i": 1
  },
  {
    "e": "Universidad Estatal del Valle de Ecatepec",
    "i": 1
  },
  {
    "e": "Universidad Estatal de Oriente",
    "i": 1
  },
  {
    "e": "Ulloa Del Rio, María del Carmen",
    "i": 1
  },
  {
    "e": "Ugarte Ordoñez, Lucia Alejandra",
    "i": 1
  },
  {
    "e": "Tribunal Federal de Justicia Administrativa",
    "i": 1
  },
  {
    "e": "Tribunal Estatal Electoral",
    "i": 1
  },
  {
    "e": "Tres Picos Servicios Editoriales",
    "i": 1
  },
  {
    "e": "Trejo Huerta, Marisol",
    "i": 1
  },
  {
    "e": "Tovalín Ahumada, José Alberto",
    "i": 1
  },
  {
    "e": "Toussaint Ribot, Gerardo María",
    "i": 1
  },
  {
    "e": "Torres Peralta, José Jesús Cutberto",
    "i": 1
  },
  {
    "e": "Torres López, Norma Angélica",
    "i": 1
  },
  {
    "e": "Torres García, Encarnación",
    "i": 1
  },
  {
    "e": "Torre Arellano, Esperanza Triny Elvira",
    "i": 1
  },
  {
    "e": "Terrazas Gastelum, Trinidad",
    "i": 1
  },
  {
    "e": "Tercero Rodríguez, Aldo Ernesto",
    "i": 1
  },
  {
    "e": "Tejeda del Toro, Luis Fernando",
    "i": 1
  },
  {
    "e": "Tapia Mendiola, Juan Raúl",
    "i": 1
  },
  {
    "e": "Talento Zetta",
    "i": 1
  },
  {
    "e": "Sánchez Sánchez, Ernesto Lázaro",
    "i": 1
  },
  {
    "e": "Sánchez Santiago, Gonzalo Alejandro",
    "i": 1
  },
  {
    "e": "Sánchez Ruiz, María del Carmen",
    "i": 1
  },
  {
    "e": "Sánchez Pantoja, David Armando",
    "i": 1
  },
  {
    "e": "Sánchez Ontiveros, Lorenzo Alejandro",
    "i": 1
  },
  {
    "e": "Sánchez Juárez, José Miguel",
    "i": 1
  },
  {
    "e": "Suárez Cervantes, María del Rosario",
    "i": 1
  },
  {
    "e": "Struktogram Consulting",
    "i": 1
  },
  {
    "e": "Sotomayor y Lara",
    "i": 1
  },
  {
    "e": "Soto García, Gustavo",
    "i": 1
  },
  {
    "e": "Soto Correa, Jose Carmen",
    "i": 1
  },
  {
    "e": "Soto  Zaldivar, Elisa",
    "i": 1
  },
  {
    "e": "Solinis Casparius, Teresa Jimena",
    "i": 1
  },
  {
    "e": "Softec",
    "i": 1
  },
  {
    "e": "Sociedad Nuclear Mexicana",
    "i": 1
  },
  {
    "e": "Sociedad Mexicana del Hidrógeno",
    "i": 1
  },
  {
    "e": "Sociedad Mexicana de Patólogos Veterinarios",
    "i": 1
  },
  {
    "e": "Sociedad Mexicana de Neumología y Cirugía de Tórax",
    "i": 1
  },
  {
    "e": "Sociedad Bíblica de México",
    "i": 1
  },
  {
    "e": "Soberanes Rojas, Ezequiel",
    "i": 1
  },
  {
    "e": "Smurfit Cartón y Papel de México",
    "i": 1
  },
  {
    "e": "Silva Martinez, German",
    "i": 1
  },
  {
    "e": "Silva Guevara, Ulices Hermelindo",
    "i": 1
  },
  {
    "e": "Silva Aguirre, Raymundo",
    "i": 1
  },
  {
    "e": "Silerio Hernández, Linda Miriam",
    "i": 1
  },
  {
    "e": "Sierra Campuzano, Claudia",
    "i": 1
  },
  {
    "e": "Sextil Editores",
    "i": 1
  },
  {
    "e": "Servín Ortiz, Rafaela",
    "i": 1
  },
  {
    "e": "Servicios y Asesoría para la Paz",
    "i": 1
  },
  {
    "e": "Servicios de Imagen y Publicidad",
    "i": 1
  },
  {
    "e": "Servicio Alemán de Intercambio Académico",
    "i": 1
  },
  {
    "e": "Seminario de Sociopsicoanálisis",
    "i": 1
  },
  {
    "e": "Segrak",
    "i": 1
  },
  {
    "e": "Secretaría de la Función Pública",
    "i": 1
  },
  {
    "e": "Secretaría de Medio Ambiente y Recursos Naturales de Coahuila",
    "i": 1
  },
  {
    "e": "Secretaría de Educación del Distrito Federal",
    "i": 1
  },
  {
    "e": "Secretaría de Desarrollo Rural y Equidad para las Comunidades",
    "i": 1
  },
  {
    "e": "Schramm Paetkau, Esther",
    "i": 1
  },
  {
    "e": "Saucedo Barrera, Francisco Javier",
    "i": 1
  },
  {
    "e": "Santos Méndez, Francisco Enrique",
    "i": 1
  },
  {
    "e": "Santamaría Gómez, Arturo",
    "i": 1
  },
  {
    "e": "Sandín Sánchez, Gabriel",
    "i": 1
  },
  {
    "e": "Sampedro y Garybay, Alvaro Ernesto",
    "i": 1
  },
  {
    "e": "Samir Looka Sadek, Shehata",
    "i": 1
  },
  {
    "e": "Salud y Género",
    "i": 1
  },
  {
    "e": "Salinas Quiñones, Gilda Consuelo",
    "i": 1
  },
  {
    "e": "Salcedo de Crescenzo, Graciela del Rosario",
    "i": 1
  },
  {
    "e": "Salazar Ruiz, Enriqueta",
    "i": 1
  },
  {
    "e": "Salazar González, Guadalupe",
    "i": 1
  },
  {
    "e": "Salayandia Garcia, Ernesto Agustin",
    "i": 1
  },
  {
    "e": "Ruiz Salazar, Elisa Maria",
    "i": 1
  },
  {
    "e": "Ruiz Ocampo, Javier Martin",
    "i": 1
  },
  {
    "e": "Ruiz Meza, Laura Elena",
    "i": 1
  },
  {
    "e": "Rueda Rubalcava, Laura Adriana",
    "i": 1
  },
  {
    "e": "Rubio de Silva, Xavier",
    "i": 1
  },
  {
    "e": "Rubio Robleto, Marisela",
    "i": 1
  },
  {
    "e": "Ruanova Zarate, Felipe Daniel",
    "i": 1
  },
  {
    "e": "Rozillio Halabe, Margarita",
    "i": 1
  },
  {
    "e": "Rosete Macgregor Staines, Fernanda",
    "i": 1
  },
  {
    "e": "Rosas Solano, Eduardo",
    "i": 1
  },
  {
    "e": "Rosas León, David Gerardo",
    "i": 1
  },
  {
    "e": "Romero Robledo, Jaime Eduardo",
    "i": 1
  },
  {
    "e": "Romero Guereña, José",
    "i": 1
  },
  {
    "e": "Rojas Dirzo, Ricardo",
    "i": 1
  },
  {
    "e": "Roitenburd Belacortu, Viktoria",
    "i": 1
  },
  {
    "e": "Rodríguez Villareal, Luis Oscar",
    "i": 1
  },
  {
    "e": "Rodríguez Ugalde, Víctor",
    "i": 1
  },
  {
    "e": "Rodríguez Tarango, Jose Antonio",
    "i": 1
  },
  {
    "e": "Rodríguez Patiño, Abdías Emilio",
    "i": 1
  },
  {
    "e": "Rodríguez Pardo, Jorge Eduardo",
    "i": 1
  },
  {
    "e": "Rodríguez Méndez, María de las Nieves",
    "i": 1
  },
  {
    "e": "Rodríguez Martínez, Héctor Abelardo",
    "i": 1
  },
  {
    "e": "Rodríguez Gutiérrez, Arturo",
    "i": 1
  },
  {
    "e": "Rodríguez García, Elizabeth Marlene",
    "i": 1
  },
  {
    "e": "Rodríguez Cortés, María del Pilar",
    "i": 1
  },
  {
    "e": "Rodríguez Cabello, Eduardo",
    "i": 1
  },
  {
    "e": "Rodriguez Rodriguez, Martha Yolanda",
    "i": 1
  },
  {
    "e": "Rodriguez Cordero, Eli Kalid",
    "i": 1
  },
  {
    "e": "Robles Plata, Guadalupe Leticia",
    "i": 1
  },
  {
    "e": "Rivera Rodríguez, Rafael",
    "i": 1
  },
  {
    "e": "Riva Palacio Galicia, Enrique",
    "i": 1
  },
  {
    "e": "Rico Jean, Alfredo",
    "i": 1
  },
  {
    "e": "Reyes Zubiría, Luis Alfonso",
    "i": 1
  },
  {
    "e": "Reyes Trigos, Diana",
    "i": 1
  },
  {
    "e": "Reyes Sánchez, Laura Bertha",
    "i": 1
  },
  {
    "e": "Reyes Retana y Valadez, Reynaldo",
    "i": 1
  },
  {
    "e": "Reyes García, María Erendira",
    "i": 1
  },
  {
    "e": "Reyes Garcia, Carlos Alberto",
    "i": 1
  },
  {
    "e": "Red Mexicana de Investigadores",
    "i": 1
  },
  {
    "e": "Rangel Rivera, Ricardo",
    "i": 1
  },
  {
    "e": "Ramírez Mora, Jorge Alberto",
    "i": 1
  },
  {
    "e": "Ramírez Magaña, José Salvador",
    "i": 1
  },
  {
    "e": "Ramírez Carrera, Lilia Cenobia",
    "i": 1
  },
  {
    "e": "Ramírez Aboytes, Julio",
    "i": 1
  },
  {
    "e": "Ramos Soto, Ana Luz",
    "i": 1
  },
  {
    "e": "Raffoul Saba, Carlos",
    "i": 1
  },
  {
    "e": "Rabatte Castilla, Carolina Eugenia",
    "i": 1
  },
  {
    "e": "Quiróz Carranza, Joaquín Antonio",
    "i": 1
  },
  {
    "e": "Quintero Felix, Jorge Ernesto",
    "i": 1
  },
  {
    "e": "Quezada Salas, María de Lourdes",
    "i": 1
  },
  {
    "e": "Queizan Diaz, Berta",
    "i": 1
  },
  {
    "e": "Pérez-Grovas González-Cos, Jorge del Sagrado Corazón",
    "i": 1
  },
  {
    "e": "Pérez Ruiz, Maya Lorena",
    "i": 1
  },
  {
    "e": "Pérez Ricón Gallardo, Gonzalo",
    "i": 1
  },
  {
    "e": "Pérez Pérez, Víctor Hugo",
    "i": 1
  },
  {
    "e": "Pérez Ortega, María Luisa",
    "i": 1
  },
  {
    "e": "Pérez Orozco, Gregorio",
    "i": 1
  },
  {
    "e": "Pérez Arroyo, Ma.de Lourdes",
    "i": 1
  },
  {
    "e": "Pérez Angosto, Octavio",
    "i": 1
  },
  {
    "e": "Pèrez Ramìrez, Sabino",
    "i": 1
  },
  {
    "e": "Páramo Ediciones",
    "i": 1
  },
  {
    "e": "Pulido Macias, Edgar Federico",
    "i": 1
  },
  {
    "e": "Pulido Hernández, Oscar Arturo",
    "i": 1
  },
  {
    "e": "Pujalte Piñeiro, Angel",
    "i": 1
  },
  {
    "e": "Publicaciones a la Medida",
    "i": 1
  },
  {
    "e": "Proyecto Eti-K",
    "i": 1
  },
  {
    "e": "Producciones Educación Aplicada",
    "i": 1
  },
  {
    "e": "Presa Siordia, Constantino Martin",
    "i": 1
  },
  {
    "e": "Porras Morales, Juan Carlos",
    "i": 1
  },
  {
    "e": "Porras Hernández, Ernesto",
    "i": 1
  },
  {
    "e": "Porras Cárdenas, Fabiola",
    "i": 1
  },
  {
    "e": "Ponce Meza, Rosa Miriam",
    "i": 1
  },
  {
    "e": "Poder Judicial del Estado de Guanajuato",
    "i": 1
  },
  {
    "e": "Platas García, José Armando",
    "i": 1
  },
  {
    "e": "Pineda Aguilar, Rubén",
    "i": 1
  },
  {
    "e": "Peña García, Juan Silvestre",
    "i": 1
  },
  {
    "e": "Peña Cruz, María del Pilar",
    "i": 1
  },
  {
    "e": "Petróleos Mexicanos",
    "i": 1
  },
  {
    "e": "Pease Cruz, Angelica",
    "i": 1
  },
  {
    "e": "Peacemakers Editores",
    "i": 1
  },
  {
    "e": "Pea Internacional",
    "i": 1
  },
  {
    "e": "Patronato de Arte Contemporáneo",
    "i": 1
  },
  {
    "e": "Pastor Perez, Enrique",
    "i": 1
  },
  {
    "e": "Parada Ortega, Ramón",
    "i": 1
  },
  {
    "e": "Palacios Gamaz, Ana Beronica",
    "i": 1
  },
  {
    "e": "Palacio Muñoz, Víctor Herminio",
    "i": 1
  },
  {
    "e": "Palabra en Vuelo",
    "i": 1
  },
  {
    "e": "Padilla Ramos, Raquel",
    "i": 1
  },
  {
    "e": "Otero Sánchez, Julián",
    "i": 1
  },
  {
    "e": "Ortiz Terrazas, Horacio",
    "i": 1
  },
  {
    "e": "Ortiz Sosa, Héctor",
    "i": 1
  },
  {
    "e": "Ortiz Garcia, Maria Leticia",
    "i": 1
  },
  {
    "e": "Ortiz Cuaxiloa, Luis Rogelio",
    "i": 1
  },
  {
    "e": "Ortega, Ramón Paveel",
    "i": 1
  },
  {
    "e": "Orozco Ramos, Laura Eugenia",
    "i": 1
  },
  {
    "e": "Olvera Cortés, Yolanda Cristina",
    "i": 1
  },
  {
    "e": "Olvera Cabrera, María Fernanda",
    "i": 1
  },
  {
    "e": "Oliver Escasan, Arturo",
    "i": 1
  },
  {
    "e": "Olivares Camacho, Jorge Luis",
    "i": 1
  },
  {
    "e": "Olea Hernandez, Jose Leonardo",
    "i": 1
  },
  {
    "e": "Ochoa Colunga, Alfredo Ulises",
    "i": 1
  },
  {
    "e": "Observatorio Ciudadano de la Educación",
    "i": 1
  },
  {
    "e": "Nuñez Eddins, David Alejandro",
    "i": 1
  },
  {
    "e": "Nuñez Carranza, José Zoroastro",
    "i": 1
  },
  {
    "e": "Nortestación Agencia de Letras",
    "i": 1
  },
  {
    "e": "Nieves Medrano, Maria Luisa",
    "i": 1
  },
  {
    "e": "Nieto López, Gerardo",
    "i": 1
  },
  {
    "e": "Neuman Praes, Jacobo Moises",
    "i": 1
  },
  {
    "e": "Navarro, Leopoldo",
    "i": 1
  },
  {
    "e": "Navarro López, Ramiro",
    "i": 1
  },
  {
    "e": "Navarro D´Amiano, Antonio",
    "i": 1
  },
  {
    "e": "Nava Stenner, Juan Gerardo",
    "i": 1
  },
  {
    "e": "Nava Díaz, José Luis",
    "i": 1
  },
  {
    "e": "Nava Cervantes, Martina",
    "i": 1
  },
  {
    "e": "Narváez Ochoa, Alfredo Alfonso",
    "i": 1
  },
  {
    "e": "Nahmad Sittón, Elias",
    "i": 1
  },
  {
    "e": "Méndez Contreras, Juan Manuel",
    "i": 1
  },
  {
    "e": "Muñoz Torres, Ivonne Valeria",
    "i": 1
  },
  {
    "e": "Muñoz Rangel, Alicia del Carmen",
    "i": 1
  },
  {
    "e": "Muñoz Polit, Myriam Eugenia Margarita Antonia",
    "i": 1
  },
  {
    "e": "Muñoz Orozco, Abel",
    "i": 1
  },
  {
    "e": "Murguía Canovas, Gabriela",
    "i": 1
  },
  {
    "e": "Munoz Escobar, Jesus Hector",
    "i": 1
  },
  {
    "e": "Municipio de San Luis Potosí",
    "i": 1
  },
  {
    "e": "Munguía Vicens, Carlos",
    "i": 1
  },
  {
    "e": "Mundi Comunicaciones",
    "i": 1
  },
  {
    "e": "Multiversidad Mundo Real Edgar Morín",
    "i": 1
  },
  {
    "e": "Mota Rojas, Daniel",
    "i": 1
  },
  {
    "e": "Morín Martínez, Edgar",
    "i": 1
  },
  {
    "e": "Morton Subastas",
    "i": 1
  },
  {
    "e": "Moreno Olivarez, Norberto Santos",
    "i": 1
  },
  {
    "e": "Moreno Murillo, Margarita",
    "i": 1
  },
  {
    "e": "Moreno Aranda, José Luis",
    "i": 1
  },
  {
    "e": "Morales Muñoz, Fran Ilich",
    "i": 1
  },
  {
    "e": "Morales León, Jesús",
    "i": 1
  },
  {
    "e": "Mora Barba, Luis Alejandro",
    "i": 1
  },
  {
    "e": "Moots Comunicacion",
    "i": 1
  },
  {
    "e": "Monárrez Román, Julio César",
    "i": 1
  },
  {
    "e": "Montoya Zamora, Raúl",
    "i": 1
  },
  {
    "e": "Monroy Pérez, Gustavo",
    "i": 1
  },
  {
    "e": "Molina García, Cuauhtémoc Domingo",
    "i": 1
  },
  {
    "e": "Misioneros de Guadalupe",
    "i": 1
  },
  {
    "e": "Meza Ramos, Eduardo",
    "i": 1
  },
  {
    "e": "Meridiano 92",
    "i": 1
  },
  {
    "e": "Mercado Cruz, Eduardo",
    "i": 1
  },
  {
    "e": "Menes Llaguno, Juan Manuel",
    "i": 1
  },
  {
    "e": "Mendoza Mendoza, Daniel Juvenal",
    "i": 1
  },
  {
    "e": "Mendoza Guerrero, Juan Manuel",
    "i": 1
  },
  {
    "e": "Mendoza Cámara, María del Carmen",
    "i": 1
  },
  {
    "e": "Mendoza Arrubarrena, María Eugenia",
    "i": 1
  },
  {
    "e": "Mejía Muñoz, José Merced",
    "i": 1
  },
  {
    "e": "Mejía Arámbulo, Cruz",
    "i": 1
  },
  {
    "e": "Medios y Proyectos Ciudadanos",
    "i": 1
  },
  {
    "e": "Medios y Enteros",
    "i": 1
  },
  {
    "e": "Medina Benavides, Yolotli Lilián",
    "i": 1
  },
  {
    "e": "Medina Avila, Virginia",
    "i": 1
  },
  {
    "e": "Mc Manus Soto, Guadalupe Rosa",
    "i": 1
  },
  {
    "e": "Mateo Calderón, José Manuel",
    "i": 1
  },
  {
    "e": "Martínez de la Serna, Juan Antonio",
    "i": 1
  },
  {
    "e": "Martínez Zapata, Ramón Bolívar",
    "i": 1
  },
  {
    "e": "Martínez Rodríguez, Jesus Alfredo",
    "i": 1
  },
  {
    "e": "Martínez Padilla, Ramón",
    "i": 1
  },
  {
    "e": "Martínez Morales, Abelardo Alfonso",
    "i": 1
  },
  {
    "e": "Martínez Medina, Eva María",
    "i": 1
  },
  {
    "e": "Martínez Martínez, Delfino",
    "i": 1
  },
  {
    "e": "Martínez López de Llergo, Marisa del Pilar",
    "i": 1
  },
  {
    "e": "Martínez Benítez, Lorenzo",
    "i": 1
  },
  {
    "e": "Martínez Bejarano, Gloria Judith",
    "i": 1
  },
  {
    "e": "Martínez  Fernadez, Blanca",
    "i": 1
  },
  {
    "e": "Martín Colea, Juan Carlos",
    "i": 1
  },
  {
    "e": "Martiarena Alamo, Oscar Rolando",
    "i": 1
  },
  {
    "e": "Madrigal Martínez, Cesar Humberto",
    "i": 1
  },
  {
    "e": "Macal Zepeda, Elpidio",
    "i": 1
  },
  {
    "e": "Ma Non Troppo Ediciones",
    "i": 1
  },
  {
    "e": "López Villamar, Eduardo René",
    "i": 1
  },
  {
    "e": "López Ortega, Bolívar Edgardo",
    "i": 1
  },
  {
    "e": "López Medrano, José Humberto",
    "i": 1
  },
  {
    "e": "López López, Martin",
    "i": 1
  },
  {
    "e": "Luna Arias, Enrique",
    "i": 1
  },
  {
    "e": "Luis Cervantes, Victor",
    "i": 1
  },
  {
    "e": "Lugo Rohde, Juan Pablo",
    "i": 1
  },
  {
    "e": "Lucio Nieto, Teresa de Jesús",
    "i": 1
  },
  {
    "e": "Lozano Morgan, Miguel Angel",
    "i": 1
  },
  {
    "e": "Lozada García, Antonio",
    "i": 1
  },
  {
    "e": "Loya Lopategui, Carlos Manuel",
    "i": 1
  },
  {
    "e": "Lopez Bojorquez, Heraclito",
    "i": 1
  },
  {
    "e": "Lizárraga Hernández, Arturo",
    "i": 1
  },
  {
    "e": "Lira, Yolanda",
    "i": 1
  },
  {
    "e": "Lira Mandujano, Jennifer",
    "i": 1
  },
  {
    "e": "Libros del Escarabajo",
    "i": 1
  },
  {
    "e": "Librería Imagen de Toluca",
    "i": 1
  },
  {
    "e": "Libraria",
    "i": 1
  },
  {
    "e": "Ley Borrás, Roberto",
    "i": 1
  },
  {
    "e": "Lechuga Trejo, María Teresa",
    "i": 1
  },
  {
    "e": "Leal García, Ma. Luisa",
    "i": 1
  },
  {
    "e": "Lascurain Pérez, Laura Diana",
    "i": 1
  },
  {
    "e": "Lara Perea, Sergio Eduardo",
    "i": 1
  },
  {
    "e": "Lara Lara, Baudel",
    "i": 1
  },
  {
    "e": "Langmaack Pérez de León, Herman",
    "i": 1
  },
  {
    "e": "Lang Ovalle, Fritz Paul",
    "i": 1
  },
  {
    "e": "Landgrave Becerril, Rafael Gabriel",
    "i": 1
  },
  {
    "e": "Kellenberger Waspe, Angela Lotte",
    "i": 1
  },
  {
    "e": "Joyas Editoriales del Mundo",
    "i": 1
  },
  {
    "e": "Jiménez Jiménez, Féllix",
    "i": 1
  },
  {
    "e": "Jiménez González, Fernando",
    "i": 1
  },
  {
    "e": "Jeitani Jeitani, Sarkis Mikel",
    "i": 1
  },
  {
    "e": "Jaime Alarid, Humberto",
    "i": 1
  },
  {
    "e": "Jacques y Medina, Jose",
    "i": 1
  },
  {
    "e": "Intagri",
    "i": 1
  },
  {
    "e": "Instituto de la Mujer Oaxaqueña",
    "i": 1
  },
  {
    "e": "Instituto de Transparencia e Información Pública de Jalisco",
    "i": 1
  },
  {
    "e": "Instituto de Seguridad y Servicios Sociales de los Trabajadores del Estado",
    "i": 1
  },
  {
    "e": "Instituto de Investigaciones Sociales y Humanas",
    "i": 1
  },
  {
    "e": "Instituto de Integración y Asesoría Empresarial",
    "i": 1
  },
  {
    "e": "Instituto de Artesanías e Industrias Populares del Estado de Puebla",
    "i": 1
  },
  {
    "e": "Instituto de Acceso a la Informacion Pública y Protección de Datos Personales del Distrito Federal",
    "i": 1
  },
  {
    "e": "Instituto Veracruzano de la Cultura",
    "i": 1
  },
  {
    "e": "Instituto Universitario Anglo Español",
    "i": 1
  },
  {
    "e": "Instituto Tlaxcalteca de la Cultura",
    "i": 1
  },
  {
    "e": "Instituto Tecnológico de Nuevo León",
    "i": 1
  },
  {
    "e": "Instituto Tecnológico de Celaya",
    "i": 1
  },
  {
    "e": "Instituto Tecnológico Superior de Tlaxco, Tlaxcala",
    "i": 1
  },
  {
    "e": "Instituto Superior de Música del Estado de Veracruz de Ignacio de la Llave",
    "i": 1
  },
  {
    "e": "Instituto Quintanarroense de la Mujer",
    "i": 1
  },
  {
    "e": "Instituto Nacional de Pediatría",
    "i": 1
  },
  {
    "e": "Instituto Nacional de Estudios Históricos de las Revoluciones de México",
    "i": 1
  },
  {
    "e": "Instituto Nacional de Ciencias Médicas y Nutrición Salvador Zubirán",
    "i": 1
  },
  {
    "e": "Instituto Municipal de Cultura Culiacán",
    "i": 1
  },
  {
    "e": "Instituto Municipal de Arte y Cultura de Puebla",
    "i": 1
  },
  {
    "e": "Instituto Mexicano de Inmunología General e Inmuno-Oncología",
    "i": 1
  },
  {
    "e": "Instituto Mexicano de Cinematografía",
    "i": 1
  },
  {
    "e": "Instituto Mexicano Norteamericano de Relaciones Culturales de Nuevo León",
    "i": 1
  },
  {
    "e": "Instituto Interdisciplinario de Desarrollo",
    "i": 1
  },
  {
    "e": "Instituto Cultural de León",
    "i": 1
  },
  {
    "e": "Instituto Chinoin",
    "i": 1
  },
  {
    "e": "Institute Eng Electric Electronics Morelos Section",
    "i": 1
  },
  {
    "e": "Informed",
    "i": 1
  },
  {
    "e": "Importadora Samex",
    "i": 1
  },
  {
    "e": "Icarus Ediciones",
    "i": 1
  },
  {
    "e": "Ibarra Chávez, Héctor Ángel",
    "i": 1
  },
  {
    "e": "Hylton Salburg, Wade Ross",
    "i": 1
  },
  {
    "e": "Hompanera Velázquez, Félix",
    "i": 1
  },
  {
    "e": "Herrera, José Israel",
    "i": 1
  },
  {
    "e": "Herrera Díaz, Joaquín",
    "i": 1
  },
  {
    "e": "Hernández Zinzún, Gilberto",
    "i": 1
  },
  {
    "e": "Hernández Trujillo, Israel",
    "i": 1
  },
  {
    "e": "Hernández Tejeda, Diego",
    "i": 1
  },
  {
    "e": "Hernández Moreno, Gustavo Rogelio",
    "i": 1
  },
  {
    "e": "Hernández Morales, Víctor",
    "i": 1
  },
  {
    "e": "Hernández Mondragón, Alma Rosa",
    "i": 1
  },
  {
    "e": "Hernández Herrera, Rubén",
    "i": 1
  },
  {
    "e": "Hernández Gómez, José Manuel",
    "i": 1
  },
  {
    "e": "Hernández Gómez, José",
    "i": 1
  },
  {
    "e": "Hernández Aguilar, Mauricio",
    "i": 1
  },
  {
    "e": "Hernandez Marquez, Baldemar",
    "i": 1
  },
  {
    "e": "Herazo Barla y Asociados",
    "i": 1
  },
  {
    "e": "Henestrosa Matus, Nora",
    "i": 1
  },
  {
    "e": "Hegewisch Lomelin, Iliana María",
    "i": 1
  },
  {
    "e": "Hachette Filipacchi Expansión",
    "i": 1
  },
  {
    "e": "Habitat International Coalition",
    "i": 1
  },
  {
    "e": "Gómez de la Peña, Cecilia",
    "i": 1
  },
  {
    "e": "Guzmán y González, Miguel Angel",
    "i": 1
  },
  {
    "e": "Guzmán Kralova, Alonso Ruy",
    "i": 1
  },
  {
    "e": "Guzman Ramon, Elena",
    "i": 1
  },
  {
    "e": "Gutiérrez Lugo, Guillermo",
    "i": 1
  },
  {
    "e": "Guerrero Sandoval, Jose Luis",
    "i": 1
  },
  {
    "e": "Guerrero Ramos, José Raúl",
    "i": 1
  },
  {
    "e": "Guerrero Luis, Gubidxa",
    "i": 1
  },
  {
    "e": "Gudiño Díaz, Manuel Arturo",
    "i": 1
  },
  {
    "e": "Guanajuato Patrimonio de la Humanidad",
    "i": 1
  },
  {
    "e": "Guadiana Luna, Isaías Jesús",
    "i": 1
  },
  {
    "e": "Guadarrama Olhovich, Roberto Juan Manuel",
    "i": 1
  },
  {
    "e": "Guadarrama Gomora, Xokonoschtletl Antonio",
    "i": 1
  },
  {
    "e": "Grupo de Información en Reproducción Elegida",
    "i": 1
  },
  {
    "e": "Grupo Qropolis",
    "i": 1
  },
  {
    "e": "Grupo Milamex",
    "i": 1
  },
  {
    "e": "Grupo Interdisciplinario sobre Mujer, Trabajo y Pobreza",
    "i": 1
  },
  {
    "e": "Grupo Editorial y Digital El Puente.Com",
    "i": 1
  },
  {
    "e": "Grupo Editorial Hess",
    "i": 1
  },
  {
    "e": "Grupo Editorial Alcantara Editores",
    "i": 1
  },
  {
    "e": "Gregorio Regino, Juan",
    "i": 1
  },
  {
    "e": "Grajales Marín, José Francisco",
    "i": 1
  },
  {
    "e": "Gordillo Solís, Josué Neftalí",
    "i": 1
  },
  {
    "e": "González Ulloa, Lorenzo",
    "i": 1
  },
  {
    "e": "González Sotelo, Baldomero",
    "i": 1
  },
  {
    "e": "González Rodríguez, Abel",
    "i": 1
  },
  {
    "e": "González Pola, Fredy Omar",
    "i": 1
  },
  {
    "e": "González Ochoa, Rodrigo",
    "i": 1
  },
  {
    "e": "González Jimenez, Flora Alicia",
    "i": 1
  },
  {
    "e": "González Gutiérrez, Luis Armando",
    "i": 1
  },
  {
    "e": "González González, Roberto",
    "i": 1
  },
  {
    "e": "González González, Alfredo",
    "i": 1
  },
  {
    "e": "González Godínez, Juan Gabriel",
    "i": 1
  },
  {
    "e": "González Cruz, Juan",
    "i": 1
  },
  {
    "e": "González Cortéz, Nicolás",
    "i": 1
  },
  {
    "e": "González Chacín, Marycris Del Carmen",
    "i": 1
  },
  {
    "e": "González Castro, Liliana Elena",
    "i": 1
  },
  {
    "e": "González Beltrán, Irasema de los Angeles",
    "i": 1
  },
  {
    "e": "González Arriola, María Guadalupe",
    "i": 1
  },
  {
    "e": "Gonzalez Tiburcio, Humberto",
    "i": 1
  },
  {
    "e": "Godoy Patiño, Yliana",
    "i": 1
  },
  {
    "e": "Global Recursos Humanos",
    "i": 1
  },
  {
    "e": "Gilman Morgenstern, Nicholas",
    "i": 1
  },
  {
    "e": "Gil Vargas, Juan Carlos",
    "i": 1
  },
  {
    "e": "Geochekas",
    "i": 1
  },
  {
    "e": "Gelista García, Sergio",
    "i": 1
  },
  {
    "e": "Gdorian Editorial",
    "i": 1
  },
  {
    "e": "Gayou Picazo, Carlos Antonio",
    "i": 1
  },
  {
    "e": "Gaviño Ambriz, Jorge",
    "i": 1
  },
  {
    "e": "Gavira Marquez, Maria Concepcion",
    "i": 1
  },
  {
    "e": "Gasca Parra, Xenia",
    "i": 1
  },
  {
    "e": "García Robles Vizcaíno, Claudia",
    "i": 1
  },
  {
    "e": "García Reyes, Enrique",
    "i": 1
  },
  {
    "e": "García Prada, Eladio Antonio",
    "i": 1
  },
  {
    "e": "García Oropeza, Jesús Rubén",
    "i": 1
  },
  {
    "e": "García Maynez Espinosa, Jorge Antonio",
    "i": 1
  },
  {
    "e": "García Martínez, María de la Luz",
    "i": 1
  },
  {
    "e": "García López Galindo, Alberto",
    "i": 1
  },
  {
    "e": "García González, Zaira Amanda",
    "i": 1
  },
  {
    "e": "García Cuéllar, Enrique Ausencio",
    "i": 1
  },
  {
    "e": "García Colomé, Bárbara Cynthia",
    "i": 1
  },
  {
    "e": "García Chacon, Rafael José",
    "i": 1
  },
  {
    "e": "García Alonso, Luz",
    "i": 1
  },
  {
    "e": "Garcia Mikel, Luis",
    "i": 1
  },
  {
    "e": "Gallegos Nájera, José Arturo",
    "i": 1
  },
  {
    "e": "Gallegos Alcántara, Eridani",
    "i": 1
  },
  {
    "e": "Galass Bodas",
    "i": 1
  },
  {
    "e": "GBA Productions",
    "i": 1
  },
  {
    "e": "Futura Textos",
    "i": 1
  },
  {
    "e": "Fundación para la Educación Superior Internacional",
    "i": 1
  },
  {
    "e": "Fundación Xochitla",
    "i": 1
  },
  {
    "e": "Fundación Jumex",
    "i": 1
  },
  {
    "e": "Fundación Carlos Slim",
    "i": 1
  },
  {
    "e": "Fundación BBVA Bancomer",
    "i": 1
  },
  {
    "e": "Fundacion E. Arocena",
    "i": 1
  },
  {
    "e": "Fujimoto Promociones",
    "i": 1
  },
  {
    "e": "Franco Flores, Edgar",
    "i": 1
  },
  {
    "e": "Franco Díaz, Eduardo Melchor",
    "i": 1
  },
  {
    "e": "Fragua San Pablo",
    "i": 1
  },
  {
    "e": "Frade Rubio, Laura Gloria",
    "i": 1
  },
  {
    "e": "Foro Consultivo Científico y Tecnológico",
    "i": 1
  },
  {
    "e": "Fomento y Promoción de la Cultura",
    "i": 1
  },
  {
    "e": "Fomento Científico de Monterrey",
    "i": 1
  },
  {
    "e": "Flores Pelcastre, Rosa",
    "i": 1
  },
  {
    "e": "Flores Montaño, Javier",
    "i": 1
  },
  {
    "e": "Ferro Herrera, Miguel",
    "i": 1
  },
  {
    "e": "Ferrari Casillas, María Clementina",
    "i": 1
  },
  {
    "e": "Fernández Mac Gregor Maza, Laura Antonia",
    "i": 1
  },
  {
    "e": "Fernández Febles, José Manuel",
    "i": 1
  },
  {
    "e": "Fernandez Soto, Francisco Javier",
    "i": 1
  },
  {
    "e": "Fernandez Baca, Carlos Alberto",
    "i": 1
  },
  {
    "e": "Fastag Cwikiel, Mario",
    "i": 1
  },
  {
    "e": "Fajardo Guerrero, Andrea",
    "i": 1
  },
  {
    "e": "Etnobiología para la Conservación",
    "i": 1
  },
  {
    "e": "Estua Zardain, Alberto",
    "i": 1
  },
  {
    "e": "Estrada Hernández, Ana María",
    "i": 1
  },
  {
    "e": "Estrada Estrada, Joel",
    "i": 1
  },
  {
    "e": "Estrada Correa, Francisco Javier Emiliano",
    "i": 1
  },
  {
    "e": "Esquivel Moreno, Esteban Julián",
    "i": 1
  },
  {
    "e": "Esquivel Alva, Víctor Manuel",
    "i": 1
  },
  {
    "e": "Espacio para Líderes",
    "i": 1
  },
  {
    "e": "Eslava Herrada, Emilio Juan",
    "i": 1
  },
  {
    "e": "Escritores en Lenguas Indígenas",
    "i": 1
  },
  {
    "e": "Escamilla Barragán, Karla",
    "i": 1
  },
  {
    "e": "Escalante de la Hidalga, José Ignacio",
    "i": 1
  },
  {
    "e": "Escalante de la Hidalga, Ernesto Francisco",
    "i": 1
  },
  {
    "e": "Escalante Ochoa, Mónica Guadalupe",
    "i": 1
  },
  {
    "e": "Escajeda Pineda, Luis Cuauhtémoc",
    "i": 1
  },
  {
    "e": "Enríquez Ortíz, María Soledad",
    "i": 1
  },
  {
    "e": "Encuentro para el  Camino para la Promoción de la Cultura y el Arte Popular en el Estado de Oaxaca",
    "i": 1
  },
  {
    "e": "Empresa Distribuidora FEDS",
    "i": 1
  },
  {
    "e": "El Colegio de Chihuahua",
    "i": 1
  },
  {
    "e": "Efecto Creativo",
    "i": 1
  },
  {
    "e": "Ednica",
    "i": 1
  },
  {
    "e": "Editorial Átman",
    "i": 1
  },
  {
    "e": "Editorial de la Confederación de las Uniones Sociales de Empresarios de México",
    "i": 1
  },
  {
    "e": "Editorial Valegra",
    "i": 1
  },
  {
    "e": "Editorial Turner de México",
    "i": 1
  },
  {
    "e": "Editorial Sarriá México",
    "i": 1
  },
  {
    "e": "Editorial Psicoanalítica de la Letra",
    "i": 1
  },
  {
    "e": "Editorial Novecientos Diez",
    "i": 1
  },
  {
    "e": "Editorial Libra",
    "i": 1
  },
  {
    "e": "Editorial Las Ánimas",
    "i": 1
  },
  {
    "e": "Editorial Kapelmex",
    "i": 1
  },
  {
    "e": "Editorial Fusión",
    "i": 1
  },
  {
    "e": "Editorial Ferrato",
    "i": 1
  },
  {
    "e": "Editorial Eter",
    "i": 1
  },
  {
    "e": "Editorial Dos Líneas",
    "i": 1
  },
  {
    "e": "Editorial Conexión Gráfica",
    "i": 1
  },
  {
    "e": "Editorial Botello",
    "i": 1
  },
  {
    "e": "Editorial 905",
    "i": 1
  },
  {
    "e": "Editions 99 de América",
    "i": 1
  },
  {
    "e": "Ediciones Regina Tiempo de Letras",
    "i": 1
  },
  {
    "e": "Ediciones Novena Estrella",
    "i": 1
  },
  {
    "e": "Ediciones Duruelo",
    "i": 1
  },
  {
    "e": "Ediciones Coyoacán",
    "i": 1
  },
  {
    "e": "Edibca de México",
    "i": 1
  },
  {
    "e": "Echevarria y Romo, Cosme Genaro",
    "i": 1
  },
  {
    "e": "Díaz Enciso Raúl Fernando",
    "i": 1
  },
  {
    "e": "Díaz Duncan, Norma",
    "i": 1
  },
  {
    "e": "Durazo Barceló, María Soledad",
    "i": 1
  },
  {
    "e": "Dornbierer Moch, Manú Mariana Teresa",
    "i": 1
  },
  {
    "e": "Donadieu Martinez, Arturo",
    "i": 1
  },
  {
    "e": "Domínguez López, Bertha Guadalupe",
    "i": 1
  },
  {
    "e": "Dogart Murrieta, José Alberto",
    "i": 1
  },
  {
    "e": "Distribuidora de Libros Didácticos",
    "i": 1
  },
  {
    "e": "Difusión y Fomento Cultural",
    "i": 1
  },
  {
    "e": "Difusión & Tecnología",
    "i": 1
  },
  {
    "e": "Dicograf",
    "i": 1
  },
  {
    "e": "Delmott Aboytes, Gabriel",
    "i": 1
  },
  {
    "e": "Delfín Lara, Sergio Antonio",
    "i": 1
  },
  {
    "e": "Delegación Coyoacán",
    "i": 1
  },
  {
    "e": "Del Valle Herrejón, Oscar Radames",
    "i": 1
  },
  {
    "e": "Del Rosal Gutiérrez, Karina",
    "i": 1
  },
  {
    "e": "Del Arenal Perez, Monica Andrea",
    "i": 1
  },
  {
    "e": "De la Portilla Vieyra, Julia Angélica",
    "i": 1
  },
  {
    "e": "De la Maza Benignos, Mauricio",
    "i": 1
  },
  {
    "e": "De la Macorra Noriega, María José",
    "i": 1
  },
  {
    "e": "De la Garza Barajas, Refugio Fidencio",
    "i": 1
  },
  {
    "e": "De la Barreda, Leticia",
    "i": 1
  },
  {
    "e": "De Arana Castro, Guillermo",
    "i": 1
  },
  {
    "e": "Dalband, Hassan",
    "i": 1
  },
  {
    "e": "Dabdoub Gomez, Enrique",
    "i": 1
  },
  {
    "e": "D'Arbel Carlos, Martha Gabriela",
    "i": 1
  },
  {
    "e": "Córdova Escalante, Norma Angélica",
    "i": 1
  },
  {
    "e": "Círculo Psicoanalítico Mexicano",
    "i": 1
  },
  {
    "e": "Cárdenas Pozos, Ma. del Carmen",
    "i": 1
  },
  {
    "e": "Cárdenas Estandía, Rogelio",
    "i": 1
  },
  {
    "e": "Cárdenas Acevedo, Ayde Mavy",
    "i": 1
  },
  {
    "e": "Cámara Española de Comercio",
    "i": 1
  },
  {
    "e": "Cuén y Aragón, Rubén Emilio",
    "i": 1
  },
  {
    "e": "Cuántica Metatrón",
    "i": 1
  },
  {
    "e": "Cuellar Herrera, Luis",
    "i": 1
  },
  {
    "e": "Cuellar Amozorrutia, Francisco",
    "i": 1
  },
  {
    "e": "Cruz Pérez, María del Pilar",
    "i": 1
  },
  {
    "e": "Cruz Morales, Javier Armando",
    "i": 1
  },
  {
    "e": "Cruz Chávez, Marco Antonio",
    "i": 1
  },
  {
    "e": "Cruz Aguilera, Elena",
    "i": 1
  },
  {
    "e": "Crisantes Peraza, Magda Isabel",
    "i": 1
  },
  {
    "e": "Covián Andrade, Miguel",
    "i": 1
  },
  {
    "e": "Cortés Martínez, José Francisco",
    "i": 1
  },
  {
    "e": "Cortina del Valle, Elena",
    "i": 1
  },
  {
    "e": "Cortez Jaimes, Julio Cesar",
    "i": 1
  },
  {
    "e": "Cortes Fuentes, Francisco Javier",
    "i": 1
  },
  {
    "e": "Correo del Maestro",
    "i": 1
  },
  {
    "e": "Corporativo Editorial Tauro",
    "i": 1
  },
  {
    "e": "Corporación de Conexión Publicitara",
    "i": 1
  },
  {
    "e": "Corona Pérez, Guadalupe Fabiola",
    "i": 1
  },
  {
    "e": "Corona Armendáriz, Elizabeth",
    "i": 1
  },
  {
    "e": "Cordero Palau, Jorge",
    "i": 1
  },
  {
    "e": "Contreras Hernández, Salvador",
    "i": 1
  },
  {
    "e": "Contreras García, Gilbert Francis",
    "i": 1
  },
  {
    "e": "Consejo de la Judicatura Federal",
    "i": 1
  },
  {
    "e": "Consejo de Ciencia y Tecnología del Estado de Morelos",
    "i": 1
  },
  {
    "e": "Consejo Puebla de Lectura",
    "i": 1
  },
  {
    "e": "Consejo Nacional de Ciencia y Tecnología",
    "i": 1
  },
  {
    "e": "Consejo Mexicano para la Acreditación de Enfermería",
    "i": 1
  },
  {
    "e": "Consejo Mexicano de Investigación Educativa",
    "i": 1
  },
  {
    "e": "Conocimiento y Saber Siglo XXI",
    "i": 1
  },
  {
    "e": "Comunidad Universitaria del Golfo Centro",
    "i": 1
  },
  {
    "e": "Comunicación e Información",
    "i": 1
  },
  {
    "e": "Comité de Acción para el Saneamiento del Ambiente",
    "i": 1
  },
  {
    "e": "Comisión para la Regularización de la Tenencia de la Tierra",
    "i": 1
  },
  {
    "e": "Comisión de Derechos Humanos del Estado de México",
    "i": 1
  },
  {
    "e": "Comisión Organizadora del Estado de Chiapas para la Conmemoración del Bicentenario de la Independencia y del Centenario de la Revolución Mexicana",
    "i": 1
  },
  {
    "e": "Comisión Estatal para el Acceso a la Información Pública del Estado de Sinaloa",
    "i": 1
  },
  {
    "e": "Colegio de Historia de Tlaxcala",
    "i": 1
  },
  {
    "e": "Colegio Mexicano de Matemática Educativa",
    "i": 1
  },
  {
    "e": "Colectivo de Análisis de la Seguridad con Democracia",
    "i": 1
  },
  {
    "e": "Colchado Valenzuela, Rolando",
    "i": 1
  },
  {
    "e": "Cohen Jafif, José",
    "i": 1
  },
  {
    "e": "Club de Golf Chapultepec",
    "i": 1
  },
  {
    "e": "Cisneros Castillòn, Luis Miguel",
    "i": 1
  },
  {
    "e": "Ciclos de Vida",
    "i": 1
  },
  {
    "e": "Chromatos",
    "i": 1
  },
  {
    "e": "Chong Zamorano, Manuel",
    "i": 1
  },
  {
    "e": "Chico Ponce de León, Fernando",
    "i": 1
  },
  {
    "e": "Cherem Haber, Elias",
    "i": 1
  },
  {
    "e": "Chapa González, Yolanda del Socorro",
    "i": 1
  },
  {
    "e": "Chapa Benavides, Gerardo",
    "i": 1
  },
  {
    "e": "Chabaud Magnus, Jaime Eduardo",
    "i": 1
  },
  {
    "e": "Cervantes Villa, Martha",
    "i": 1
  },
  {
    "e": "Cervantes Cota, Alma Teresita",
    "i": 1
  },
  {
    "e": "Cerro Largo Ediciones",
    "i": 1
  },
  {
    "e": "Centros Culturales de México",
    "i": 1
  },
  {
    "e": "Centro para el Fomento de la Educación y Salud de los Operarios del Transporte Público de la Ciudad de México",
    "i": 1
  },
  {
    "e": "Centro de Producción Artística y Desarrollo Cultural del Estado de Michoacán de Ocampo",
    "i": 1
  },
  {
    "e": "Centro de Investigación en Alimentación y Desarrollo",
    "i": 1
  },
  {
    "e": "Centro de Investigación de Negocios Internacionales",
    "i": 1
  },
  {
    "e": "Centro de Investigaciones en Óptica",
    "i": 1
  },
  {
    "e": "Centro de Investigaciones Pedagógicas y Sociales",
    "i": 1
  },
  {
    "e": "Centro Universitario Doctor Emilio Cárdenas",
    "i": 1
  },
  {
    "e": "Centro Nacional de Evaluación para la Educación Superior",
    "i": 1
  },
  {
    "e": "Centro Mexicano de Derecho Ambiental",
    "i": 1
  },
  {
    "e": "Centro Caritas de Formación para la Atención de las Farmacodependencias y Situaciones Críticas Asociadas",
    "i": 1
  },
  {
    "e": "Celistia",
    "i": 1
  },
  {
    "e": "Cavazzani Camacho, Laura Patricia Concepción",
    "i": 1
  },
  {
    "e": "Católicas por el Derecho a Decidir",
    "i": 1
  },
  {
    "e": "Castro Rojas, Omar",
    "i": 1
  },
  {
    "e": "Castillo Lopez, Adelfo",
    "i": 1
  },
  {
    "e": "Castillo Juárez, Laura Itzel",
    "i": 1
  },
  {
    "e": "Castellanos Ruelas, Arturo Francisco",
    "i": 1
  },
  {
    "e": "Castañeda Utrilla, Fernando",
    "i": 1
  },
  {
    "e": "Casasús Barrera, Nora Gabriela",
    "i": 1
  },
  {
    "e": "Casanovas Madariaga, Carmen Antonieta Adelfa",
    "i": 1
  },
  {
    "e": "Casa Refugio Citlaltépetl",
    "i": 1
  },
  {
    "e": "Carrizales Núñez, Roxana",
    "i": 1
  },
  {
    "e": "Carpenter Consulting Group",
    "i": 1
  },
  {
    "e": "Cardona Olvera, Silvia",
    "i": 1
  },
  {
    "e": "Cantoral Zucchi, José",
    "i": 1
  },
  {
    "e": "Campos Montejo, Rodolfo",
    "i": 1
  },
  {
    "e": "Caminos Posibles Investigación, Capacitación y Desarrollo",
    "i": 1
  },
  {
    "e": "Camelo Martínez, Mercedes Terecita",
    "i": 1
  },
  {
    "e": "Camargo Nassar, Javier Ignacio",
    "i": 1
  },
  {
    "e": "Camarena Quiroz, Luis Arturo",
    "i": 1
  },
  {
    "e": "Caloca Santana, Blanca Estela",
    "i": 1
  },
  {
    "e": "Calderón Gómez, Alfredo Dionisio",
    "i": 1
  },
  {
    "e": "Cabrera Negrete, Juan Francisco",
    "i": 1
  },
  {
    "e": "Cabello Galicia, Gerardo Angel",
    "i": 1
  },
  {
    "e": "Caballero Santibañez, Olivia",
    "i": 1
  },
  {
    "e": "Bustillos Zamorano, Justo Javier",
    "i": 1
  },
  {
    "e": "Bustamante Anchondo, Norma Socorro",
    "i": 1
  },
  {
    "e": "Bravo Vargas, Gerardo",
    "i": 1
  },
  {
    "e": "Brainware",
    "i": 1
  },
  {
    "e": "Borbon Ramos, Rafael",
    "i": 1
  },
  {
    "e": "Bodenstedt Engel, Arturo Walter",
    "i": 1
  },
  {
    "e": "Blass Jaimes, José Marzel Edoc",
    "i": 1
  },
  {
    "e": "Blanco Nuñez, Sergio",
    "i": 1
  },
  {
    "e": "Bertely Busquets, Vicente",
    "i": 1
  },
  {
    "e": "Bernal Magaña, Jesus",
    "i": 1
  },
  {
    "e": "Beristáin Romero, Cándido",
    "i": 1
  },
  {
    "e": "Berbera Editores",
    "i": 1
  },
  {
    "e": "Benemérito Instiuto Normal del Estado \"General Juan Crisostomo Bonilla\"",
    "i": 1
  },
  {
    "e": "Benemérita y Centenaria Escuela Normal del Estado de San Luis Potosí",
    "i": 1
  },
  {
    "e": "Benedetto Alexanderson, Bruno  Humberto",
    "i": 1
  },
  {
    "e": "Beltrán Guzmán, Francisco Javier",
    "i": 1
  },
  {
    "e": "Beltran Riquelme, Sandra Maria",
    "i": 1
  },
  {
    "e": "Bejarano y Sánchez, Manuel",
    "i": 1
  },
  {
    "e": "Becerril Ayala, Miguel",
    "i": 1
  },
  {
    "e": "Becerra Pino, Hernan de Jesus",
    "i": 1
  },
  {
    "e": "Bautista Gálvez, Arely",
    "i": 1
  },
  {
    "e": "Batista Jacquez, Flor Nakory",
    "i": 1
  },
  {
    "e": "Basurto Sotelo, Moisés",
    "i": 1
  },
  {
    "e": "Basail Heredia, Rodolfo Alvaro",
    "i": 1
  },
  {
    "e": "Barrueta Durán, Lucio",
    "i": 1
  },
  {
    "e": "Barroso Tapia, José Carlos",
    "i": 1
  },
  {
    "e": "Barrientos Ventosa, Leticia del Rosario",
    "i": 1
  },
  {
    "e": "Barrera Enderle, Alejandro",
    "i": 1
  },
  {
    "e": "Barranco Salazar, Eduardo",
    "i": 1
  },
  {
    "e": "Bardullas Nuñez, Luis Carlos",
    "i": 1
  },
  {
    "e": "Azorin Castellano, Angel Raul",
    "i": 1
  },
  {
    "e": "Azcona Priego, Olivia del Carmen",
    "i": 1
  },
  {
    "e": "Azar Hassoune, Roy",
    "i": 1
  },
  {
    "e": "Ayala Serrano, Lauro Eduardo",
    "i": 1
  },
  {
    "e": "Avila Ramírez, Olga Herlinda",
    "i": 1
  },
  {
    "e": "Autovías Concesionadas Mexiquenses",
    "i": 1
  },
  {
    "e": "Autobuses de Oriente A.D.O.",
    "i": 1
  },
  {
    "e": "Ateneo Español de México",
    "i": 1
  },
  {
    "e": "Asociación de Educadores Mexicanos",
    "i": 1
  },
  {
    "e": "Asociación Nacional del Libro",
    "i": 1
  },
  {
    "e": "Asociación Nacional de Médicos Veterinarios Especialistas en Abejas",
    "i": 1
  },
  {
    "e": "Asociación Nacional de Energía Solar",
    "i": 1
  },
  {
    "e": "Asociación México Japonesa",
    "i": 1
  },
  {
    "e": "Asociación Mexicana de Estudios Rurales",
    "i": 1
  },
  {
    "e": "Asociación Mexicana de Alternativas en Psicología",
    "i": 1
  },
  {
    "e": "Asociación Cultural Na Bolom",
    "i": 1
  },
  {
    "e": "Asesoría de Diseños Normativos",
    "i": 1
  },
  {
    "e": "Asesores en Prensa y Comunicación",
    "i": 1
  },
  {
    "e": "Asesor Pedagógico",
    "i": 1
  },
  {
    "e": "Aschentrupp Mateu, Helen",
    "i": 1
  },
  {
    "e": "Arturo Rios Ruiz",
    "i": 1
  },
  {
    "e": "Arrioja Poblano, Josue",
    "i": 1
  },
  {
    "e": "Arrazola García, Bernardino Miguel Ángel",
    "i": 1
  },
  {
    "e": "Arquine",
    "i": 1
  },
  {
    "e": "Ariza Azpíroz, Héctor Fernando",
    "i": 1
  },
  {
    "e": "Arias González, Jesús Alejandro",
    "i": 1
  },
  {
    "e": "Argüelles Espinosa, Luis Ángel",
    "i": 1
  },
  {
    "e": "Arenas Guzmán, Roberto",
    "i": 1
  },
  {
    "e": "Arellano Rocha, María del Rosario",
    "i": 1
  },
  {
    "e": "Arellano Avitia, Flavio",
    "i": 1
  },
  {
    "e": "Archivo General de la Nación",
    "i": 1
  },
  {
    "e": "Aranda Beltrán, Carolina",
    "i": 1
  },
  {
    "e": "Ar Kaktus Sistema Gráfico",
    "i": 1
  },
  {
    "e": "Antillón Kantrowitz, Lisa",
    "i": 1
  },
  {
    "e": "Andrade Guerrero, Jimena",
    "i": 1
  },
  {
    "e": "Amistad Comunicaciones",
    "i": 1
  },
  {
    "e": "Amerena Mariscal, Maria Eugenia",
    "i": 1
  },
  {
    "e": "Alós  Sala, Gabriel",
    "i": 1
  },
  {
    "e": "Alvo Rabinovitz, Sandra",
    "i": 1
  },
  {
    "e": "Alvarez Ponce de León, Carlos Arturo",
    "i": 1
  },
  {
    "e": "Alternativas Arte y Cultura",
    "i": 1
  },
  {
    "e": "Alonso Quiroz, Juan Isidro",
    "i": 1
  },
  {
    "e": "Aliento Naciones",
    "i": 1
  },
  {
    "e": "Alfaro Castro, Eulalio",
    "i": 1
  },
  {
    "e": "Aldrete Haas, Jose Antonio",
    "i": 1
  },
  {
    "e": "Alarini Monzon, Maria Cristina",
    "i": 1
  },
  {
    "e": "Agüero Rodriguez, Jose Cruz",
    "i": 1
  },
  {
    "e": "Aguirre Roiz, Ivonne Elizabeth",
    "i": 1
  },
  {
    "e": "Aguirre Rodríguez, Marco Antonio",
    "i": 1
  },
  {
    "e": "Aguirre Güemez, José Antonio",
    "i": 1
  },
  {
    "e": "Aguirre Cárdenas, Irma Inés",
    "i": 1
  },
  {
    "e": "Aguirre Ceballos, Maria Enriqueta",
    "i": 1
  },
  {
    "e": "Aguilera Aguirre, Elard",
    "i": 1
  },
  {
    "e": "Aguilar Ramon, Sergio",
    "i": 1
  },
  {
    "e": "Aguilar Carrillo, Ricardo Miguel",
    "i": 1
  },
  {
    "e": "Aguila Rodríguez, Gerardo",
    "i": 1
  },
  {
    "e": "Afluentes",
    "i": 1
  },
  {
    "e": "Adam Siade, Juan Alberto",
    "i": 1
  },
  {
    "e": "Acosta Sámano, Sonia Rocío",
    "i": 1
  },
  {
    "e": "Aceves Villagran, Daniel",
    "i": 1
  },
  {
    "e": "Aceves Hernandez, Francisco Javier",
    "i": 1
  },
  {
    "e": "Academia Tamaulipeca de Investigación Científica y Tecnológica",
    "i": 1
  },
  {
    "e": "Academia Mexicana Multidisciplinaria",
    "i": 1
  },
  {
    "e": "Abdo Producciones",
    "i": 1
  },
  {
    "e": "Abacar Ediciones",
    "i": 1
  },
  {
    "e": "Árbol Editorial",
    "i": 1
  }
]