[
  {
    "e": "Universidad Nacional Autónoma de México",
    "i": 1191
  },
  {
    "e": "Penguin Random House Grupo Editorial",
    "i": 1139
  },
  {
    "e": "Editorial Planeta Mexicana",
    "i": 861
  },
  {
    "e": "Editorial Panini México",
    "i": 634
  },
  {
    "e": "Ediciones Castillo",
    "i": 418
  },
  {
    "e": "Pearson Educación de México",
    "i": 363
  },
  {
    "e": "Fondo de Cultura Económica",
    "i": 341
  },
  {
    "e": "Grupo Editorial Patria",
    "i": 308
  },
  {
    "e": "Editorial Santillana",
    "i": 293
  },
  {
    "e": "Universidad Autónoma Metropolitana",
    "i": 284
  },
  {
    "e": "Universidad de Guadalajara",
    "i": 264
  },
  {
    "e": "Editorial Progreso",
    "i": 251
  },
  {
    "e": "SM de Ediciones",
    "i": 233
  },
  {
    "e": "Editorial Trillas",
    "i": 206
  },
  {
    "e": "Montenegro Editores",
    "i": 178
  },
  {
    "e": "Secretaría de Educación Pública",
    "i": 175
  },
  {
    "e": "Editores Mexicanos Unidos",
    "i": 174
  },
  {
    "e": "Ediciones Culturales Paidós",
    "i": 174
  },
  {
    "e": "Advanced Marketing",
    "i": 169
  },
  {
    "e": "Editorial Porrúa",
    "i": 167
  },
  {
    "e": "Sistemas Educativos de Enseñanza",
    "i": 161
  },
  {
    "e": "Instituto Nacional Electoral",
    "i": 159
  },
  {
    "e": "Dirección General de Materiales Educativos",
    "i": 159
  },
  {
    "e": "Universidad Autónoma de Nuevo León",
    "i": 157
  },
  {
    "e": "Alfaomega Grupo Editor",
    "i": 152
  },
  {
    "e": "Agencia Promotora de Publicaciones",
    "i": 146
  },
  {
    "e": "Richmond Publishing",
    "i": 135
  },
  {
    "e": "Editorial Océano México",
    "i": 132
  },
  {
    "e": "Universidad de La Ciénega del Estado de Michoacán de Ocampo",
    "i": 129
  },
  {
    "e": "Vanguardia Educativa Santillana Compartir",
    "i": 124
  },
  {
    "e": "Ediciones Larousse",
    "i": 124
  },
  {
    "e": "Educa Inventia",
    "i": 120
  },
  {
    "e": "Universidad de Guanajuato",
    "i": 116
  },
  {
    "e": "Instituto Nacional de Investigaciones Forestales Agrícolas y Pecuarias",
    "i": 115
  },
  {
    "e": "Editorial Vortex",
    "i": 110
  },
  {
    "e": "Editorial Terracota",
    "i": 109
  },
  {
    "e": "Universidad Iberoamericana",
    "i": 107
  },
  {
    "e": "Universidad Autónoma del Estado de México",
    "i": 106
  },
  {
    "e": "Tax Editores Unidos",
    "i": 104
  },
  {
    "e": "Universidad Autónoma de Aguascalientes",
    "i": 99
  },
  {
    "e": "Colofón",
    "i": 96
  },
  {
    "e": "Instituto Mexicano de Contadores Públicos",
    "i": 92
  },
  {
    "e": "RBA Editores México",
    "i": 91
  },
  {
    "e": "Intersistemas",
    "i": 90
  },
  {
    "e": "Universidad Veracruzana",
    "i": 86
  },
  {
    "e": "Mc Graw-Hill Interamericana Editores",
    "i": 86
  },
  {
    "e": "El Colegio de México",
    "i": 84
  },
  {
    "e": "Dofiscal Editores",
    "i": 82
  },
  {
    "e": "Conferencia Interamericana de Seguridad Social",
    "i": 81
  },
  {
    "e": "Flores Editor y Distribuidor",
    "i": 78
  },
  {
    "e": "Instituto Nacional de Antropología e Historia",
    "i": 74
  },
  {
    "e": "Secretaría de Turismo",
    "i": 73
  },
  {
    "e": "Cengage Learning Editores",
    "i": 73
  },
  {
    "e": "Grupo Editorial Miguel Ángel Porrúa",
    "i": 72
  },
  {
    "e": "Ediciones Del Lirio",
    "i": 72
  },
  {
    "e": "Siglo XXI Editores",
    "i": 69
  },
  {
    "e": "Instituto Nacional de Estudios Históricos de las Revoluciones de México",
    "i": 67
  },
  {
    "e": "Bonilla Distribución y Edición",
    "i": 67
  },
  {
    "e": "Universidad Autónoma del Estado de Baja California",
    "i": 66
  },
  {
    "e": "Almadía Ediciones",
    "i": 65
  },
  {
    "e": "Producciones Sin Sentido Común",
    "i": 64
  },
  {
    "e": "El Colegio de Jalisco",
    "i": 64
  },
  {
    "e": "Universidad Autónoma de San Luis Potosí",
    "i": 63
  },
  {
    "e": "Secretaría de Educación de Veracruz",
    "i": 63
  },
  {
    "e": "Umbral Editorial",
    "i": 61
  },
  {
    "e": "Tribunal Electoral del Poder Judicial de la Federación",
    "i": 60
  },
  {
    "e": "Book Mart",
    "i": 54
  },
  {
    "e": "Universidad Autónoma del Estado de Morelos",
    "i": 52
  },
  {
    "e": "Instituto Nacional de Ciencias Penales",
    "i": 52
  },
  {
    "e": "Puertabierta Editores",
    "i": 50
  },
  {
    "e": "Universidad Autónoma de Querétaro",
    "i": 49
  },
  {
    "e": "Lito-Grapo",
    "i": 49
  },
  {
    "e": "Editorial Themis",
    "i": 49
  },
  {
    "e": "VR Editoras",
    "i": 48
  },
  {
    "e": "Universidad Autónoma de Tamaulipas",
    "i": 48
  },
  {
    "e": "Technology Research Applied Creation and Kwowledge",
    "i": 47
  },
  {
    "e": "Innovación Editorial Lagares de México",
    "i": 47
  },
  {
    "e": "Benemérita Universidad Autónoma de Puebla",
    "i": 47
  },
  {
    "e": "Secretaría de Cultura de Tabasco",
    "i": 45
  },
  {
    "e": "Ediciones Era",
    "i": 45
  },
  {
    "e": "Universidad de Sonora",
    "i": 44
  },
  {
    "e": "Méndez Cortés Editores",
    "i": 44
  },
  {
    "e": "Editorial Fontamara",
    "i": 44
  },
  {
    "e": "Ediciones Fiscales ISEF",
    "i": 43
  },
  {
    "e": "Universidad Michoacana de San Nicolás de Hidalgo",
    "i": 42
  },
  {
    "e": "Instituto de Investigaciones Dr. José María Luis Mora",
    "i": 42
  },
  {
    "e": "Harpercollins México",
    "i": 42
  },
  {
    "e": "Red Iberoamericana de Academias de Investigación",
    "i": 41
  },
  {
    "e": "Fundación Friedrich Ebert",
    "i": 41
  },
  {
    "e": "Excelencia Educativa Asesoría Profesional Docente",
    "i": 41
  },
  {
    "e": "Editorial Morevalladolid",
    "i": 41
  },
  {
    "e": "Sextil Online",
    "i": 40
  },
  {
    "e": "Grupo Bestway",
    "i": 40
  },
  {
    "e": "Editorial Esfinge",
    "i": 40
  },
  {
    "e": "Crea Editorial",
    "i": 40
  },
  {
    "e": "Plaza y Valdés",
    "i": 39
  },
  {
    "e": "Juan Pablos Editor",
    "i": 39
  },
  {
    "e": "Universidad Autónoma de Ciudad Juárez",
    "i": 38
  },
  {
    "e": "Obra Nacional de la Buena Prensa",
    "i": 38
  },
  {
    "e": "El Colegio de la Frontera Sur",
    "i": 38
  },
  {
    "e": "Montiel & Soriano Editores",
    "i": 37
  },
  {
    "e": "Macmillan Publishers",
    "i": 37
  },
  {
    "e": "Estrada San Miguel Francisco Javier",
    "i": 37
  },
  {
    "e": "El Colegio de Michoacán",
    "i": 37
  },
  {
    "e": "Suprema Corte de Justicia de la Nación",
    "i": 36
  },
  {
    "e": "Facultad Latinoamericana de Ciencias Sociales",
    "i": 36
  },
  {
    "e": "El Colegio de San Luis",
    "i": 36
  },
  {
    "e": "Universidad Autónoma de Chiapas",
    "i": 35
  },
  {
    "e": "Textofilia",
    "i": 35
  },
  {
    "e": "Selector",
    "i": 34
  },
  {
    "e": "Elefanta del Sur",
    "i": 34
  },
  {
    "e": "El Colegio Nacional",
    "i": 34
  },
  {
    "e": "Centro de Investigaciones y Estudios Superiores en Antropología Social",
    "i": 34
  },
  {
    "e": "Escuela de Negocios y Consultoría Empresarial",
    "i": 33
  },
  {
    "e": "Ek Editores",
    "i": 33
  },
  {
    "e": "Secretaría de Cultura del Estado de México",
    "i": 31
  },
  {
    "e": "Centro de Investigación y Docencia Económicas",
    "i": 31
  },
  {
    "e": "AM Editores",
    "i": 31
  },
  {
    "e": "Texere Editores",
    "i": 30
  },
  {
    "e": "Instituto Tecnológico y de Estudios Superiores de Occidente",
    "i": 30
  },
  {
    "e": "Estampa Artes Gráficas",
    "i": 30
  },
  {
    "e": "El Colegio de Sonora",
    "i": 30
  },
  {
    "e": "Ediciones de Laurel",
    "i": 30
  },
  {
    "e": "Ediciones Navarra",
    "i": 30
  },
  {
    "e": "El Colegio de la Frontera Norte",
    "i": 29
  },
  {
    "e": "Universidad de Colima",
    "i": 28
  },
  {
    "e": "Universidad Autónoma de Sinaloa",
    "i": 28
  },
  {
    "e": "Méndez Editores",
    "i": 28
  },
  {
    "e": "Klik Soluciones Integrales",
    "i": 28
  },
  {
    "e": "Editorial Página Seis",
    "i": 28
  },
  {
    "e": "Castellanos Editores",
    "i": 28
  },
  {
    "e": "Universidad Autónoma de Guerrero",
    "i": 27
  },
  {
    "e": "Navarro Jurado Elvia Amalia",
    "i": 27
  },
  {
    "e": "Instituto Estatal de la Cultura",
    "i": 27
  },
  {
    "e": "Ediciones y Gráficos Eón",
    "i": 27
  },
  {
    "e": "Consejo Nacional para la Cultura y las Artes",
    "i": 27
  },
  {
    "e": "Editorial Fray Bartolomé de las Casas",
    "i": 26
  },
  {
    "e": "Ediciones ILCSA",
    "i": 26
  },
  {
    "e": "Universidad Pedagógica Nacional",
    "i": 25
  },
  {
    "e": "Universidad Autónoma de Coahuila",
    "i": 25
  },
  {
    "e": "Trilce Ediciones",
    "i": 25
  },
  {
    "e": "Ríos de Tinta",
    "i": 25
  },
  {
    "e": "Moreno Soto David",
    "i": 25
  },
  {
    "e": "Instituto Zacatecano de Cultura",
    "i": 25
  },
  {
    "e": "Instituto Municipal de Investigación y Planeación",
    "i": 25
  },
  {
    "e": "Instituto Electoral de la Ciudad de México",
    "i": 25
  },
  {
    "e": "Editorial Arquinza",
    "i": 25
  },
  {
    "e": "Editorial Alfil",
    "i": 25
  },
  {
    "e": "Centros Culturales de México",
    "i": 25
  },
  {
    "e": "Universidad de Ciencias y Artes de Chiapas",
    "i": 24
  },
  {
    "e": "Universidad Autónoma de la Ciudad de México",
    "i": 24
  },
  {
    "e": "Universidad Autónoma de Zacatecas",
    "i": 24
  },
  {
    "e": "Prometeo Editores",
    "i": 24
  },
  {
    "e": "Piso 15 Editorial",
    "i": 24
  },
  {
    "e": "Edicionesakal México",
    "i": 24
  },
  {
    "e": "Edebé, Ediciones Internacionales",
    "i": 24
  },
  {
    "e": "Difusión Rosacruz Amorc",
    "i": 24
  },
  {
    "e": "Cámara de Senadores",
    "i": 24
  },
  {
    "e": "Centro Regional de Formación Docente e Investigación Educativa Chiapas",
    "i": 24
  },
  {
    "e": "Secretaría de Turismo y Cultura del Poder Ejecutivo del Gobierno del Estado de Morelos",
    "i": 23
  },
  {
    "e": "La Torre del Vigía",
    "i": 23
  },
  {
    "e": "Gutiérrez Ramírez, Alfredo",
    "i": 23
  },
  {
    "e": "Editorial El Manual Moderno",
    "i": 23
  },
  {
    "e": "Ediciones Luna de Papel",
    "i": 23
  },
  {
    "e": "Consejo Estatal para las Culturas y las Artes de Chiapas",
    "i": 23
  },
  {
    "e": "Book Depot",
    "i": 23
  },
  {
    "e": "Universidad Autónoma de Chihuahua",
    "i": 22
  },
  {
    "e": "Mendoza Ruiz Fortino Ramón",
    "i": 22
  },
  {
    "e": "Majestic Education",
    "i": 22
  },
  {
    "e": "Lizárraga Sánchez María del Carmen",
    "i": 22
  },
  {
    "e": "Libros Grano de Sal",
    "i": 22
  },
  {
    "e": "Grupo Editor Orfila Valentini",
    "i": 22
  },
  {
    "e": "Editorial Font",
    "i": 22
  },
  {
    "e": "Colegio de Postgraduados",
    "i": 22
  },
  {
    "e": "Honorable Cámara de Diputados",
    "i": 21
  },
  {
    "e": "Grupo Asesor de Formación y Recursos Académicos",
    "i": 21
  },
  {
    "e": "Altres Costa-Amic Editores",
    "i": 21
  },
  {
    "e": "Salinas Quiñones Gilda Consuelo",
    "i": 20
  },
  {
    "e": "Rodríguez Sánchez María Salud",
    "i": 20
  },
  {
    "e": "Proveedora Gráfica de Oaxaca",
    "i": 20
  },
  {
    "e": "Newton Edición y Tecnología Educativa",
    "i": 20
  },
  {
    "e": "Lid Editorial Mexicana",
    "i": 20
  },
  {
    "e": "Librería de Porrúa Hermanos y Compañía",
    "i": 20
  },
  {
    "e": "Editorial Notas Universitarias",
    "i": 20
  },
  {
    "e": "Editorial Caze",
    "i": 20
  },
  {
    "e": "Editora Nómada",
    "i": 20
  },
  {
    "e": "Cruz Cruz Ana Iris",
    "i": 20
  },
  {
    "e": "Comparan Editores Asociados",
    "i": 20
  },
  {
    "e": "Alborez García,Ricardo",
    "i": 20
  },
  {
    "e": "Universidad Juárez Autónoma de Tabasco",
    "i": 19
  },
  {
    "e": "Quintanilla Rodríguez María de los Dolores Francisca",
    "i": 19
  },
  {
    "e": "Instituto Nacional de Bellas Artes y Literatura",
    "i": 19
  },
  {
    "e": "Grupo de Servicios Gráficos del Centro",
    "i": 19
  },
  {
    "e": "Grupo Editorial Hess",
    "i": 19
  },
  {
    "e": "Fundación Universidad de las Américas, Puebla",
    "i": 19
  },
  {
    "e": "Editorial Prado",
    "i": 19
  },
  {
    "e": "Editora del Gobierno del Estado Libre y Soberano de Veracruz Llave",
    "i": 19
  },
  {
    "e": "Ediciones Dabar",
    "i": 19
  },
  {
    "e": "Agencia de Publicaciones México Central",
    "i": 19
  },
  {
    "e": "Universidad La Salle",
    "i": 18
  },
  {
    "e": "Ubijus Editorial",
    "i": 18
  },
  {
    "e": "Taberna Libraria Editores",
    "i": 18
  },
  {
    "e": "Secretaría de Cultura de Chihuahua",
    "i": 18
  },
  {
    "e": "Perla Ediciones, S.A. de C.V.",
    "i": 18
  },
  {
    "e": "PPC Editorial",
    "i": 18
  },
  {
    "e": "Instituto Sinaloense de Cultura",
    "i": 18
  },
  {
    "e": "Grafisma Editores",
    "i": 18
  },
  {
    "e": "Editorial Limusa",
    "i": 18
  },
  {
    "e": "Editorial Lectorum",
    "i": 18
  },
  {
    "e": "De Giovannini Saldívar Juan José",
    "i": 18
  },
  {
    "e": "Braun Guillén Mónica Iliana",
    "i": 18
  },
  {
    "e": "V2 Services",
    "i": 17
  },
  {
    "e": "Universidad Tecnocientífica del Pacífico",
    "i": 17
  },
  {
    "e": "Saavedra Castillo Horacio Gabriel",
    "i": 17
  },
  {
    "e": "Ramos Escamilla, María de Jesús",
    "i": 17
  },
  {
    "e": "Par Tres Editores",
    "i": 17
  },
  {
    "e": "Observatorio Ciudadano de Seguridad, Justicia y Legalidad",
    "i": 17
  },
  {
    "e": "Instituto Electoral del Estado de México",
    "i": 17
  },
  {
    "e": "Ediciones La Biblioteca",
    "i": 17
  },
  {
    "e": "Consejo para la Cultura y las Artes de Nuevo León",
    "i": 17
  },
  {
    "e": "Centro de Investigación y Asistencia en Tecnología y Diseño del Estado de Jalisco",
    "i": 17
  },
  {
    "e": "Universidad del Caribe",
    "i": 16
  },
  {
    "e": "Universidad de Xalapa",
    "i": 16
  },
  {
    "e": "Universidad de Quintana Roo",
    "i": 16
  },
  {
    "e": "Universidad Autónoma del Estado de Hidalgo",
    "i": 16
  },
  {
    "e": "Torres José Alfredo",
    "i": 16
  },
  {
    "e": "Proveedora de Textos de Monterrey",
    "i": 16
  },
  {
    "e": "Novelty Corp de México",
    "i": 16
  },
  {
    "e": "Hamui Picciotto Jeannette",
    "i": 16
  },
  {
    "e": "Comunicación e Información",
    "i": 16
  },
  {
    "e": "Centro de Investigación en Ciencias de Información Geoespacial",
    "i": 16
  },
  {
    "e": "Anglodigital",
    "i": 16
  },
  {
    "e": "Academia Mexicana de la Lengua",
    "i": 16
  },
  {
    "e": "Universidad Pedagógica de Durango",
    "i": 15
  },
  {
    "e": "Instituto Sonorense de Cultura",
    "i": 15
  },
  {
    "e": "Grupo Editorial y Digital El Puente.Com",
    "i": 15
  },
  {
    "e": "Escuela de Estudios Jurídicos y Fiscales Cisneros Rico",
    "i": 15
  },
  {
    "e": "Editorial Ediciones Escolares de Occidente",
    "i": 15
  },
  {
    "e": "Editorial Cuellar Ayala",
    "i": 15
  },
  {
    "e": "Cromberger Editores e Impresores",
    "i": 15
  },
  {
    "e": "Consejo Estatal para la Cultura y las Artes de Hidalgo",
    "i": 15
  },
  {
    "e": "Coello Rodríguez Laura Elena",
    "i": 15
  },
  {
    "e": "Universidad Autónoma de Yucatán",
    "i": 14
  },
  {
    "e": "Universidad Autónoma de Tlaxcala",
    "i": 14
  },
  {
    "e": "Universidad Autónoma de Nayarit",
    "i": 14
  },
  {
    "e": "Temacilli Editorial",
    "i": 14
  },
  {
    "e": "Productora de Contenidos Culturales Sagahon Repoll",
    "i": 14
  },
  {
    "e": "Procesos Editoriales Don José",
    "i": 14
  },
  {
    "e": "García Guzmán Miguel Ángel",
    "i": 14
  },
  {
    "e": "El Diván Negro",
    "i": 14
  },
  {
    "e": "Editorial Médica Panamericana",
    "i": 14
  },
  {
    "e": "Consire",
    "i": 14
  },
  {
    "e": "Bonobos Editores",
    "i": 14
  },
  {
    "e": "Barajas Martínez Lilia",
    "i": 14
  },
  {
    "e": "Armenta Malpica Luis",
    "i": 14
  },
  {
    "e": "Ulloa & Wiant Editores",
    "i": 13
  },
  {
    "e": "Porrúa Del Villar,Rosa María Guadalupe",
    "i": 13
  },
  {
    "e": "Navarro Saras Jaime",
    "i": 13
  },
  {
    "e": "Instituto de Estudios Constitucionales del Estado de Querétaro",
    "i": 13
  },
  {
    "e": "García Carrillo Roberto",
    "i": 13
  },
  {
    "e": "Fundación Crear Nos Hace Grandes",
    "i": 13
  },
  {
    "e": "El Colegio Mexiquense",
    "i": 13
  },
  {
    "e": "Editorial Elementum",
    "i": 13
  },
  {
    "e": "Cuellar Amozorrutia Cuauhtémoc Manuel",
    "i": 13
  },
  {
    "e": "Comisión Nacional de los Derechos Humanos",
    "i": 13
  },
  {
    "e": "Álvarez Bárcenas Angélica Graciela",
    "i": 12
  },
  {
    "e": "del Ángel Muñoz Varinia",
    "i": 12
  },
  {
    "e": "Universidad Popular Autónoma del Estado de Puebla",
    "i": 12
  },
  {
    "e": "Secretaría de Salud",
    "i": 12
  },
  {
    "e": "Publicaciones Paulinas",
    "i": 12
  },
  {
    "e": "Publicaciones Dharma Book & Publishing",
    "i": 12
  },
  {
    "e": "Promoción de la Cultura y la Educación Superior del Bajío",
    "i": 12
  },
  {
    "e": "Mora Zamarripa David",
    "i": 12
  },
  {
    "e": "Literatelia",
    "i": 12
  },
  {
    "e": "La Cifra Editorial",
    "i": 12
  },
  {
    "e": "Instituto Sudcaliforniano de Cultura",
    "i": 12
  },
  {
    "e": "Frovel Educación Editores",
    "i": 12
  },
  {
    "e": "Casa Editorial Regiomontana",
    "i": 12
  },
  {
    "e": "Casa Editorial Boek México",
    "i": 12
  },
  {
    "e": "CL Editorial Praxis",
    "i": 12
  },
  {
    "e": "Baca Espinoza, Héctor Ushiyama",
    "i": 12
  },
  {
    "e": "Atrasalante",
    "i": 12
  },
  {
    "e": "Universidad de Nuevas Ciencias Médicas",
    "i": 11
  },
  {
    "e": "Typotaller Ediciones",
    "i": 11
  },
  {
    "e": "Tresnubes",
    "i": 11
  },
  {
    "e": "Timon Editores",
    "i": 11
  },
  {
    "e": "Texcahua Condado Arturo",
    "i": 11
  },
  {
    "e": "Springer Nature México",
    "i": 11
  },
  {
    "e": "Secretaría de la Cultura y las Artes de Yucatán",
    "i": 11
  },
  {
    "e": "Publicaciones Administrativas Contables Jurídicas",
    "i": 11
  },
  {
    "e": "Olguín Reza,Hermenegildo",
    "i": 11
  },
  {
    "e": "Editorial Gedisa Mexicana",
    "i": 11
  },
  {
    "e": "Editorial Exponencial",
    "i": 11
  },
  {
    "e": "Chora Armando Mixcoac",
    "i": 11
  },
  {
    "e": "Ascencio Gómez Esteban",
    "i": 11
  },
  {
    "e": "Xpresión y Algo Más",
    "i": 10
  },
  {
    "e": "Universidad Juárez del Estado de Durango",
    "i": 10
  },
  {
    "e": "Universidad Autónoma Chapingo",
    "i": 10
  },
  {
    "e": "Shanti Go",
    "i": 10
  },
  {
    "e": "Readonline",
    "i": 10
  },
  {
    "e": "Pérez Mireles Juan Rodolfo",
    "i": 10
  },
  {
    "e": "Martínez Olvera Jacinto",
    "i": 10
  },
  {
    "e": "Grupo Rodrigo Porrúa",
    "i": 10
  },
  {
    "e": "Fundación Heínrich Böll e. V.",
    "i": 10
  },
  {
    "e": "Franco Deándar Gisela Iliana",
    "i": 10
  },
  {
    "e": "Editoriales e Industrias Creativas de México",
    "i": 10
  },
  {
    "e": "Editorial Resistencia",
    "i": 10
  },
  {
    "e": "Editorial Nueva Palabra",
    "i": 10
  },
  {
    "e": "Editorial Eterna Primavera",
    "i": 10
  },
  {
    "e": "Edilar",
    "i": 10
  },
  {
    "e": "Ediciones Tecolote",
    "i": 10
  },
  {
    "e": "Ediciones Asterión",
    "i": 10
  },
  {
    "e": "Centro de Estudios Jurídicos y Sociales Mispat",
    "i": 10
  },
  {
    "e": "Casa Unida de Publicaciones",
    "i": 10
  },
  {
    "e": "Casa Editorial Jatziri",
    "i": 10
  },
  {
    "e": "Amaya Ediciones",
    "i": 10
  },
  {
    "e": "Advanced Methods Co.",
    "i": 10
  },
  {
    "e": "Uribe Santibañez Irma Laura",
    "i": 9
  },
  {
    "e": "Universidad Autónoma Intercultural de Sinaloa",
    "i": 9
  },
  {
    "e": "Universidad Autónoma Benito Juárez de Oaxaca",
    "i": 9
  },
  {
    "e": "TD&IS Training, Distribution and Integrated Services",
    "i": 9
  },
  {
    "e": "Sánchez Gutiérrez María Gabriela",
    "i": 9
  },
  {
    "e": "Sello Editor y Consultor Montiv",
    "i": 9
  },
  {
    "e": "Red Durango de Investigadores Educativos",
    "i": 9
  },
  {
    "e": "Radbruk E&A",
    "i": 9
  },
  {
    "e": "Orendáin Caldera,Jorge Antonio",
    "i": 9
  },
  {
    "e": "Opus Editorial",
    "i": 9
  },
  {
    "e": "Lázaro Hernández Arianna Eva",
    "i": 9
  },
  {
    "e": "Instituto Nacional de Administración Pública",
    "i": 9
  },
  {
    "e": "Grupo de Editores Mundo Moderno",
    "i": 9
  },
  {
    "e": "González Huezo María Arabella",
    "i": 9
  },
  {
    "e": "Gil Editores",
    "i": 9
  },
  {
    "e": "Ficticia",
    "i": 9
  },
  {
    "e": "Editorial Época",
    "i": 9
  },
  {
    "e": "Editorial Sexto Piso",
    "i": 9
  },
  {
    "e": "Ediciones El Naranjo",
    "i": 9
  },
  {
    "e": "Creaciones Bersavirvi",
    "i": 9
  },
  {
    "e": "Correo del Maestro",
    "i": 9
  },
  {
    "e": "Corporativo La Retama",
    "i": 9
  },
  {
    "e": "Consejo de Ciencia y Tecnología del Estado de Puebla",
    "i": 9
  },
  {
    "e": "Comisión de Derechos Humanos del Estado de México",
    "i": 9
  },
  {
    "e": "Comisión Nacional para el Conocimiento y Uso de la Biodiversidad",
    "i": 9
  },
  {
    "e": "Colegio de Ciencias y Artes de Tabasco",
    "i": 9
  },
  {
    "e": "Bajo Tierra",
    "i": 9
  },
  {
    "e": "Ave Publicidad",
    "i": 9
  },
  {
    "e": "Artes de México y del Mundo",
    "i": 9
  },
  {
    "e": "Arquine",
    "i": 9
  },
  {
    "e": "Ambar Diseño",
    "i": 9
  },
  {
    "e": "Vidal Rojo, Paola",
    "i": 8
  },
  {
    "e": "Universidad Tecnológica de Tula-Tepeji",
    "i": 8
  },
  {
    "e": "Universidad Autónoma de Baja California Sur",
    "i": 8
  },
  {
    "e": "Seminario de Cultura Mexicana",
    "i": 8
  },
  {
    "e": "Secretaría de Cultura de Querétaro",
    "i": 8
  },
  {
    "e": "Secretaría de Cultura de Michoacán",
    "i": 8
  },
  {
    "e": "Policromía Servicios Editoriales",
    "i": 8
  },
  {
    "e": "PLM México",
    "i": 8
  },
  {
    "e": "Oxford University Press México",
    "i": 8
  },
  {
    "e": "Muñoz Santini León",
    "i": 8
  },
  {
    "e": "Legionarios de Cristo",
    "i": 8
  },
  {
    "e": "Leetra Final",
    "i": 8
  },
  {
    "e": "Instituto de Ecología",
    "i": 8
  },
  {
    "e": "Instituto Veracruzano de la Cultura",
    "i": 8
  },
  {
    "e": "Instituto Tlaxcalteca de la Cultura",
    "i": 8
  },
  {
    "e": "Instituto Nacional de Salud Pública",
    "i": 8
  },
  {
    "e": "Fondo Editorial de Nuevo León",
    "i": 8
  },
  {
    "e": "Fogra Editorial de México",
    "i": 8
  },
  {
    "e": "Educación y Cultura Asesoría y Promoción",
    "i": 8
  },
  {
    "e": "Ediciones Urano de México",
    "i": 8
  },
  {
    "e": "Ediciones Quinto Sol",
    "i": 8
  },
  {
    "e": "Ediciones Comunicación Científica",
    "i": 8
  },
  {
    "e": "Ediciones BIR",
    "i": 8
  },
  {
    "e": "Consultoría de Prácticas Educativas Innovadores",
    "i": 8
  },
  {
    "e": "Comunidad Universitaria del Golfo Centro",
    "i": 8
  },
  {
    "e": "Comparán Rizo, Ricardo",
    "i": 8
  },
  {
    "e": "Cidcli",
    "i": 8
  },
  {
    "e": "Centro Jurídico Integral de Ciencias Penales y Criminología",
    "i": 8
  },
  {
    "e": "Burgoa Editores",
    "i": 8
  },
  {
    "e": "Vive el Tiempo",
    "i": 7
  },
  {
    "e": "Universidad de Ixtlahuaca CUI",
    "i": 7
  },
  {
    "e": "Trabajos Manuales Escolares",
    "i": 7
  },
  {
    "e": "Toma, Ediciones y Producciones Escénicas y Cinematográficas",
    "i": 7
  },
  {
    "e": "Secretaría de Cultura del Gobierno del Estado de Colima",
    "i": 7
  },
  {
    "e": "Olivares Leal, Amado",
    "i": 7
  },
  {
    "e": "Obregón Martínez María Elena",
    "i": 7
  },
  {
    "e": "Morya Ediciones",
    "i": 7
  },
  {
    "e": "Literatura y Alternativas en Servicios Editoriales",
    "i": 7
  },
  {
    "e": "International Lifestyle Marketing Services",
    "i": 7
  },
  {
    "e": "Instituto Municipal Aguascalentense para la Cultura",
    "i": 7
  },
  {
    "e": "Instituto Electoral del Estado de Guanajuato",
    "i": 7
  },
  {
    "e": "Eólica Grupo Editorial",
    "i": 7
  },
  {
    "e": "Eugenia Montalván Proyectos Culturales",
    "i": 7
  },
  {
    "e": "El Colegio de Morelos",
    "i": 7
  },
  {
    "e": "Editorial Multimedia Educativa",
    "i": 7
  },
  {
    "e": "Editorial Ariadna",
    "i": 7
  },
  {
    "e": "Ediciones Selectas Diamante",
    "i": 7
  },
  {
    "e": "Ediciones Culturales Internacionales",
    "i": 7
  },
  {
    "e": "Centro de Estudios e Investigaciones para el Desarrollo Docente CENID",
    "i": 7
  },
  {
    "e": "Unión de Universidades de América Latina y El Caribe",
    "i": 6
  },
  {
    "e": "Universidad Autónoma de Campeche",
    "i": 6
  },
  {
    "e": "Torres Cruz,Leopoldo",
    "i": 6
  },
  {
    "e": "Secretaría de Cultura del Gobierno del Estado de San Luis Potosí",
    "i": 6
  },
  {
    "e": "Secretaría de Cultura de Campeche",
    "i": 6
  },
  {
    "e": "Reyes Fernández Ana Patricia",
    "i": 6
  },
  {
    "e": "Rangel Raya, Israel Sarain",
    "i": 6
  },
  {
    "e": "Polanco González, Carlos",
    "i": 6
  },
  {
    "e": "Palabra de Clío",
    "i": 6
  },
  {
    "e": "Nueva Editorial Iztaccíhuatl",
    "i": 6
  },
  {
    "e": "Narratio Aspectabilis",
    "i": 6
  },
  {
    "e": "Museo Iconográfico del Quijote",
    "i": 6
  },
  {
    "e": "Martínez Jover, María del Carmen Dorotea",
    "i": 6
  },
  {
    "e": "Kershenovich Borenstein, Rebeca",
    "i": 6
  },
  {
    "e": "Jorale Editores",
    "i": 6
  },
  {
    "e": "Investigaciones y Estudios Superiores",
    "i": 6
  },
  {
    "e": "Instituto Tecnológico de Sonora",
    "i": 6
  },
  {
    "e": "Instituto Politécnico Nacional",
    "i": 6
  },
  {
    "e": "Instituto Literario de Veracruz",
    "i": 6
  },
  {
    "e": "Instituto Humanista de Sinaloa",
    "i": 6
  },
  {
    "e": "Instituto Hidalguense de Educación",
    "i": 6
  },
  {
    "e": "Instituto Cultural de León",
    "i": 6
  },
  {
    "e": "Instituto Cultural de Aguascalientes",
    "i": 6
  },
  {
    "e": "Ibuk Media Speak",
    "i": 6
  },
  {
    "e": "Grupo de Ediciones y Publicaciones Xalapa",
    "i": 6
  },
  {
    "e": "Grupo Editorial Lectio",
    "i": 6
  },
  {
    "e": "González Molina, Gabriel",
    "i": 6
  },
  {
    "e": "Global Business University",
    "i": 6
  },
  {
    "e": "Flores Martínez Martín Guadalupe",
    "i": 6
  },
  {
    "e": "Fara Ediciones",
    "i": 6
  },
  {
    "e": "Escuela Normal Superior de Querétaro",
    "i": 6
  },
  {
    "e": "Editorial la Cruz",
    "i": 6
  },
  {
    "e": "Editorial de Otro Tipo",
    "i": 6
  },
  {
    "e": "Editorial a Toda Máquina",
    "i": 6
  },
  {
    "e": "Editorial Paralelo 21",
    "i": 6
  },
  {
    "e": "Editorial Náhuatl",
    "i": 6
  },
  {
    "e": "Editorial Enseñanza",
    "i": 6
  },
  {
    "e": "Editorial Cayuco",
    "i": 6
  },
  {
    "e": "Editores de Textos Mexicanos",
    "i": 6
  },
  {
    "e": "ELT Trading",
    "i": 6
  },
  {
    "e": "Consejo Nacional para Prevenir la Discriminación",
    "i": 6
  },
  {
    "e": "Colorines Educación",
    "i": 6
  },
  {
    "e": "Centro de Investigación Innovación en Educación Superior las Profesiones y el Talento",
    "i": 6
  },
  {
    "e": "Centro de Estudios Jurídicos Carbonell",
    "i": 6
  },
  {
    "e": "Canta Mares Casa Editorial",
    "i": 6
  },
  {
    "e": "Bernal Figueroa José David",
    "i": 6
  },
  {
    "e": "Autoridad Educativa Federal en la Ciudad de México",
    "i": 6
  },
  {
    "e": "Alonso Castilla Carlos Aníbal",
    "i": 6
  },
  {
    "e": "Aguilar González Pablo Miguel",
    "i": 6
  },
  {
    "e": "1450 Ediciones",
    "i": 6
  },
  {
    "e": "Zuchovicki Scharkansky, Silvia Gladys",
    "i": 5
  },
  {
    "e": "Torres Rivera Nahum Mario",
    "i": 5
  },
  {
    "e": "Territorio Poético",
    "i": 5
  },
  {
    "e": "Sierra Quintero Jorge Alfonso",
    "i": 5
  },
  {
    "e": "Secretaría de Cultura del Gobierno del Estado de Coahuila de Zaragoza",
    "i": 5
  },
  {
    "e": "Secretaría de Cultura de Jalisco",
    "i": 5
  },
  {
    "e": "Schulz Flores Sara Olimpia",
    "i": 5
  },
  {
    "e": "Ruiz Rodríguez Marina",
    "i": 5
  },
  {
    "e": "Rodríguez Jiménez Antonio",
    "i": 5
  },
  {
    "e": "Presidencia de la República",
    "i": 5
  },
  {
    "e": "Paradiso Editores",
    "i": 5
  },
  {
    "e": "Orbilibro Ediciones",
    "i": 5
  },
  {
    "e": "Nexos-Sociedad, Ciencia y Literatura",
    "i": 5
  },
  {
    "e": "Montzalez Editoriales",
    "i": 5
  },
  {
    "e": "Luna Zepeda Mario Ulises",
    "i": 5
  },
  {
    "e": "Instituto Nacional de Transparencia, Acceso a la Información y Protección de Datos Personales",
    "i": 5
  },
  {
    "e": "Instituto Municipal de Arte y Cultura de Puebla",
    "i": 5
  },
  {
    "e": "Instituto Mexicano de Estudios sobre el Poder Legislativo",
    "i": 5
  },
  {
    "e": "Inhalt el ADN de los Contenidos",
    "i": 5
  },
  {
    "e": "Imprejal",
    "i": 5
  },
  {
    "e": "Hastings García Isadora",
    "i": 5
  },
  {
    "e": "H. Ayuntamiento de Xalapa-Enríquez",
    "i": 5
  },
  {
    "e": "Guerrero Sánchez Raúl",
    "i": 5
  },
  {
    "e": "Grupo Editorial y de Investigación Polaris",
    "i": 5
  },
  {
    "e": "Grupo Editorial Kaos",
    "i": 5
  },
  {
    "e": "Green Hat",
    "i": 5
  },
  {
    "e": "Gobierno del Estado de Puebla",
    "i": 5
  },
  {
    "e": "Gallardo Cao Romero Alejandra",
    "i": 5
  },
  {
    "e": "Fundación Amparo",
    "i": 5
  },
  {
    "e": "Escuela Normal Superior Federalizada del Estado de Puebla",
    "i": 5
  },
  {
    "e": "El Colegio de Chihuahua",
    "i": 5
  },
  {
    "e": "Editorial y Servicios Editoriales Paraíso Perdido",
    "i": 5
  },
  {
    "e": "Editorial con Humanismo",
    "i": 5
  },
  {
    "e": "Editorial Medicina Mercadotecnia",
    "i": 5
  },
  {
    "e": "Ediciones Publicaciones y Traducciones",
    "i": 5
  },
  {
    "e": "Consejo Nacional de Fomento Educativo",
    "i": 5
  },
  {
    "e": "Conecta Editores",
    "i": 5
  },
  {
    "e": "Compañía Editorial Nueva Imagen",
    "i": 5
  },
  {
    "e": "Comisión Estatal Electoral de Nuevo León",
    "i": 5
  },
  {
    "e": "Colorin Cuenta",
    "i": 5
  },
  {
    "e": "Colectivo Trinchera",
    "i": 5
  },
  {
    "e": "Centro de Investigación en Alimentación y Desarrollo",
    "i": 5
  },
  {
    "e": "Centro de Estudios, Clínica e Investigación Psicoanalítica",
    "i": 5
  },
  {
    "e": "Centro Documental Flores Magón",
    "i": 5
  },
  {
    "e": "Castañón Jiménez, Pablo Arturo",
    "i": 5
  },
  {
    "e": "Casa Aldo Manuzio",
    "i": 5
  },
  {
    "e": "Ballesteros Díaz González Gabriela",
    "i": 5
  },
  {
    "e": "Asociación Nacional de Universidades e Instituciones de Educación Superior de la República",
    "i": 5
  },
  {
    "e": "Asociación Mexicana de Investigación Interdisciplinaria Asmiia",
    "i": 5
  },
  {
    "e": "Asociación Mexicana de Ciencias para el Desarrollo Regional",
    "i": 5
  },
  {
    "e": "Arte y Escena Ediciones",
    "i": 5
  },
  {
    "e": "Aqua Ediciones",
    "i": 5
  },
  {
    "e": "Alboroto Ediciones",
    "i": 5
  },
  {
    "e": "Zárate Ardón Ana Paula",
    "i": 4
  },
  {
    "e": "Zamora Herrera Karen Josette",
    "i": 4
  },
  {
    "e": "Vázquez Ortíz Daniel Alejandro",
    "i": 4
  },
  {
    "e": "Vestalia Ediciones",
    "i": 4
  },
  {
    "e": "Velázquez Alvizo, Héctor Domingo",
    "i": 4
  },
  {
    "e": "Universidad Politécnica de Guanajuato",
    "i": 4
  },
  {
    "e": "Universidad Pedagógica Nacional del Estado de Chihuahua",
    "i": 4
  },
  {
    "e": "Universidad Autónoma del Carmen",
    "i": 4
  },
  {
    "e": "Toma y Lee Editorial",
    "i": 4
  },
  {
    "e": "Solar, Servicios Editoriales",
    "i": 4
  },
  {
    "e": "Sociedad Mexicana de Física",
    "i": 4
  },
  {
    "e": "Secretaría de la Defensa Nacional",
    "i": 4
  },
  {
    "e": "Secretaría de Gobernación",
    "i": 4
  },
  {
    "e": "Sautto Flores Idalia",
    "i": 4
  },
  {
    "e": "Rodríguez Mejía Diana Zaira",
    "i": 4
  },
  {
    "e": "Producciones el Salario del Miedo",
    "i": 4
  },
  {
    "e": "Planeación y Desarrollo Editorial",
    "i": 4
  },
  {
    "e": "Patiño González Blanca Dalia",
    "i": 4
  },
  {
    "e": "Ordinal",
    "i": 4
  },
  {
    "e": "Nuevo Mundo Pegasso",
    "i": 4
  },
  {
    "e": "No-Olvidar Medios",
    "i": 4
  },
  {
    "e": "Michel Piotrowski Tasha Rose",
    "i": 4
  },
  {
    "e": "Mellado Moreno, Alberto",
    "i": 4
  },
  {
    "e": "Martínez Mendoza, José Refugio",
    "i": 4
  },
  {
    "e": "Martínez Lazcano, Alfonso Jaime",
    "i": 4
  },
  {
    "e": "Marrón Canseco, Alba Rosario",
    "i": 4
  },
  {
    "e": "Lucio Ramos, Carlos Rodrigo",
    "i": 4
  },
  {
    "e": "Lucio Espino Patricia Daniela",
    "i": 4
  },
  {
    "e": "León Calixto Quetzatl",
    "i": 4
  },
  {
    "e": "Juvera Flores María Isabel",
    "i": 4
  },
  {
    "e": "Iure Editores",
    "i": 4
  },
  {
    "e": "Instituto de la Cultura y las Artes de Quintana Roo",
    "i": 4
  },
  {
    "e": "Instituto de Elecciones y Participación Ciudadana",
    "i": 4
  },
  {
    "e": "Instituto Tecnológico de La Paz",
    "i": 4
  },
  {
    "e": "Instituto Tamaulipeco para la Cultura y las Artes",
    "i": 4
  },
  {
    "e": "Horson Ediciones Escolares",
    "i": 4
  },
  {
    "e": "Hernández Osuna, Juan Pedro",
    "i": 4
  },
  {
    "e": "Hernández García Manuel",
    "i": 4
  },
  {
    "e": "Gutiérrez Alanis, María Teresa",
    "i": 4
  },
  {
    "e": "Grupo Comercial Tamán",
    "i": 4
  },
  {
    "e": "Garcia Barajas, Fernando",
    "i": 4
  },
  {
    "e": "Flores Carranza Javier",
    "i": 4
  },
  {
    "e": "Fivana Consultoría y Servicios",
    "i": 4
  },
  {
    "e": "El Colegio de Tamaulipas",
    "i": 4
  },
  {
    "e": "Editorial y Servicios Culturales el Dragón Rojo",
    "i": 4
  },
  {
    "e": "Editorial Turner de México",
    "i": 4
  },
  {
    "e": "Editorial Juventud",
    "i": 4
  },
  {
    "e": "Editorial Esfera Pública",
    "i": 4
  },
  {
    "e": "Editorial Cienpozuelos",
    "i": 4
  },
  {
    "e": "Editorial ACD",
    "i": 4
  },
  {
    "e": "Editores y Viceversa",
    "i": 4
  },
  {
    "e": "Edición y Farmacia",
    "i": 4
  },
  {
    "e": "Ediciones el Tucán de Virginia",
    "i": 4
  },
  {
    "e": "Ediciones con Estilo",
    "i": 4
  },
  {
    "e": "Ediciones Sin Nombre",
    "i": 4
  },
  {
    "e": "Ediciones México Triunfador",
    "i": 4
  },
  {
    "e": "Ediciones Gernika",
    "i": 4
  },
  {
    "e": "Dicograf",
    "i": 4
  },
  {
    "e": "Derecho Global Editores",
    "i": 4
  },
  {
    "e": "Cultura Profesional Digital",
    "i": 4
  },
  {
    "e": "Cooperativa de Producción y Servicios Editoriales Heredad",
    "i": 4
  },
  {
    "e": "Conexión GDL",
    "i": 4
  },
  {
    "e": "Comité de Acción para el Saneamiento del Ambiente",
    "i": 4
  },
  {
    "e": "Cervantes Flores Hugo",
    "i": 4
  },
  {
    "e": "Central Mexicana de Servicios Generales de Alcohólicos Anónimos",
    "i": 4
  },
  {
    "e": "Castro Parada Ruth Idalia",
    "i": 4
  },
  {
    "e": "Berbera Editores",
    "i": 4
  },
  {
    "e": "Asociación Mexicana de Alternativas en Psicología",
    "i": 4
  },
  {
    "e": "Asociación Latinoamericana para la Formación y la Enseñanza de la Psicología",
    "i": 4
  },
  {
    "e": "Ares Calderón Miriam Guadalupe",
    "i": 4
  },
  {
    "e": "Acción Cultural Cromática",
    "i": 4
  },
  {
    "e": "Álvarez Freeman Oscar Fernando",
    "i": 3
  },
  {
    "e": "Zona Paz",
    "i": 3
  },
  {
    "e": "Vázquez Jaramillo, Ramón",
    "i": 3
  },
  {
    "e": "Vargas Iturbe, Alberto",
    "i": 3
  },
  {
    "e": "Universidad del Mar",
    "i": 3
  },
  {
    "e": "Universidad Latina de América",
    "i": 3
  },
  {
    "e": "Universidad Intercultural del Estado de Puebla",
    "i": 3
  },
  {
    "e": "Universidad Autónoma de Occidente",
    "i": 3
  },
  {
    "e": "Universidad Autónoma España de Durango",
    "i": 3
  },
  {
    "e": "Téllez Rascón Luz Quetzalli",
    "i": 3
  },
  {
    "e": "Tribunal de Justicia Administrativa del Estado de Guanajuato",
    "i": 3
  },
  {
    "e": "Taller de Comunicación Gráfica",
    "i": 3
  },
  {
    "e": "Taller Editorial Gris Tormenta",
    "i": 3
  },
  {
    "e": "Talamontes Editores",
    "i": 3
  },
  {
    "e": "Tafoya Chávez Adriana",
    "i": 3
  },
  {
    "e": "T&R Desarrollo Empresarial",
    "i": 3
  },
  {
    "e": "Strike Isi",
    "i": 3
  },
  {
    "e": "Soto Icaza, Mónica",
    "i": 3
  },
  {
    "e": "Sociedad Mexicana de Estudios Electorales",
    "i": 3
  },
  {
    "e": "Segrak",
    "i": 3
  },
  {
    "e": "Secretaría de Relaciones Exteriores",
    "i": 3
  },
  {
    "e": "Santana Chávez, Luis Alejandro",
    "i": 3
  },
  {
    "e": "Reyes Carrillo Sandra",
    "i": 3
  },
  {
    "e": "Red de Investigadores Educativos Chihuahua",
    "i": 3
  },
  {
    "e": "Red Gobernanza Metropolitana, A.C.",
    "i": 3
  },
  {
    "e": "Quiroga Costilla,Eduardo",
    "i": 3
  },
  {
    "e": "Ortiz Gonzalez Mariana",
    "i": 3
  },
  {
    "e": "Olguín Salgado, Miguel Ángel",
    "i": 3
  },
  {
    "e": "México Evalúa. Centro de Análisis de Políticas Públicas",
    "i": 3
  },
  {
    "e": "Museo Federico Silva",
    "i": 3
  },
  {
    "e": "Moreno Rodríguez Juan",
    "i": 3
  },
  {
    "e": "Mondragón Sotelo, Ramón",
    "i": 3
  },
  {
    "e": "Minos Tercer Milenio",
    "i": 3
  },
  {
    "e": "Mextli Ediciones",
    "i": 3
  },
  {
    "e": "Mexicanos Primero Jalisco",
    "i": 3
  },
  {
    "e": "María Elizabeth Dávila Ollervides",
    "i": 3
  },
  {
    "e": "López Gil Miguel Ángel",
    "i": 3
  },
  {
    "e": "Luna Aguilar,Francisca Leticia",
    "i": 3
  },
  {
    "e": "Kaldman Garduño, Sharon Leslie",
    "i": 3
  },
  {
    "e": "Instituto de Odontología Neurointeligente",
    "i": 3
  },
  {
    "e": "Instituto Universitario Anglo Español",
    "i": 3
  },
  {
    "e": "Instituto Nacional de Lenguas Indígenas",
    "i": 3
  },
  {
    "e": "Instituto Municipal de Cultura de Saltillo",
    "i": 3
  },
  {
    "e": "Instituto Electoral del Estado de Sinaloa",
    "i": 3
  },
  {
    "e": "Hermanas Misioneras Servidoras de la Palabra",
    "i": 3
  },
  {
    "e": "Guillen Rodriguez, Nataly Lizbeth",
    "i": 3
  },
  {
    "e": "Gráficos Globales de Puebla",
    "i": 3
  },
  {
    "e": "Grupo Editorial Endira México",
    "i": 3
  },
  {
    "e": "Grupo Editorial Benma",
    "i": 3
  },
  {
    "e": "Grupo Destiempos",
    "i": 3
  },
  {
    "e": "Grupo Crisagui",
    "i": 3
  },
  {
    "e": "González García Gerardo",
    "i": 3
  },
  {
    "e": "Fundación Herdez",
    "i": 3
  },
  {
    "e": "Fundación Arcoiris por el Respeto a la Diversidad Sexual",
    "i": 3
  },
  {
    "e": "Fuentes Muñoz, Candlui",
    "i": 3
  },
  {
    "e": "Fraternidad Sacerdotal San Pío X en México",
    "i": 3
  },
  {
    "e": "Floricanto",
    "i": 3
  },
  {
    "e": "Fideicomiso para la Promoción y Desarrollo del Cine Mexicano en la Ciudad de México",
    "i": 3
  },
  {
    "e": "Ferro Herrera Miguel",
    "i": 3
  },
  {
    "e": "Federación Mexicana de Psicología",
    "i": 3
  },
  {
    "e": "Escuela de Administración Pública de la Ciudad de México",
    "i": 3
  },
  {
    "e": "Escuela Normal Superior del Estado de Chihuahua Profr. José E. Medrano R.",
    "i": 3
  },
  {
    "e": "Elizondo D´Aquino Victorio Alfonso",
    "i": 3
  },
  {
    "e": "El Faro Luz y Ciencia",
    "i": 3
  },
  {
    "e": "El Derecho Civil Integral",
    "i": 3
  },
  {
    "e": "Editorial Pandora",
    "i": 3
  },
  {
    "e": "Editorial Nuevo Mexico",
    "i": 3
  },
  {
    "e": "Editorial Las Ánimas",
    "i": 3
  },
  {
    "e": "Editorial E-Dae",
    "i": 3
  },
  {
    "e": "Editorial Dante",
    "i": 3
  },
  {
    "e": "Editores Índice Fons",
    "i": 3
  },
  {
    "e": "Ediciones Zigurat",
    "i": 3
  },
  {
    "e": "Ediciones Xaverianas",
    "i": 3
  },
  {
    "e": "Ediciones Punto Fijo",
    "i": 3
  },
  {
    "e": "Ediciones Monosílabo",
    "i": 3
  },
  {
    "e": "Ediciones Eternos Malabares",
    "i": 3
  },
  {
    "e": "Ediciones Barek",
    "i": 3
  },
  {
    "e": "Domínguez Chiu, Emma",
    "i": 3
  },
  {
    "e": "Dominguez Narez, Freddy Eutimio",
    "i": 3
  },
  {
    "e": "Cruz Osorio, Iván",
    "i": 3
  },
  {
    "e": "Coordinación General de Educación Intercultural y Bilingüe",
    "i": 3
  },
  {
    "e": "Cooperativa de Producción Intelectual y Sensible",
    "i": 3
  },
  {
    "e": "Consejo Optometría México",
    "i": 3
  },
  {
    "e": "Codexmas",
    "i": 3
  },
  {
    "e": "Cervantes Guzmán, José Luis",
    "i": 3
  },
  {
    "e": "Centro de Investigación Científica de Yucatán",
    "i": 3
  },
  {
    "e": "Centro de Investigaciones Sobre la Libre Empresa",
    "i": 3
  },
  {
    "e": "Centro de Estudios Docentes e Investigación",
    "i": 3
  },
  {
    "e": "Centro Mexicano de Salud Emocional Cemsae",
    "i": 3
  },
  {
    "e": "Castro Mondragón, Alfredo",
    "i": 3
  },
  {
    "e": "Castro Jáuregui Jorge Alberto",
    "i": 3
  },
  {
    "e": "Castillo Arévalo, Carlos",
    "i": 3
  },
  {
    "e": "Castillo Aguilar, Celia Leticia",
    "i": 3
  },
  {
    "e": "Casia Creaciones",
    "i": 3
  },
  {
    "e": "Cambiotec",
    "i": 3
  },
  {
    "e": "Calvo Lugo César Mauricio",
    "i": 3
  },
  {
    "e": "Banco Nacional de México, S.A. Integrante del Grupo Financiero Banamex",
    "i": 3
  },
  {
    "e": "Asociación Mexicana de Hepatología",
    "i": 3
  },
  {
    "e": "Asociación Interdisciplinaria para el Estudio de la Historia de México",
    "i": 3
  },
  {
    "e": "Arlequín Editorial y Servicios",
    "i": 3
  },
  {
    "e": "Ariza Azpíroz, Héctor Fernando",
    "i": 3
  },
  {
    "e": "Archivo Histórico del Municipio de Colima",
    "i": 3
  },
  {
    "e": "Aquelarre Ediciones",
    "i": 3
  },
  {
    "e": "Anza Costabile Ana Luisa",
    "i": 3
  },
  {
    "e": "Andraval Ediciones",
    "i": 3
  },
  {
    "e": "Alom Editores",
    "i": 3
  },
  {
    "e": "17 Consultoría",
    "i": 3
  },
  {
    "e": "12 Editorial",
    "i": 3
  },
  {
    "e": "Zapata Suárez, Eugenia Elizabeth",
    "i": 2
  },
  {
    "e": "Vital Tecuanhuey, Eduardo",
    "i": 2
  },
  {
    "e": "Villamar Rodriguez, Janitzio Alejandro",
    "i": 2
  },
  {
    "e": "Villa Guillén, Diana Evelyn",
    "i": 2
  },
  {
    "e": "Vesalius",
    "i": 2
  },
  {
    "e": "Ventura Álvarez, Fernando",
    "i": 2
  },
  {
    "e": "Vargas Martínez, María Celeste",
    "i": 2
  },
  {
    "e": "Universidad de Oriente",
    "i": 2
  },
  {
    "e": "Universidad de Monterrey",
    "i": 2
  },
  {
    "e": "Universidad de Montemorelos",
    "i": 2
  },
  {
    "e": "Universidad Tecnológica de la Mixteca",
    "i": 2
  },
  {
    "e": "Universidad Pontificia de México",
    "i": 2
  },
  {
    "e": "Universidad Politécnica Metropolitana de Hidalgo",
    "i": 2
  },
  {
    "e": "Universidad Pedagógica del Estado de Sinaloa",
    "i": 2
  },
  {
    "e": "Universidad Marista de Querétaro",
    "i": 2
  },
  {
    "e": "Universidad La Salle Oaxaca",
    "i": 2
  },
  {
    "e": "Universidad Autónoma de Guadalajara",
    "i": 2
  },
  {
    "e": "Universidad Abierta y a Distancia de México",
    "i": 2
  },
  {
    "e": "Ugarte Tezcucano María Elena",
    "i": 2
  },
  {
    "e": "Téllez Espinoza, José Eduardo",
    "i": 2
  },
  {
    "e": "Triana González, Miguel",
    "i": 2
  },
  {
    "e": "Travesías Editores",
    "i": 2
  },
  {
    "e": "Total Book",
    "i": 2
  },
  {
    "e": "Tintanueva",
    "i": 2
  },
  {
    "e": "Tiempo Imaginario",
    "i": 2
  },
  {
    "e": "Temblores Publicaciones",
    "i": 2
  },
  {
    "e": "Teatro Sin Paredes",
    "i": 2
  },
  {
    "e": "Sánchez Tizapa, Sulpicio",
    "i": 2
  },
  {
    "e": "Sánchez Ruíz Miguel Ángel",
    "i": 2
  },
  {
    "e": "Subías Chávez, Pablo Demetrio",
    "i": 2
  },
  {
    "e": "Soto Troncoso, Iván Andrés",
    "i": 2
  },
  {
    "e": "Sosa Fonseca, José Alfredo",
    "i": 2
  },
  {
    "e": "Solís Montes de Oca Santiago",
    "i": 2
  },
  {
    "e": "Sociedad Hijos de Calimaya",
    "i": 2
  },
  {
    "e": "Sierra Restrepo, Andres",
    "i": 2
  },
  {
    "e": "Sicomoro Ediciones",
    "i": 2
  },
  {
    "e": "Servicios Integrales de Actualización Educativa, A.C.",
    "i": 2
  },
  {
    "e": "Serrano Editores",
    "i": 2
  },
  {
    "e": "Secretaría de Marina",
    "i": 2
  },
  {
    "e": "Santos Prudente, Jhoana Karen",
    "i": 2
  },
  {
    "e": "Santos González, Emilio",
    "i": 2
  },
  {
    "e": "Ruiz Valadez , Ulises",
    "i": 2
  },
  {
    "e": "Romero López Ana Rosa",
    "i": 2
  },
  {
    "e": "Rodríguez Maya, Alejandro",
    "i": 2
  },
  {
    "e": "Robles Palacios Brunilda",
    "i": 2
  },
  {
    "e": "Rivera Hernández, Antonia Elizabeth",
    "i": 2
  },
  {
    "e": "Rivera Gonzalez, Kiriath Yusep",
    "i": 2
  },
  {
    "e": "Red Mexicana de Investigadores en Estudios Organizacionales (REMINEO)",
    "i": 2
  },
  {
    "e": "Quintanar Hinojosa Beatriz",
    "i": 2
  },
  {
    "e": "Pérez Mortera, Humberto Rodrigo",
    "i": 2
  },
  {
    "e": "Publicaciones 1701 F",
    "i": 2
  },
  {
    "e": "Promotora Mexicana de Ediciones",
    "i": 2
  },
  {
    "e": "Promotora Educativa Metropolitana",
    "i": 2
  },
  {
    "e": "Programa Mexicano del Carbono",
    "i": 2
  },
  {
    "e": "Pluralia Ediciones e Impresiones",
    "i": 2
  },
  {
    "e": "Partido de la Revolución Democrática",
    "i": 2
  },
  {
    "e": "Paracelsus",
    "i": 2
  },
  {
    "e": "Palacios Espinosa, Luis Fernando",
    "i": 2
  },
  {
    "e": "Palabra en Vuelo",
    "i": 2
  },
  {
    "e": "Ortega Rodríguez, Claudia Selene",
    "i": 2
  },
  {
    "e": "Oro de la Noche",
    "i": 2
  },
  {
    "e": "Ordaz Paxtor, Heidy Scarlett",
    "i": 2
  },
  {
    "e": "Operadora Enrique Olvera",
    "i": 2
  },
  {
    "e": "Natura y Ecosistemas Mexicanos",
    "i": 2
  },
  {
    "e": "Méndez Rodríguez, Valentín",
    "i": 2
  },
  {
    "e": "Museo de Arte Contemporáneo de San Luis Potosí",
    "i": 2
  },
  {
    "e": "Moreno Pérez, Juan Carlos",
    "i": 2
  },
  {
    "e": "Moreno Aranda, Francisco Gerardo",
    "i": 2
  },
  {
    "e": "Mora Torres, David",
    "i": 2
  },
  {
    "e": "Montoya Hernández, Aldo Iván",
    "i": 2
  },
  {
    "e": "Montañez Espinosa, José Luis",
    "i": 2
  },
  {
    "e": "Molina Chagoya, Adrián",
    "i": 2
  },
  {
    "e": "Misioneros de Guadalupe",
    "i": 2
  },
  {
    "e": "Mireles Valverde, Francisco Javier",
    "i": 2
  },
  {
    "e": "Ministerio El Río Internacional",
    "i": 2
  },
  {
    "e": "Melicoff Abril, Héctor Rubén",
    "i": 2
  },
  {
    "e": "Medina Espinosa, Francisco",
    "i": 2
  },
  {
    "e": "Manzano Aguila, José Daniel",
    "i": 2
  },
  {
    "e": "Machado Hurtado Nervinson Antonio",
    "i": 2
  },
  {
    "e": "MGS Ediciones",
    "i": 2
  },
  {
    "e": "López Sustaita José Alberto",
    "i": 2
  },
  {
    "e": "Llop Fernández, Rodrigo",
    "i": 2
  },
  {
    "e": "Lizama Quijano Jesús José",
    "i": 2
  },
  {
    "e": "Lenz Tiemann, Angélica Mariana",
    "i": 2
  },
  {
    "e": "Leer Mas Uno",
    "i": 2
  },
  {
    "e": "Landa Rosas José Antonio",
    "i": 2
  },
  {
    "e": "Lafarga Flores Rafael",
    "i": 2
  },
  {
    "e": "Laboratorio de Análisis Económico y Social",
    "i": 2
  },
  {
    "e": "La Vaca Independiente",
    "i": 2
  },
  {
    "e": "Koster Tania Genevieve",
    "i": 2
  },
  {
    "e": "Koeyu",
    "i": 2
  },
  {
    "e": "Keep Reading",
    "i": 2
  },
  {
    "e": "Ivonne Sierra Ortiz",
    "i": 2
  },
  {
    "e": "Investigación, Desarrollo y Fomento del Trabajo Emocional",
    "i": 2
  },
  {
    "e": "Invepy y Asociados",
    "i": 2
  },
  {
    "e": "Instituto para el Estudio del Budadharma",
    "i": 2
  },
  {
    "e": "Instituto de Educación Superior de la Paz",
    "i": 2
  },
  {
    "e": "Instituto de Apoyo a la Investigación e Innovación",
    "i": 2
  },
  {
    "e": "Instituto Universitario Eleia",
    "i": 2
  },
  {
    "e": "Instituto Tecnológico Superior de Xalapa",
    "i": 2
  },
  {
    "e": "Instituto Latinoamericano de Pedagogía Critica",
    "i": 2
  },
  {
    "e": "Instituto Electoral de Michoacán",
    "i": 2
  },
  {
    "e": "Instituto Educativo del Noroeste",
    "i": 2
  },
  {
    "e": "Impresos Tega",
    "i": 2
  },
  {
    "e": "Ilustre Academia Iberoamericana de Doctores",
    "i": 2
  },
  {
    "e": "Huacuja Joel",
    "i": 2
  },
  {
    "e": "Hoyo Gérard Marta",
    "i": 2
  },
  {
    "e": "Hernández Tejeda, Diego",
    "i": 2
  },
  {
    "e": "Hernández Sandoval, Bacilio",
    "i": 2
  },
  {
    "e": "Guzmán Pérez, José Roberto",
    "i": 2
  },
  {
    "e": "Guillen Flores, Efrain",
    "i": 2
  },
  {
    "e": "Guerrero Zarate Silvia Angélica",
    "i": 2
  },
  {
    "e": "Grupo Milamex",
    "i": 2
  },
  {
    "e": "Grupo Laceria",
    "i": 2
  },
  {
    "e": "Grupo Empresarial Investormex",
    "i": 2
  },
  {
    "e": "Grupo Editorial Unisan",
    "i": 2
  },
  {
    "e": "Grupo Editorial Cenzontle",
    "i": 2
  },
  {
    "e": "Grupo Albe Consultoria",
    "i": 2
  },
  {
    "e": "Graphstyle Publishers",
    "i": 2
  },
  {
    "e": "Granises, Servicios de Edición y Comunicación",
    "i": 2
  },
  {
    "e": "González Aragón María de Guadalupe",
    "i": 2
  },
  {
    "e": "Germán Adalberto Cravioto Batarse",
    "i": 2
  },
  {
    "e": "García Delgado, Juan Manuel",
    "i": 2
  },
  {
    "e": "Fundación de Investigaciones Sociales",
    "i": 2
  },
  {
    "e": "Fundación México Estados Unidos para la Ciencia",
    "i": 2
  },
  {
    "e": "Forum Cultural Guanajuato",
    "i": 2
  },
  {
    "e": "Fonseca Avalos, Mayra Elena",
    "i": 2
  },
  {
    "e": "Fomento de Investigación y Cultura Superior",
    "i": 2
  },
  {
    "e": "Fideicomiso para la Cineteca Nacional",
    "i": 2
  },
  {
    "e": "Evo Digital de México",
    "i": 2
  },
  {
    "e": "Espinosa Vázquez, Isaac",
    "i": 2
  },
  {
    "e": "Escuela Normal de Tlalnepantla",
    "i": 2
  },
  {
    "e": "Equivalencias Artísticas",
    "i": 2
  },
  {
    "e": "Epic Tales",
    "i": 2
  },
  {
    "e": "Elizondo Ordáz, Jesica Erika",
    "i": 2
  },
  {
    "e": "Elizondo Granillo Javier Arturo",
    "i": 2
  },
  {
    "e": "El Errante Editor",
    "i": 2
  },
  {
    "e": "El Equilibrista Otra Vez",
    "i": 2
  },
  {
    "e": "El Colegio del Estado de Hidalgo",
    "i": 2
  },
  {
    "e": "El Colegio de Tlaxcala",
    "i": 2
  },
  {
    "e": "Educonoce",
    "i": 2
  },
  {
    "e": "Editorial Televisa",
    "i": 2
  },
  {
    "e": "Editorial Sarriá México",
    "i": 2
  },
  {
    "e": "Editorial Me Cayo el Veinte",
    "i": 2
  },
  {
    "e": "Editorial Libitum",
    "i": 2
  },
  {
    "e": "Editorial Lao del Noroeste",
    "i": 2
  },
  {
    "e": "Editorial La Gunilla",
    "i": 2
  },
  {
    "e": "Editorial Irlanda",
    "i": 2
  },
  {
    "e": "Editorial Henequén",
    "i": 2
  },
  {
    "e": "Editorial Algarabía",
    "i": 2
  },
  {
    "e": "Editores y Desarrolladores Altepetl",
    "i": 2
  },
  {
    "e": "Editora Periodística y Análisis de Contenidos",
    "i": 2
  },
  {
    "e": "Ediciones Papiro Omega",
    "i": 2
  },
  {
    "e": "Ediciones Dos Puntos",
    "i": 2
  },
  {
    "e": "Ediciones Apóstoles de la Palabra",
    "i": 2
  },
  {
    "e": "EDILIENZO",
    "i": 2
  },
  {
    "e": "Díaz Barriga de los Cobos Alfredo",
    "i": 2
  },
  {
    "e": "Díaz Barajas Jorge Raúl",
    "i": 2
  },
  {
    "e": "Distribuciones Cifuentes",
    "i": 2
  },
  {
    "e": "Didalibros",
    "i": 2
  },
  {
    "e": "Derenat",
    "i": 2
  },
  {
    "e": "Dark & Glow Press",
    "i": 2
  },
  {
    "e": "Corrales Fassnacht, José Juan",
    "i": 2
  },
  {
    "e": "Corporación Universitaria para el Desarrollo de Internet",
    "i": 2
  },
  {
    "e": "Contraste Editorial",
    "i": 2
  },
  {
    "e": "Consultoría y Desarrollo Huella Digital",
    "i": 2
  },
  {
    "e": "Consejo de Ciencia y Tecnología del Estado de Querétaro",
    "i": 2
  },
  {
    "e": "Consejo Nacional para la Enseñanza e Investigación en Psicología",
    "i": 2
  },
  {
    "e": "Consejo Mexicano de Investigación Educativa",
    "i": 2
  },
  {
    "e": "Comisión Nacional para la Mejora Continua de la Educación",
    "i": 2
  },
  {
    "e": "Comisión Nacional de Libros de Texto Gratuitos",
    "i": 2
  },
  {
    "e": "Comisión Mexicana de Defensa y Promoción de los Derechos Humanos",
    "i": 2
  },
  {
    "e": "Comisión Estatal de los Derechos Humanos",
    "i": 2
  },
  {
    "e": "Cohen Shamosh, Simón",
    "i": 2
  },
  {
    "e": "Coghlan San Miguel Cristina",
    "i": 2
  },
  {
    "e": "Chiprout Ilgauskas, Leon",
    "i": 2
  },
  {
    "e": "Chaban, María Sadi Rebeca",
    "i": 2
  },
  {
    "e": "Cerdio Gordillo, Máximo",
    "i": 2
  },
  {
    "e": "Centro de Promoción y Defensa de los Derechos Humanos Joel Arriaga Navarro",
    "i": 2
  },
  {
    "e": "Centro de Investigación Científica y de Educación Superior de Ensenada, Baja California",
    "i": 2
  },
  {
    "e": "Centro de Estudios sobre la Enseñanza y el Aprendizaje del Derecho",
    "i": 2
  },
  {
    "e": "Centro de Estudios Superiores del Golfo",
    "i": 2
  },
  {
    "e": "Centro de Estudios Políticos y de Historia Presente",
    "i": 2
  },
  {
    "e": "Centro Interdisciplinario para la Innovación Educativa",
    "i": 2
  },
  {
    "e": "Central de Apadrinamiento y Fortalecimiento Espiritual",
    "i": 2
  },
  {
    "e": "Castillo Cabrera Abril",
    "i": 2
  },
  {
    "e": "Carrillo Correa Alejandro",
    "i": 2
  },
  {
    "e": "Carranza Trejo Miguel",
    "i": 2
  },
  {
    "e": "Cabada Rodríguez Cristina",
    "i": 2
  },
  {
    "e": "Buro Buro Oficina de Proyectos Culturales",
    "i": 2
  },
  {
    "e": "Bernechea Iturriaga José Armando",
    "i": 2
  },
  {
    "e": "Astra Ediciones",
    "i": 2
  },
  {
    "e": "Asociación Mexicana de Métricas de Software",
    "i": 2
  },
  {
    "e": "Asociación Mexicana de Mecatrónica",
    "i": 2
  },
  {
    "e": "Asociación Mexicana de Estudios Internacionales, AMEI",
    "i": 2
  },
  {
    "e": "Arizpe Zamora, Javier",
    "i": 2
  },
  {
    "e": "Applica2",
    "i": 2
  },
  {
    "e": "Alternativas y Capacidades",
    "i": 2
  },
  {
    "e": "Almaraz Moreno Valentín",
    "i": 2
  },
  {
    "e": "Adame López, Ángel Gilberto",
    "i": 2
  },
  {
    "e": "Academia Mexicana de Computación",
    "i": 2
  },
  {
    "e": "Ávila Val, Arturo",
    "i": 1
  },
  {
    "e": "Álvarez Valero, Héctor Manuel",
    "i": 1
  },
  {
    "e": "del Ángel Pérez, Omar",
    "i": 1
  },
  {
    "e": "de la Vega Peralta, José Miguel",
    "i": 1
  },
  {
    "e": "de la Peña Rivero, José Antonio",
    "i": 1
  },
  {
    "e": "de la Cruz Herrera, Elizabeth",
    "i": 1
  },
  {
    "e": "de Lira García , Susana Jazmín",
    "i": 1
  },
  {
    "e": "Zúñiga Sustaita Rafael",
    "i": 1
  },
  {
    "e": "Zuluaga Rodríguez, Sandra Consuelo",
    "i": 1
  },
  {
    "e": "Zezen Baltza Acciones Culturales",
    "i": 1
  },
  {
    "e": "Zepeda Jacobo, Mario Ezequiel",
    "i": 1
  },
  {
    "e": "Zavalza Zambrano Lilia",
    "i": 1
  },
  {
    "e": "Zavala Torres Susana",
    "i": 1
  },
  {
    "e": "Zavala Solís, José Luis",
    "i": 1
  },
  {
    "e": "Zarraga Editores, S.A de C.V",
    "i": 1
  },
  {
    "e": "Zaragoza Vidal, Mariana",
    "i": 1
  },
  {
    "e": "Zaragoza García, Esmeralda Paola",
    "i": 1
  },
  {
    "e": "Zapata Miranda , Laura Guadalupe",
    "i": 1
  },
  {
    "e": "Zamudio Escobedo, Marcela Yanine",
    "i": 1
  },
  {
    "e": "YZ Proyectos de Desarrollo",
    "i": 1
  },
  {
    "e": "Witker Velásquez, Jorge Alberto",
    "i": 1
  },
  {
    "e": "Watson Dávalos, Pia Cecilia",
    "i": 1
  },
  {
    "e": "Walter Mateo Sernas",
    "i": 1
  },
  {
    "e": "Vélez Adriano, Matilde Alejandra",
    "i": 1
  },
  {
    "e": "Vázquez Martínez, Eduardo Daniel",
    "i": 1
  },
  {
    "e": "Vázquez Lucas, Julio César",
    "i": 1
  },
  {
    "e": "Vázquez Fuente, Alicia del Socorro",
    "i": 1
  },
  {
    "e": "Vázquez Charolet, Rubén",
    "i": 1
  },
  {
    "e": "Vozabisal",
    "i": 1
  },
  {
    "e": "Vos Ediciones",
    "i": 1
  },
  {
    "e": "Vizcaino Ramírez, Martha Patricia",
    "i": 1
  },
  {
    "e": "Viskin Jinich, Jacobo",
    "i": 1
  },
  {
    "e": "Villegas Cabrera, Miguel Ángel",
    "i": 1
  },
  {
    "e": "Villarreal Salinas, César",
    "i": 1
  },
  {
    "e": "Villanueva Mukul, Eric Eber",
    "i": 1
  },
  {
    "e": "Villalán Gil, Jeannette",
    "i": 1
  },
  {
    "e": "Villalpando Rojas Arturo",
    "i": 1
  },
  {
    "e": "Vigil Díaz, Yolanda",
    "i": 1
  },
  {
    "e": "Vieyra Silva, Esteban",
    "i": 1
  },
  {
    "e": "Vidal Romero, Ulises Laertes",
    "i": 1
  },
  {
    "e": "Ventura Madrigal, Lenin",
    "i": 1
  },
  {
    "e": "Velázquez Rodríguez, Alfredo",
    "i": 1
  },
  {
    "e": "Velázquez Gabarrot Getzemani",
    "i": 1
  },
  {
    "e": "Velázquez Barreto Alejandro",
    "i": 1
  },
  {
    "e": "Vela Manzanilla, Raul Alonso",
    "i": 1
  },
  {
    "e": "Vargas Briones, Álvaro",
    "i": 1
  },
  {
    "e": "Varela Petito, Gonzalo",
    "i": 1
  },
  {
    "e": "Valdés Hernández, Erasmo Jaime",
    "i": 1
  },
  {
    "e": "Valdez Ramos, René",
    "i": 1
  },
  {
    "e": "Valdez Muñoz, Héctor Jesús",
    "i": 1
  },
  {
    "e": "Urrutia Rodríguez, Leslie",
    "i": 1
  },
  {
    "e": "Urrea Martin, Alfonso",
    "i": 1
  },
  {
    "e": "Urbieta González Oswald",
    "i": 1
  },
  {
    "e": "Urbano Mojica, Frumencio",
    "i": 1
  },
  {
    "e": "Universo de Libros",
    "i": 1
  },
  {
    "e": "Universidad del Mayab",
    "i": 1
  },
  {
    "e": "Universidad del Claustro de Sor Juana",
    "i": 1
  },
  {
    "e": "Universidad de la Salle Bajío",
    "i": 1
  },
  {
    "e": "Universidad Tecnológica de Tecamachalco",
    "i": 1
  },
  {
    "e": "Universidad Tecnológica Metropolitana",
    "i": 1
  },
  {
    "e": "Universidad Sistemática de Iberoamérica",
    "i": 1
  },
  {
    "e": "Universidad Politécnica de Gómez Palacio",
    "i": 1
  },
  {
    "e": "Universidad Olmeca",
    "i": 1
  },
  {
    "e": "Universidad Intercultural del Estado de Tabasco",
    "i": 1
  },
  {
    "e": "Universidad Intercultural del Estado de México",
    "i": 1
  },
  {
    "e": "Universidad Estatal de Oriente",
    "i": 1
  },
  {
    "e": "UNITIPS",
    "i": 1
  },
  {
    "e": "Téllez Romero, Angélica María del Mar",
    "i": 1
  },
  {
    "e": "Tu Primer Millón, Servicios Educativos",
    "i": 1
  },
  {
    "e": "Tribunal Electoral de Quintana Roo",
    "i": 1
  },
  {
    "e": "Treviño Paz, Claudia Jimena",
    "i": 1
  },
  {
    "e": "Trejo Peña, Juan Antonio",
    "i": 1
  },
  {
    "e": "Tovar González, Alejandro",
    "i": 1
  },
  {
    "e": "Tovalín Ahumada,José Alberto",
    "i": 1
  },
  {
    "e": "Torres Delgado, Juan Manuel",
    "i": 1
  },
  {
    "e": "Torres Crisanto Miguel Angel",
    "i": 1
  },
  {
    "e": "Toro Torres, Enrique Alejandro",
    "i": 1
  },
  {
    "e": "Torija Aguilar Juan Octavio",
    "i": 1
  },
  {
    "e": "Todd Maldonado, Daniela",
    "i": 1
  },
  {
    "e": "Thompson Lenz, Gustavo Federico",
    "i": 1
  },
  {
    "e": "Teutle Martinez, Natalia",
    "i": 1
  },
  {
    "e": "Terán Contreras, Jesús Hiram",
    "i": 1
  },
  {
    "e": "Tepal Calvario, Emmanuel",
    "i": 1
  },
  {
    "e": "Te Armonizamos Asesores",
    "i": 1
  },
  {
    "e": "Tapia Iturriaga Carmen Karina",
    "i": 1
  },
  {
    "e": "Tapia Barraza, José Arturo",
    "i": 1
  },
  {
    "e": "Tanus Espinoza, Nahin",
    "i": 1
  },
  {
    "e": "Tamez Garza, Alejandra Karina",
    "i": 1
  },
  {
    "e": "Tamayo Pérez, Luis",
    "i": 1
  },
  {
    "e": "Símbolos Corporativos",
    "i": 1
  },
  {
    "e": "Sé Taller de Ideas",
    "i": 1
  },
  {
    "e": "Sánchez Trejo, Armando Octavio",
    "i": 1
  },
  {
    "e": "Sánchez Ruiz Ana Jimena",
    "i": 1
  },
  {
    "e": "Sánchez López, Timoteo",
    "i": 1
  },
  {
    "e": "Sánchez González Guillermo Adrián",
    "i": 1
  },
  {
    "e": "Sánchez Fonseca Luis Francisco",
    "i": 1
  },
  {
    "e": "Sánchez Castro Daniel Ignacio",
    "i": 1
  },
  {
    "e": "Sáenz Naranjo, J. Guadalupe",
    "i": 1
  },
  {
    "e": "Sosa Zamora, José Hermenegildo",
    "i": 1
  },
  {
    "e": "Solís Segovia, Gabriela",
    "i": 1
  },
  {
    "e": "Sociedad de Investigadores y Formadores de Recursos en Rehabilitación Humana",
    "i": 1
  },
  {
    "e": "Sociedad de Historia, Educación y Cultura de Tlaxcala",
    "i": 1
  },
  {
    "e": "Sociedad Panamericana de Estudios Empresariales",
    "i": 1
  },
  {
    "e": "Sociedad Multidisciplinaria en Ciencias Agronómicas Aplicadas y Biotecnología",
    "i": 1
  },
  {
    "e": "Sociedad Mexicana de Pediatría",
    "i": 1
  },
  {
    "e": "Sociedad Mexicana de Ingeniería Estructural",
    "i": 1
  },
  {
    "e": "Sociedad Mexicana de Computación en la Educación",
    "i": 1
  },
  {
    "e": "Sitt Charabati, Isaac",
    "i": 1
  },
  {
    "e": "Sistema Desarrollador de Mypes",
    "i": 1
  },
  {
    "e": "Sindicato Único de Trabajadores del Instituto Tecnológico Superior de Poza Rica",
    "i": 1
  },
  {
    "e": "Sindicato de Trabajadores de la Universidad Nacional Autónoma de México",
    "i": 1
  },
  {
    "e": "Servicios de Comunicación Malabar",
    "i": 1
  },
  {
    "e": "Servicios Editoriales Once Ríos",
    "i": 1
  },
  {
    "e": "Serrato Vargas, Javier",
    "i": 1
  },
  {
    "e": "Serralde Ramos Álvaro",
    "i": 1
  },
  {
    "e": "Serna Hernández, Hugo Arturo",
    "i": 1
  },
  {
    "e": "Sepúlveda Blanco, Ricardo",
    "i": 1
  },
  {
    "e": "Secretaría de Medio Ambiente y Recursos Naturales",
    "i": 1
  },
  {
    "e": "Schinagl Waller, Nicolás Bernd",
    "i": 1
  },
  {
    "e": "Scaraboquio Taller de Ediciones",
    "i": 1
  },
  {
    "e": "Santiago Maldonado, Mario Jesús",
    "i": 1
  },
  {
    "e": "Sandoval Jiménez, Israel",
    "i": 1
  },
  {
    "e": "Salón de Arte Mexicano Aztecas",
    "i": 1
  },
  {
    "e": "Salinas Pérez Alma Patricia",
    "i": 1
  },
  {
    "e": "Salinas Amescua, Fernando Carlos",
    "i": 1
  },
  {
    "e": "Salgado Hernández, Horacio Gerardo",
    "i": 1
  },
  {
    "e": "Salcido Macias, Ivan Roman",
    "i": 1
  },
  {
    "e": "Salcedo Mena, José Arturo",
    "i": 1
  },
  {
    "e": "Salcedo García, Carlos",
    "i": 1
  },
  {
    "e": "Salazar García Aleida Belem",
    "i": 1
  },
  {
    "e": "Salazar Alcaraz, Aida Araceli",
    "i": 1
  },
  {
    "e": "Salas Pinal, Jaime",
    "i": 1
  },
  {
    "e": "Sainz Skewes, Rafael",
    "i": 1
  },
  {
    "e": "S Y G Editores",
    "i": 1
  },
  {
    "e": "Ríos Cortés, Alberto Ian",
    "i": 1
  },
  {
    "e": "Ruiz Flores González, Genaro",
    "i": 1
  },
  {
    "e": "Ruiz Abreu José Luis",
    "i": 1
  },
  {
    "e": "Rubio Pérez, Julio Alberto",
    "i": 1
  },
  {
    "e": "Rozen Fuller Isaac",
    "i": 1
  },
  {
    "e": "Rosas Olmedo Sebastián",
    "i": 1
  },
  {
    "e": "Ronces Espinal, Norma Laura",
    "i": 1
  },
  {
    "e": "Romero Zamora, Ana Lidia",
    "i": 1
  },
  {
    "e": "Romero Niño, Gilberto",
    "i": 1
  },
  {
    "e": "Rojo Corona, Monica Elizabeth",
    "i": 1
  },
  {
    "e": "Rojas Sánchez, Carmen Alicia",
    "i": 1
  },
  {
    "e": "Rodríguez Saavedra, Alfonso Gonzalo",
    "i": 1
  },
  {
    "e": "Rodríguez Rodríguez Alejandro",
    "i": 1
  },
  {
    "e": "Rodríguez Hernández, Luis Miguel",
    "i": 1
  },
  {
    "e": "Rodríguez González, Mariano",
    "i": 1
  },
  {
    "e": "Rodríguez Aranday, Fernando",
    "i": 1
  },
  {
    "e": "Rodríguez Alonso, Diana Abigail",
    "i": 1
  },
  {
    "e": "Robles Martínez, Mariana",
    "i": 1
  },
  {
    "e": "Rivera López , Sara",
    "i": 1
  },
  {
    "e": "Rivera Barba, Rodrigo",
    "i": 1
  },
  {
    "e": "Rivas Corrales, Agustín",
    "i": 1
  },
  {
    "e": "Reyes Ramos, Oscar",
    "i": 1
  },
  {
    "e": "Reyes López Ricardo Abiud",
    "i": 1
  },
  {
    "e": "Reyes Juárez Jéssica Mitzy",
    "i": 1
  },
  {
    "e": "Reyes Galván, Karla",
    "i": 1
  },
  {
    "e": "Reyes Corona Oswaldo Guillermo",
    "i": 1
  },
  {
    "e": "Reyes Castañón, Eloy",
    "i": 1
  },
  {
    "e": "Rentería Ortega José Miguel",
    "i": 1
  },
  {
    "e": "Rendón Rodríguez, Jesús Francisco",
    "i": 1
  },
  {
    "e": "Red de Centros de Investigación en Matemática Educativa",
    "i": 1
  },
  {
    "e": "Red Mexicana de Estudios de los Movimientos Sociales",
    "i": 1
  },
  {
    "e": "Razo García Juan Antonio",
    "i": 1
  },
  {
    "e": "Rangel Ceballos, María Jacinta Esperanza",
    "i": 1
  },
  {
    "e": "Ramírez Hernández, José Agustín",
    "i": 1
  },
  {
    "e": "Ramírez Delgado, Andrés",
    "i": 1
  },
  {
    "e": "Ramírez Aguilar Katalina",
    "i": 1
  },
  {
    "e": "Ramos Zúñiga, Carlos Alberto",
    "i": 1
  },
  {
    "e": "RHHR Group",
    "i": 1
  },
  {
    "e": "Quiroga Malo, Jorge Alberto",
    "i": 1
  },
  {
    "e": "Quintana, Brenda Adriana",
    "i": 1
  },
  {
    "e": "Querer Leer",
    "i": 1
  },
  {
    "e": "Qartuppi",
    "i": 1
  },
  {
    "e": "Pérez Sánchez Daniel Francisco",
    "i": 1
  },
  {
    "e": "Pérez Sanjulián Suchowiecky, Victoria",
    "i": 1
  },
  {
    "e": "Pérez Ornelas, José Gilberto",
    "i": 1
  },
  {
    "e": "Pérez Guajardo, Dolores del Carmen",
    "i": 1
  },
  {
    "e": "Pérez Alfaro, Alicia Emilia",
    "i": 1
  },
  {
    "e": "Páez Sánchez, Marlene",
    "i": 1
  },
  {
    "e": "Puebla Contra la Corrupción e Impunidad",
    "i": 1
  },
  {
    "e": "Promoción de Arte Mexicano",
    "i": 1
  },
  {
    "e": "Profesionistas Asociados",
    "i": 1
  },
  {
    "e": "Proactive Strategies",
    "i": 1
  },
  {
    "e": "Pro de la Torre, Humberto José",
    "i": 1
  },
  {
    "e": "Preciado Rodríguez, Miguel Antonio",
    "i": 1
  },
  {
    "e": "Praxis Centro de Educación, Capacitación y Comunicaciones",
    "i": 1
  },
  {
    "e": "Pradilla Molina Carlos Nicolás",
    "i": 1
  },
  {
    "e": "Portillo Lugo, Diana Jazmin",
    "i": 1
  },
  {
    "e": "Por el Derecho a Morir con Dignidad",
    "i": 1
  },
  {
    "e": "Pons Herrera, Eduardo",
    "i": 1
  },
  {
    "e": "Poder Legislativo del Estado de Campeche",
    "i": 1
  },
  {
    "e": "Plascencia Garcia Rafael Alejandro",
    "i": 1
  },
  {
    "e": "Piña Ramírez, Ma. Yesenia",
    "i": 1
  },
  {
    "e": "Pinal Alvarez Prisca Magaly",
    "i": 1
  },
  {
    "e": "Piedrahita Delgado, Angelica Yaneth",
    "i": 1
  },
  {
    "e": "Picazo Luna, Jaime",
    "i": 1
  },
  {
    "e": "Peña Calderas, Ángel Román",
    "i": 1
  },
  {
    "e": "Perrín Rivemar Mercadotecnia",
    "i": 1
  },
  {
    "e": "Perilli Marco",
    "i": 1
  },
  {
    "e": "Perez Lara, Abraham",
    "i": 1
  },
  {
    "e": "Perea Román, Catalina María del Consuelo",
    "i": 1
  },
  {
    "e": "Peralta Valencia, Iliana",
    "i": 1
  },
  {
    "e": "Peralta Sandoval, Jorge Roberto",
    "i": 1
  },
  {
    "e": "Pazos Ortiz, Carlos José María",
    "i": 1
  },
  {
    "e": "Paserios Ediciones",
    "i": 1
  },
  {
    "e": "Partido Revolucionario Institucional",
    "i": 1
  },
  {
    "e": "Paniagua Quiñones, Pablo",
    "i": 1
  },
  {
    "e": "Palero Coronel, Sergio",
    "i": 1
  },
  {
    "e": "Palabras y Plumas Editores",
    "i": 1
  },
  {
    "e": "Padilla Luna Rocío",
    "i": 1
  },
  {
    "e": "Padilla González, Marcial",
    "i": 1
  },
  {
    "e": "Padilla Anaya, Karen Elizabeth",
    "i": 1
  },
  {
    "e": "Ortiz Flores, Modesto",
    "i": 1
  },
  {
    "e": "Ortega Becerril, Alonso Iván",
    "i": 1
  },
  {
    "e": "Orozco Zuart Jorge Antonio",
    "i": 1
  },
  {
    "e": "Organización de los Estados Iberoamericanos para la Educación, la Ciencia y la Cultura",
    "i": 1
  },
  {
    "e": "Ordóñez Villagrán, María del Rosario",
    "i": 1
  },
  {
    "e": "Ordóñez Garza Efrén",
    "i": 1
  },
  {
    "e": "Operadora de Escenarios Deportivos",
    "i": 1
  },
  {
    "e": "Oliva Meza, Fernando Hugo",
    "i": 1
  },
  {
    "e": "Olinyoli",
    "i": 1
  },
  {
    "e": "Olalde González, María del Carmen",
    "i": 1
  },
  {
    "e": "Nuñez, Luciano Antonio",
    "i": 1
  },
  {
    "e": "Nogueda Torres, Benjamín",
    "i": 1
  },
  {
    "e": "Nivon Gerónimo, Ricardo",
    "i": 1
  },
  {
    "e": "Nieto Andrade, Rubén",
    "i": 1
  },
  {
    "e": "Nazar Martínez, Nicolás",
    "i": 1
  },
  {
    "e": "Navejas Díaz, Luis Humberto",
    "i": 1
  },
  {
    "e": "Navarro Leal, Verónica Yudith",
    "i": 1
  },
  {
    "e": "Nava Pichardo, Uriel",
    "i": 1
  },
  {
    "e": "Nava González, Roberto Eliud",
    "i": 1
  },
  {
    "e": "Nava Díaz José",
    "i": 1
  },
  {
    "e": "Nauyaka Producciones y Ediciones",
    "i": 1
  },
  {
    "e": "Muñoz Santiago , Antonio",
    "i": 1
  },
  {
    "e": "Muñoz Escoto, Luis Eduardo",
    "i": 1
  },
  {
    "e": "Murra Remusat, Claudia Ivonne",
    "i": 1
  },
  {
    "e": "Murguía Castaños Jesús Héctor",
    "i": 1
  },
  {
    "e": "Munguía Ávila, Mario",
    "i": 1
  },
  {
    "e": "Munguía Barrón, Lilia",
    "i": 1
  },
  {
    "e": "Mundilibros",
    "i": 1
  },
  {
    "e": "Mota Rojas Daniel",
    "i": 1
  },
  {
    "e": "Morton Subastas",
    "i": 1
  },
  {
    "e": "Moreno Ruiz, Juan Antonio",
    "i": 1
  },
  {
    "e": "Moreno Laporta , María Fernanda",
    "i": 1
  },
  {
    "e": "Morales Villegas Enrique Cuitlahuac",
    "i": 1
  },
  {
    "e": "Morales Encinas, Kenia María",
    "i": 1
  },
  {
    "e": "Morales Domínguez, Mario Alberto",
    "i": 1
  },
  {
    "e": "Montoya Camarena, Blanca Alpina",
    "i": 1
  },
  {
    "e": "Montes Vera, Sixto",
    "i": 1
  },
  {
    "e": "Monterrubio Avila, Catalina Verónica",
    "i": 1
  },
  {
    "e": "Monroy Leon, Juan Carlos",
    "i": 1
  },
  {
    "e": "Molino de Letras Arte",
    "i": 1
  },
  {
    "e": "Molina Rojas, Rebeca",
    "i": 1
  },
  {
    "e": "Molina Mendez, Jorge Alejandro",
    "i": 1
  },
  {
    "e": "Molina Magallanes, Hector Mario",
    "i": 1
  },
  {
    "e": "Mijares Gallegos, Cecilia Itzel",
    "i": 1
  },
  {
    "e": "Miguel Ángel C Manjarrez Alvarez",
    "i": 1
  },
  {
    "e": "Miguel Gómez, Arcadia Guadalupe",
    "i": 1
  },
  {
    "e": "Michel de la Peña, Jaime",
    "i": 1
  },
  {
    "e": "Metafísica Kenich Ahán México",
    "i": 1
  },
  {
    "e": "Merigo Basurto, Jorge Ignacio",
    "i": 1
  },
  {
    "e": "Merchant Ubaldo, Rubén Darío",
    "i": 1
  },
  {
    "e": "Mendoza Medina , Florencia",
    "i": 1
  },
  {
    "e": "Mendoza Jardines, Marcelino",
    "i": 1
  },
  {
    "e": "Megalopolis Fiscal",
    "i": 1
  },
  {
    "e": "Medina Ozuna, Ernesto",
    "i": 1
  },
  {
    "e": "Media Business Generators",
    "i": 1
  },
  {
    "e": "Mañon Pineda, Maria",
    "i": 1
  },
  {
    "e": "Mayoral Peña, León Fernando",
    "i": 1
  },
  {
    "e": "Matías Rendón, Ana",
    "i": 1
  },
  {
    "e": "Matías Rendón Miguel Ángel",
    "i": 1
  },
  {
    "e": "Matiella de Arrigunaga, Carlos Antonio",
    "i": 1
  },
  {
    "e": "Martínez rojas, Arturo",
    "i": 1
  },
  {
    "e": "Martínez Murillo Carlos",
    "i": 1
  },
  {
    "e": "Martínez Monjarás, Saúl Daniel",
    "i": 1
  },
  {
    "e": "Martínez Huerta, José",
    "i": 1
  },
  {
    "e": "Martínez Guadarrama,Yolanda",
    "i": 1
  },
  {
    "e": "Martínez Barba, Camila Georgia",
    "i": 1
  },
  {
    "e": "Martínez Alcántara, Said",
    "i": 1
  },
  {
    "e": "Martín Intriago, Renata",
    "i": 1
  },
  {
    "e": "Marroquín Arreola, Juan",
    "i": 1
  },
  {
    "e": "Magaña Magaña Francisco",
    "i": 1
  },
  {
    "e": "Lúa Nava, Silvia Susana",
    "i": 1
  },
  {
    "e": "López Villa, Juan Raúl",
    "i": 1
  },
  {
    "e": "López Torres, Fernando",
    "i": 1
  },
  {
    "e": "López Padilla, Luis Eduardo Rigoberto",
    "i": 1
  },
  {
    "e": "López Monroy Lilia Andrea",
    "i": 1
  },
  {
    "e": "López Gallo Gocchi, Edgar Iván",
    "i": 1
  },
  {
    "e": "López Benítez Alfonso Manuel",
    "i": 1
  },
  {
    "e": "López Becerra, Norma",
    "i": 1
  },
  {
    "e": "López Barrios, José Juan",
    "i": 1
  },
  {
    "e": "Luisillo Martínez, Nydia",
    "i": 1
  },
  {
    "e": "Los Libros del Sargento",
    "i": 1
  },
  {
    "e": "Los Libros de Caronte",
    "i": 1
  },
  {
    "e": "Lira Mandujano, Jennifer",
    "i": 1
  },
  {
    "e": "Lima Zempoalteca, Jesica Ariadna",
    "i": 1
  },
  {
    "e": "Libros para Imaginar",
    "i": 1
  },
  {
    "e": "Libera Desarrollo Humano, A.C.",
    "i": 1
  },
  {
    "e": "Liber Cats",
    "i": 1
  },
  {
    "e": "León Rodríguez Mariana",
    "i": 1
  },
  {
    "e": "Lettr@ G",
    "i": 1
  },
  {
    "e": "Letras Libres",
    "i": 1
  },
  {
    "e": "Leonardo Ideas de Cambio",
    "i": 1
  },
  {
    "e": "Laurel Valencia Álvaro",
    "i": 1
  },
  {
    "e": "Laboratorios Medicor",
    "i": 1
  },
  {
    "e": "Laboratorios Liomont",
    "i": 1
  },
  {
    "e": "La Red Cesal",
    "i": 1
  },
  {
    "e": "La Orquesta Filosófica",
    "i": 1
  },
  {
    "e": "La Cigarra Gestión Cultural",
    "i": 1
  },
  {
    "e": "Kuri Trad, Miguel Miled",
    "i": 1
  },
  {
    "e": "Kornhauser Valadez, Hany",
    "i": 1
  },
  {
    "e": "Kerlegand de la Fuente, Astrid Igda",
    "i": 1
  },
  {
    "e": "Katarsis de Xalapa",
    "i": 1
  },
  {
    "e": "Juárez Acevedo, Carmen Andrea",
    "i": 1
  },
  {
    "e": "Jus, Libreros y Editores",
    "i": 1
  },
  {
    "e": "Jones Linazasoro Mónica",
    "i": 1
  },
  {
    "e": "Jiménez Treviño, Carlos Manuel",
    "i": 1
  },
  {
    "e": "Jiménez Salazar , Juan Miguel",
    "i": 1
  },
  {
    "e": "Jiménez Mier y Terán, Fernando Juan Bosco",
    "i": 1
  },
  {
    "e": "Jiménez Martínez, Francisco Jaciel",
    "i": 1
  },
  {
    "e": "Jiménez Cantú, Gerardo Guadalupe",
    "i": 1
  },
  {
    "e": "Jiménez Ayala, Efraín Gerardo",
    "i": 1
  },
  {
    "e": "Jarpa Oyarzo, Francisco Javier",
    "i": 1
  },
  {
    "e": "Jaime Ortega, José Antonio",
    "i": 1
  },
  {
    "e": "Islas Martín, Jeanett",
    "i": 1
  },
  {
    "e": "Intidrinero",
    "i": 1
  },
  {
    "e": "Instituto para el desarrollo sustentable en Mesoamérica",
    "i": 1
  },
  {
    "e": "Instituto para el Desarrollo Técnico de las Haciendas Públicas",
    "i": 1
  },
  {
    "e": "Instituto de Investigaciones Sociales",
    "i": 1
  },
  {
    "e": "Instituto Universitario de la Salud de México",
    "i": 1
  },
  {
    "e": "Instituto Tepeyac",
    "i": 1
  },
  {
    "e": "Instituto Tecnológico Superior de Monclova",
    "i": 1
  },
  {
    "e": "Instituto Nacional de Pesca",
    "i": 1
  },
  {
    "e": "Instituto Nacional de Estudios Superiores en Derecho Penal",
    "i": 1
  },
  {
    "e": "Instituto Nacional de Estadística y Geografía",
    "i": 1
  },
  {
    "e": "Instituto Nacional de Ciencias Médicas y Nutrición Salvador Zubirán",
    "i": 1
  },
  {
    "e": "Instituto Municipal de Cultura Culiacán",
    "i": 1
  },
  {
    "e": "Instituto Mexicano del Seguro Social",
    "i": 1
  },
  {
    "e": "Instituto Mexicano de Tecnología del Agua",
    "i": 1
  },
  {
    "e": "Instituto Mexicano de Psicooncología",
    "i": 1
  },
  {
    "e": "Instituto Mexicano de Estudios Pedagógicos",
    "i": 1
  },
  {
    "e": "Instituto Humboldt de Investigaciones Interdisciplinarias en Humanidades",
    "i": 1
  },
  {
    "e": "Instituto Griselda Alvarez",
    "i": 1
  },
  {
    "e": "Instituto Estatal Electoral y de Participación Ciudadana de Oaxaca",
    "i": 1
  },
  {
    "e": "Instituto Electoral del Estado de Querétaro",
    "i": 1
  },
  {
    "e": "Innovación y Desarrollo de Software en la nube EWEBMX",
    "i": 1
  },
  {
    "e": "Innovación Académica y Tecnología",
    "i": 1
  },
  {
    "e": "Impresora Gospa",
    "i": 1
  },
  {
    "e": "Ifyl Group",
    "i": 1
  },
  {
    "e": "Hydra + Fotografía",
    "i": 1
  },
  {
    "e": "Huitrón Cabrera, Mónica Josefina",
    "i": 1
  },
  {
    "e": "Huesca Morales Erik Sigfrido",
    "i": 1
  },
  {
    "e": "Huerta González, Tania",
    "i": 1
  },
  {
    "e": "Hilton De la Vega, Edgar Axel",
    "i": 1
  },
  {
    "e": "Hidalgo Caballero, Juan Carlos",
    "i": 1
  },
  {
    "e": "Hershberger de la Garza Rogerio Gilberto",
    "i": 1
  },
  {
    "e": "Herrera Santamaría Ricardo",
    "i": 1
  },
  {
    "e": "Herrera Rosales, Ernesto",
    "i": 1
  },
  {
    "e": "Herrera Ramírez, Erasmo Martín",
    "i": 1
  },
  {
    "e": "Herrera Cruz, Adriana Belén",
    "i": 1
  },
  {
    "e": "Hernández Vazquez, José de Jesús",
    "i": 1
  },
  {
    "e": "Hernández Rodríguez, Ana Lilia",
    "i": 1
  },
  {
    "e": "Hernández Roa, Andrea",
    "i": 1
  },
  {
    "e": "Hernández Ochoa Juan Arturo",
    "i": 1
  },
  {
    "e": "Hernández González, Darío Fabián",
    "i": 1
  },
  {
    "e": "Hernández González , Jorge Ricardo",
    "i": 1
  },
  {
    "e": "Hernández Flores, Alejandro",
    "i": 1
  },
  {
    "e": "Hernández Ascencio, Emma Guadalupe",
    "i": 1
  },
  {
    "e": "Hakim Simón, Miguel",
    "i": 1
  },
  {
    "e": "Hacerse de Palabras",
    "i": 1
  },
  {
    "e": "Gómez Servin Luis Andrés",
    "i": 1
  },
  {
    "e": "Gómez Lucini Zahara",
    "i": 1
  },
  {
    "e": "Gómez Gutiérrez Carmen Carolina",
    "i": 1
  },
  {
    "e": "Gómez Fuentes, Tomás Jhonatan",
    "i": 1
  },
  {
    "e": "Gómez Castro, Luis Alberto",
    "i": 1
  },
  {
    "e": "Guzman Ramirez, Alejandro",
    "i": 1
  },
  {
    "e": "Gutíerrez Blake, Gonzalo Jacob",
    "i": 1
  },
  {
    "e": "Gutiérrez Lara Jorge Andrés",
    "i": 1
  },
  {
    "e": "Gutiérrez González, Gabriela",
    "i": 1
  },
  {
    "e": "Gutiérrez García, Luis Fabricio",
    "i": 1
  },
  {
    "e": "Gutiérrez Duque, Arturo",
    "i": 1
  },
  {
    "e": "Gutiérrez Castillón, Alejandro",
    "i": 1
  },
  {
    "e": "Gutierrez López, Juan José",
    "i": 1
  },
  {
    "e": "Gutierrez Espinosa Javier",
    "i": 1
  },
  {
    "e": "Grupo de Estudios Ambientales",
    "i": 1
  },
  {
    "e": "Grupo Vanchri",
    "i": 1
  },
  {
    "e": "Grupo Tares",
    "i": 1
  },
  {
    "e": "Grupo Reflexio Ediciones Academia y Comunicación",
    "i": 1
  },
  {
    "e": "Grupo F6-11",
    "i": 1
  },
  {
    "e": "Grupo Editorial Oncesetenta",
    "i": 1
  },
  {
    "e": "Grupo Editores Edsa",
    "i": 1
  },
  {
    "e": "Grupo DG",
    "i": 1
  },
  {
    "e": "Grupo Cultural Lizma",
    "i": 1
  },
  {
    "e": "Grupo 42 Ediciones S.A. DE C. V.",
    "i": 1
  },
  {
    "e": "Grajeda Rosas, Jesús",
    "i": 1
  },
  {
    "e": "Gorrostieta Fernández, Carlos Efrén",
    "i": 1
  },
  {
    "e": "Gordillo Fuentes, Eduardo Jesús",
    "i": 1
  },
  {
    "e": "Goné Zapata, Adán",
    "i": 1
  },
  {
    "e": "González Valdés, Constantino Fernando",
    "i": 1
  },
  {
    "e": "González Ulloa, Juan Carlos",
    "i": 1
  },
  {
    "e": "González Lazcano, Erick César",
    "i": 1
  },
  {
    "e": "González Chávez, Jesús Alejandro",
    "i": 1
  },
  {
    "e": "Gerschman Dawidson Rodolfo Julio",
    "i": 1
  },
  {
    "e": "Gastelum Llamazares, Leonora del Pilar",
    "i": 1
  },
  {
    "e": "Garza Cuellar, Eduardo",
    "i": 1
  },
  {
    "e": "García Montoya, Christopher Kevin",
    "i": 1
  },
  {
    "e": "García Jiménez, Antonio de Jesús",
    "i": 1
  },
  {
    "e": "García García, Jaime",
    "i": 1
  },
  {
    "e": "García García, Francisco Javier",
    "i": 1
  },
  {
    "e": "García García, Ana Miriam",
    "i": 1
  },
  {
    "e": "García Burgos, Francisco Antonio",
    "i": 1
  },
  {
    "e": "García Bautista, Francisco",
    "i": 1
  },
  {
    "e": "Gambini Delgado Milton Giancarlo",
    "i": 1
  },
  {
    "e": "Galán Páez, Carlos Manuel",
    "i": 1
  },
  {
    "e": "Galván Escobar, Elisa",
    "i": 1
  },
  {
    "e": "Gallo Mainero, Manuel",
    "i": 1
  },
  {
    "e": "Gallegos Sánchez, Maribel",
    "i": 1
  },
  {
    "e": "Gallardo Montejano Gil",
    "i": 1
  },
  {
    "e": "Galarraga Palacio, María del Carmen",
    "i": 1
  },
  {
    "e": "Fundación para el Desarrollo del Tercer Sector",
    "i": 1
  },
  {
    "e": "Fundación Vivir en Armonía",
    "i": 1
  },
  {
    "e": "Fundación Universitaria de Derecho, Administración y Política",
    "i": 1
  },
  {
    "e": "Fundación Universidad Nacional Autónoma de México",
    "i": 1
  },
  {
    "e": "Fundación Semillas de Vida",
    "i": 1
  },
  {
    "e": "Fundación México Monterrey 2010",
    "i": 1
  },
  {
    "e": "Fundación Loret de Mola",
    "i": 1
  },
  {
    "e": "Fundación Konrad Adenauer",
    "i": 1
  },
  {
    "e": "Fundación Hogares",
    "i": 1
  },
  {
    "e": "Fundación Grupo México",
    "i": 1
  },
  {
    "e": "Fundación Grisi, A.C.",
    "i": 1
  },
  {
    "e": "Fundación BBVA Bancomer",
    "i": 1
  },
  {
    "e": "Frías García, Alejandrina",
    "i": 1
  },
  {
    "e": "Frutis Sánchez, Diego Fernando",
    "i": 1
  },
  {
    "e": "Freire Cultura Arte y Humanismos",
    "i": 1
  },
  {
    "e": "Francois Flores, Fernando Darío",
    "i": 1
  },
  {
    "e": "Frade Rubio, Laura Gloria",
    "i": 1
  },
  {
    "e": "Fondo de las Naciones Unidas para la Infancia",
    "i": 1
  },
  {
    "e": "Fondo de Población de las Naciones",
    "i": 1
  },
  {
    "e": "Fondo Mexicano para la Conservación de la Naturaleza, A.C.",
    "i": 1
  },
  {
    "e": "Fomento Cultural Banamex",
    "i": 1
  },
  {
    "e": "Flores Cavazos Silvia",
    "i": 1
  },
  {
    "e": "Fleischer Rebenich Grupo Editorial",
    "i": 1
  },
  {
    "e": "Figueroa Figueroa, Yolanda Susana",
    "i": 1
  },
  {
    "e": "Figueroa Estrada, Julio",
    "i": 1
  },
  {
    "e": "Exn América",
    "i": 1
  },
  {
    "e": "Etnograf, Gestión y Cultura",
    "i": 1
  },
  {
    "e": "Estrada Erives, Silvia",
    "i": 1
  },
  {
    "e": "Estefani Monarrez, Guillermo",
    "i": 1
  },
  {
    "e": "Esquivel Caudillo, Rosa María",
    "i": 1
  },
  {
    "e": "Esquinca Díaz, Martha Rosa",
    "i": 1
  },
  {
    "e": "Espinosa Gayosso, Ivan Gabriel",
    "i": 1
  },
  {
    "e": "Esparza Rodríguez, Oralia",
    "i": 1
  },
  {
    "e": "Escuela de Derecho, Posgrados y Práctica Jurídica",
    "i": 1
  },
  {
    "e": "Escuela Normal de Chalco",
    "i": 1
  },
  {
    "e": "Escobar Méndez, Italibi",
    "i": 1
  },
  {
    "e": "Erik Tomás Guerrero Ariciaga",
    "i": 1
  },
  {
    "e": "El Camino Rojo Ediciones",
    "i": 1
  },
  {
    "e": "Educación Superior de Celaya",
    "i": 1
  },
  {
    "e": "Editorial y Distribuidora Académica Libertad Mexicana",
    "i": 1
  },
  {
    "e": "Editorial TDQ",
    "i": 1
  },
  {
    "e": "Editorial RM",
    "i": 1
  },
  {
    "e": "Editorial Pez en el árbol",
    "i": 1
  },
  {
    "e": "Editorial Palabras Palibros",
    "i": 1
  },
  {
    "e": "Editorial Odontología Actual",
    "i": 1
  },
  {
    "e": "Editorial Mangos de Hacha",
    "i": 1
  },
  {
    "e": "Editorial Innovación Educativa S.A. DE C.V.",
    "i": 1
  },
  {
    "e": "Editorial Garabatos",
    "i": 1
  },
  {
    "e": "Editorial Fata Morgana",
    "i": 1
  },
  {
    "e": "Editorial Ducere",
    "i": 1
  },
  {
    "e": "Editorial Botello",
    "i": 1
  },
  {
    "e": "Editorial Académica Dragón Azteca",
    "i": 1
  },
  {
    "e": "Editores Minerva",
    "i": 1
  },
  {
    "e": "Editora Alternativa Periodística",
    "i": 1
  },
  {
    "e": "Edisepa",
    "i": 1
  },
  {
    "e": "Ediciones Panamericana México",
    "i": 1
  },
  {
    "e": "Ediciones Once Ríos",
    "i": 1
  },
  {
    "e": "Ediciones Momo",
    "i": 1
  },
  {
    "e": "Ediciones Las Américas",
    "i": 1
  },
  {
    "e": "Ediciones La Máquina Roja",
    "i": 1
  },
  {
    "e": "Ediciones Juridicas Alma",
    "i": 1
  },
  {
    "e": "Ediciones Impresas y Digitales del Río",
    "i": 1
  },
  {
    "e": "Ediciones Gyros",
    "i": 1
  },
  {
    "e": "Ediciones Felou",
    "i": 1
  },
  {
    "e": "Ediciones Duruelo",
    "i": 1
  },
  {
    "e": "Ediciones Coyoacán",
    "i": 1
  },
  {
    "e": "Ediciones Constancia",
    "i": 1
  },
  {
    "e": "Ediciones Casa del Catequista",
    "i": 1
  },
  {
    "e": "Ediciones Bellas Letras",
    "i": 1
  },
  {
    "e": "Ecoe Ediciones México",
    "i": 1
  },
  {
    "e": "Echeverría Fuentes, Rafael de Jesús",
    "i": 1
  },
  {
    "e": "Echeverria Luna, Francisco Javier",
    "i": 1
  },
  {
    "e": "EG Comunicación",
    "i": 1
  },
  {
    "e": "Díaz y Rubio María Margarita",
    "i": 1
  },
  {
    "e": "Díaz de la Serna Braojos, María Cristina",
    "i": 1
  },
  {
    "e": "Díaz de León Gutiérrez, Uriel Misael",
    "i": 1
  },
  {
    "e": "Díaz Rosado, Karla Michelle",
    "i": 1
  },
  {
    "e": "Díaz Campuzano José Manuel",
    "i": 1
  },
  {
    "e": "Díaz Barriga Salgado, José",
    "i": 1
  },
  {
    "e": "Dzib Cambranis, Luis Martín",
    "i": 1
  },
  {
    "e": "Durán Vela, Teresita de Jesús",
    "i": 1
  },
  {
    "e": "Dozal Martínez, Constanza",
    "i": 1
  },
  {
    "e": "Domínguez Nárez Amada Bercy",
    "i": 1
  },
  {
    "e": "Domínguez Arreola, Alejandro",
    "i": 1
  },
  {
    "e": "Documental Ambulante",
    "i": 1
  },
  {
    "e": "Digitalización Legal",
    "i": 1
  },
  {
    "e": "Diez de Urdanivia Serrano Fernando",
    "i": 1
  },
  {
    "e": "Diana Langarica Martínez",
    "i": 1
  },
  {
    "e": "Destrazas Ediciones",
    "i": 1
  },
  {
    "e": "Demos, Desarrollo de Medios",
    "i": 1
  },
  {
    "e": "Delgado Torres, Raúl",
    "i": 1
  },
  {
    "e": "Del Rio  Zepeda, Diego",
    "i": 1
  },
  {
    "e": "Del Pueblito Soto González, Fidel",
    "i": 1
  },
  {
    "e": "Del Moral Espinosa, Adriana Erika",
    "i": 1
  },
  {
    "e": "De la Vega Oviedo José Federico",
    "i": 1
  },
  {
    "e": "De la O Soto  , José Guadalupe",
    "i": 1
  },
  {
    "e": "De Gracia Serrano, Greisy Elzébir",
    "i": 1
  },
  {
    "e": "Dayan Y Abadi, Irene",
    "i": 1
  },
  {
    "e": "Dacasa Antón, Alberto",
    "i": 1
  },
  {
    "e": "Cárdenas Aldrete Rafael",
    "i": 1
  },
  {
    "e": "Cuevas Torres, Daniel",
    "i": 1
  },
  {
    "e": "Cruz Zambrano, Ángel",
    "i": 1
  },
  {
    "e": "Cruz González, Norma Patricia",
    "i": 1
  },
  {
    "e": "Cortés Gutiérrez, Ramón",
    "i": 1
  },
  {
    "e": "Cortés González Rosalino",
    "i": 1
  },
  {
    "e": "Corporativo Intermédica",
    "i": 1
  },
  {
    "e": "Coronado Peña, Diana",
    "i": 1
  },
  {
    "e": "Corella Torres, Norberto Enrique",
    "i": 1
  },
  {
    "e": "Contreras Beltrán Yesid",
    "i": 1
  },
  {
    "e": "Contreras Barcelata, Natalia",
    "i": 1
  },
  {
    "e": "Construyendo Organizaciones Civiles Transparentes",
    "i": 1
  },
  {
    "e": "Consejo Nacional para la Enseñanza y la Investigación de las Ciencias de la Comunicación",
    "i": 1
  },
  {
    "e": "Consejo Nacional de Acreditación en Informática y Computación",
    "i": 1
  },
  {
    "e": "Consejo Estatal de la Mujer y Bienestar Social",
    "i": 1
  },
  {
    "e": "Conocimiento y Saber Siglo XXI",
    "i": 1
  },
  {
    "e": "Condé Nast de México",
    "i": 1
  },
  {
    "e": "Conde Zambada, Hilda Rosina",
    "i": 1
  },
  {
    "e": "Con Sentidos. Rutas para la Educación",
    "i": 1
  },
  {
    "e": "Comité para la Evaluación de Programas de Pedagogía y Educación",
    "i": 1
  },
  {
    "e": "Comisión de Derechos Humanos del Estado de Aguascalientes",
    "i": 1
  },
  {
    "e": "Comisión Nacional para el Desarrollo de los Pueblos Indígenas",
    "i": 1
  },
  {
    "e": "Colegio de Etnólogos y Antropólogos Sociales",
    "i": 1
  },
  {
    "e": "Colegio Nacional de Ritos Masónicos de la República Mexicana, A. C.",
    "i": 1
  },
  {
    "e": "Colegio Mexicano de Nutriólogos Renales",
    "i": 1
  },
  {
    "e": "Clínica de la Ansiedad y Salud Mental",
    "i": 1
  },
  {
    "e": "Cisneros Basurto Irma Leticia",
    "i": 1
  },
  {
    "e": "Chávez Hernández, Jorge Vicente",
    "i": 1
  },
  {
    "e": "Chay Arzápalo, Rafael",
    "i": 1
  },
  {
    "e": "Cestau Liz Americo Daniel",
    "i": 1
  },
  {
    "e": "Cervantes Islas Francisco Eduardo",
    "i": 1
  },
  {
    "e": "Centro de Investigación y Estudios sobre Sociedad Civil",
    "i": 1
  },
  {
    "e": "Centro de Investigaciones Biológicas del Noroeste",
    "i": 1
  },
  {
    "e": "Centro de Estudios para el Desarrollo Alternativo",
    "i": 1
  },
  {
    "e": "Centro de Estudios Sociales Antonio Gramsci",
    "i": 1
  },
  {
    "e": "Centro de Estudios Internacionales en Política, Gobierno y Participación Ciudadana",
    "i": 1
  },
  {
    "e": "Centro de Estudios Espinosa Yglesias",
    "i": 1
  },
  {
    "e": "Centro Nacional de Metrología",
    "i": 1
  },
  {
    "e": "Centro Editorial Buena Nueva",
    "i": 1
  },
  {
    "e": "Central General",
    "i": 1
  },
  {
    "e": "Castillo Ramírez, Gustavo Adolfo",
    "i": 1
  },
  {
    "e": "Castillo González Rodrigo Daniel",
    "i": 1
  },
  {
    "e": "Castañón Holguín Aarón Mariano",
    "i": 1
  },
  {
    "e": "Castañeda Rivas , Lizbeth",
    "i": 1
  },
  {
    "e": "Casillas García de Presno, Andrés",
    "i": 1
  },
  {
    "e": "Casalia Ediciones",
    "i": 1
  },
  {
    "e": "Casa Cultural Berea",
    "i": 1
  },
  {
    "e": "Carrillo García, Raúl",
    "i": 1
  },
  {
    "e": "Carreto Bernal Fernando",
    "i": 1
  },
  {
    "e": "Caro Espinoza José Alfredo",
    "i": 1
  },
  {
    "e": "Carlos Martínez, Rosendo",
    "i": 1
  },
  {
    "e": "Campus Universitario Siglo XXI",
    "i": 1
  },
  {
    "e": "Campo Real Vinícola",
    "i": 1
  },
  {
    "e": "Calles Salazar, María Guadalupe",
    "i": 1
  },
  {
    "e": "Caligrama Editores",
    "i": 1
  },
  {
    "e": "Caja Popular Méxicana",
    "i": 1
  },
  {
    "e": "Cabello Alcérreca, Alejandro",
    "i": 1
  },
  {
    "e": "Buenrostro Soriano, Farid",
    "i": 1
  },
  {
    "e": "Brewster, Wayne Harold",
    "i": 1
  },
  {
    "e": "Braña Fernández, Fabiola",
    "i": 1
  },
  {
    "e": "Bravo Vargas, Gerardo",
    "i": 1
  },
  {
    "e": "Bravo González, Ignacio Alberto",
    "i": 1
  },
  {
    "e": "Bracamonte Abimeri, Ana Valeria",
    "i": 1
  },
  {
    "e": "Booktique Art, Books And Publishing",
    "i": 1
  },
  {
    "e": "Bolívar Sánchez, Lucia del Pilar",
    "i": 1
  },
  {
    "e": "Bodega de Libros",
    "i": 1
  },
  {
    "e": "Blanco Tatto, Alejandro",
    "i": 1
  },
  {
    "e": "Biondo, Luciana María",
    "i": 1
  },
  {
    "e": "Bertruy Herrera, Rosa María",
    "i": 1
  },
  {
    "e": "Bernal Serrano, Amanda Ingrid",
    "i": 1
  },
  {
    "e": "Benemérita y Centenaria Escuela Normal del Estado de San Luis Potosí",
    "i": 1
  },
  {
    "e": "Beltrán Rodríguez, Aarón Alberto",
    "i": 1
  },
  {
    "e": "Beltrán Cerpa, María Magdalena",
    "i": 1
  },
  {
    "e": "Becerra Pérez, Luis Armando",
    "i": 1
  },
  {
    "e": "Bauza Bermúdez, María Margarita",
    "i": 1
  },
  {
    "e": "Bautista Lozano Tayde",
    "i": 1
  },
  {
    "e": "Basílica de Guadalupe",
    "i": 1
  },
  {
    "e": "Barroso Barroso Roxana",
    "i": 1
  },
  {
    "e": "Barreda Villarreal, Raquel María Teresa",
    "i": 1
  },
  {
    "e": "Barranco Ávila, José Carlos",
    "i": 1
  },
  {
    "e": "Barbosa Cano, Manlio Flavio",
    "i": 1
  },
  {
    "e": "Barba Vizcaino, Francisco Rosendo",
    "i": 1
  },
  {
    "e": "Barahona Londoño , Andrés",
    "i": 1
  },
  {
    "e": "B1Mas4Digital",
    "i": 1
  },
  {
    "e": "Axolotl Libros",
    "i": 1
  },
  {
    "e": "Avilés Cano Mariana",
    "i": 1
  },
  {
    "e": "Auditoría Superior de la Federación",
    "i": 1
  },
  {
    "e": "Athié Esquivel, Alessandra Habibi",
    "i": 1
  },
  {
    "e": "Ateneo Español de México",
    "i": 1
  },
  {
    "e": "Astudillo Barrios, María de Jesús",
    "i": 1
  },
  {
    "e": "Aspid",
    "i": 1
  },
  {
    "e": "Asociación de Profesionales e Investigadores en Ciencias de la Educación a Distancia",
    "i": 1
  },
  {
    "e": "Asociación de Consultores, Estrategas e Investigadores Políticos",
    "i": 1
  },
  {
    "e": "Asociación de Artistas Plásticos de México",
    "i": 1
  },
  {
    "e": "Asociación Nacional del Libro",
    "i": 1
  },
  {
    "e": "Asociación Mexicana de Ingeniería de Vías Terrestres",
    "i": 1
  },
  {
    "e": "Asociación Iberoamericana de Filosofía Práctica A.I.F.P.",
    "i": 1
  },
  {
    "e": "Asociación Cultural El Estanquillo",
    "i": 1
  },
  {
    "e": "Asiain Díaz de León, Héctor Alberto",
    "i": 1
  },
  {
    "e": "Arvizu Varela, Ernesto Antonio",
    "i": 1
  },
  {
    "e": "Artic Cord",
    "i": 1
  },
  {
    "e": "Artes Gráficas Panorama",
    "i": 1
  },
  {
    "e": "Art Graffitti Editorial",
    "i": 1
  },
  {
    "e": "Arroyo Andrade Armando",
    "i": 1
  },
  {
    "e": "Arreola Ramírez, Oscar Alejandro",
    "i": 1
  },
  {
    "e": "Arreguín Medina Salvador",
    "i": 1
  },
  {
    "e": "Arredondo García, Guadalupe",
    "i": 1
  },
  {
    "e": "Aristalia, S.A. de C.V.",
    "i": 1
  },
  {
    "e": "Arianda Raquel Campos Quezada",
    "i": 1
  },
  {
    "e": "Arcique Calderón, Miguel Ángel",
    "i": 1
  },
  {
    "e": "Archivo Histórico Municipal de Irapuato",
    "i": 1
  },
  {
    "e": "Aprenda Practicando",
    "i": 1
  },
  {
    "e": "Apoyo, Salud y Asistencia GIN",
    "i": 1
  },
  {
    "e": "Animal Karma",
    "i": 1
  },
  {
    "e": "Angüis Terrazas, Victoriano",
    "i": 1
  },
  {
    "e": "Andrade Pelayo Rodolfo",
    "i": 1
  },
  {
    "e": "Andrade García, Cristóbal",
    "i": 1
  },
  {
    "e": "Ancira Posadas Karla Mariel",
    "i": 1
  },
  {
    "e": "Ana Lizbeth Lara González",
    "i": 1
  },
  {
    "e": "Amtalai Publishers",
    "i": 1
  },
  {
    "e": "Amigos del Museo de Arte Contemporáneo de Oaxaca",
    "i": 1
  },
  {
    "e": "American Renewables Institute",
    "i": 1
  },
  {
    "e": "Alvillar Moreno, Agustin",
    "i": 1
  },
  {
    "e": "Alvarado Zemleduch, Cesia",
    "i": 1
  },
  {
    "e": "Alvarado Corrales Ángel",
    "i": 1
  },
  {
    "e": "Almazán Arreola, Minerva",
    "i": 1
  },
  {
    "e": "Almaguer de la Garza, Jesica Marlen",
    "i": 1
  },
  {
    "e": "Alfaro Gómez, Melba Trinidad",
    "i": 1
  },
  {
    "e": "Alemán Sánchez Juan Manuel",
    "i": 1
  },
  {
    "e": "Alejandro Del Castillo Garza",
    "i": 1
  },
  {
    "e": "Aguilar Ramírez, Carlos Raúl",
    "i": 1
  },
  {
    "e": "Aguilar López, Carlos Ricardo",
    "i": 1
  },
  {
    "e": "Agencia Mexicana de Comunicación en Ciencia & Cultura Educativa Mx",
    "i": 1
  },
  {
    "e": "Agami Zaga, Carlos",
    "i": 1
  },
  {
    "e": "Agalmata Ediciones",
    "i": 1
  },
  {
    "e": "Afinita Editorial México",
    "i": 1
  },
  {
    "e": "Afif Sarkis Johana",
    "i": 1
  },
  {
    "e": "Afana, Desire",
    "i": 1
  },
  {
    "e": "Acantaros Vargas Miguel Ángel",
    "i": 1
  },
  {
    "e": "Academia Nacional de Investigación en Trabajo Social ACANITS",
    "i": 1
  },
  {
    "e": "Academia Mexicana para la Educación e Investigación en Ciencias, Artes y Humanidades",
    "i": 1
  },
  {
    "e": "Academia Mexicana de Paisaje",
    "i": 1
  },
  {
    "e": "Academia Mexicana Multidisciplinaria",
    "i": 1
  },
  {
    "e": "Academia Jalisciense de Ciencias",
    "i": 1
  },
  {
    "e": "Academia Internacional de Ciencias Político-Administrativas y Estudios de Futuro",
    "i": 1
  },
  {
    "e": "Abundis Medina, Adriana Lourdes",
    "i": 1
  },
  {
    "e": "Abogados García Maldonado",
    "i": 1
  },
  {
    "e": "4N4M4RT0R3LL",
    "i": 1
  },
  {
    "e": "Ávila, José Melchor Óscar",
    "i": 1
  }
]