<?xml version="1.0" encoding="UTF-8" standalone="no"?>
<svg
   xmlns:dc="http://purl.org/dc/elements/1.1/"
   xmlns:cc="http://creativecommons.org/ns#"
   xmlns:rdf="http://www.w3.org/1999/02/22-rdf-syntax-ns#"
   xmlns:svg="http://www.w3.org/2000/svg"
   xmlns="http://www.w3.org/2000/svg"
   xmlns:sodipodi="http://sodipodi.sourceforge.net/DTD/sodipodi-0.dtd"
   xmlns:inkscape="http://www.inkscape.org/namespaces/inkscape"
   height="24"
   viewBox="0 0 100 24"
   width="100"
   version="1.1"
   id="svg861"
   sodipodi:docname="icon.svg"
   inkscape:version="1.0.1 (3bc2e813f5, 2020-09-07)"
   inkscape:export-filename="/home/kenkeiras/repos/programaker/bridges/caldav-bridge/icon.png"
   inkscape:export-xdpi="160"
   inkscape:export-ydpi="160">
  <metadata
     id="metadata867">
    <rdf:RDF>
      <cc:Work
         rdf:about="">
        <dc:format>image/svg+xml</dc:format>
        <dc:type
           rdf:resource="http://purl.org/dc/dcmitype/StillImage" />
        <dc:title></dc:title>
      </cc:Work>
    </rdf:RDF>
  </metadata>
  <defs
     id="defs865" />
  <sodipodi:namedview
     pagecolor="#ffffff"
     bordercolor="#666666"
     borderopacity="1"
     objecttolerance="10"
     gridtolerance="10"
     guidetolerance="10"
     inkscape:pageopacity="0"
     inkscape:pageshadow="2"
     inkscape:window-width="2558"
     inkscape:window-height="1415"
     id="namedview863"
     showgrid="false"
     inkscape:zoom="6.375"
     inkscape:cx="124.7"
     inkscape:cy="1.009"
     inkscape:window-x="1366"
     inkscape:window-y="23"
     inkscape:window-maximized="1"
     inkscape:current-layer="svg861" />
  <path
     d="M 6,0 H 30 V 24 H 6 Z"
     fill="none"
     id="path857" />
  <path
     d="M 25,3 H 24 V 1 H 22 V 3 H 14 V 1 H 12 V 3 H 11 C 9.89,3 9.01,3.9 9.01,5 L 9,19 c 0,1.1 0.89,2 2,2 h 14 c 1.1,0 2,-0.9 2,-2 V 5 C 27,3.9 26.1,3 25,3 Z m 0,16 H 11 V 8 H 25 Z M 13,10 h 5 v 5 h -5 z"
     id="path859"
     style="fill:#1a1a1a" />
  <text
     xml:space="preserve"
     style="font-style:normal;font-variant:normal;font-weight:normal;font-stretch:normal;font-size:18.6667px;line-height:1.25;font-family:RobotoBold;-inkscape-font-specification:RobotoBold;letter-spacing:0px;word-spacing:0px;fill:#000000;fill-opacity:1;stroke:none"
     x="30.13"
     y="19.01"
     id="text871"><tspan
       sodipodi:role="line"
       id="tspan869"
       x="30.13"
       y="19.01">CalDAV</tspan></text>
</svg>
