@startuml ejemplo1
class Padre  {
    + nombre:string
    +apellidos: string
    + edad: int
    #altura: int-tipo: string

    +Padre(nombre:string, apellidos:string,edad:int, altura:int,tipo:string)
    + presentarme(). string
    +asignar: (nombre: string, apellidos:string): self
    + getTipo(): string
    +setTipo(tipo:string):self
    
}   
@enduml