<?xml version="1.0" encoding="utf-8"?>
<!-- Generator: Adobe Illustrator 24.1.0, SVG Export Plug-In . SVG Version: 6.00 Build 0)  -->
<svg version="1.1" id="Layer_1" xmlns="http://www.w3.org/2000/svg" xmlns:xlink="http://www.w3.org/1999/xlink" x="0px" y="0px"
	 viewBox="0 0 531 184.25197" style="enable-background:new 0 0 531 184.25197;" xml:space="preserve">
<style type="text/css">
	.st0{fill:none;stroke:#707070;stroke-miterlimit:10;}
	.st1{enable-background:new    ;}
	.st2{fill:none;stroke:#009EFF;stroke-miterlimit:10;}
	.st3{fill:none;stroke:#00AD84;stroke-miterlimit:10;}
	.st4{fill:none;stroke:#FF0049;stroke-miterlimit:10;}
</style>
<path pointer-events="stroke" class="st0" d="M210.5,20.5v57.76"/>
<path pointer-events="all" class="st0" d="M207,72.38l3.5,7l3.5-7"/>
<path pointer-events="stroke" class="st0" d="M245.5,20.5v20c0,6.66667,3.33333,10,10,10h85c6.66666,0,10,3.33333,10,10V78.26"/>
<path pointer-events="all" class="st0" d="M347,72.38l3.5,7l3.5-7"/>
<g transform="translate(-0.5 -0.5)">
	<g class="st1">
		<path d="M172.83984,13.40841h1.46436V8.11642h-1.38037v-1.0918h4.12793v1.0918h-1.46387v5.29199h1.52393v1.0918h-4.27197V13.40841
			z"/>
		<path d="M179.63818,14.25412c-0.4043-0.24414-0.72217-0.58789-0.9541-1.03223c-0.23242-0.44336-0.34814-0.94922-0.34814-1.51758
			c0-0.54395,0.11572-1.03809,0.34814-1.48242c0.23193-0.44336,0.5498-0.79395,0.9541-1.0498
			c0.40381-0.25586,0.85352-0.38379,1.34961-0.38379s0.94824,0.12793,1.35645,0.38379
			c0.40771,0.25586,0.72949,0.60645,0.96582,1.0498c0.23584,0.44434,0.354,0.93848,0.354,1.48242
			c0,0.56836-0.11816,1.07227-0.354,1.51172c-0.23633,0.44043-0.55811,0.78418-0.96582,1.03223
			c-0.4082,0.24805-0.86035,0.37207-1.35645,0.37207S180.04199,14.49826,179.63818,14.25412z M181.93604,13.03049
			c0.24805-0.33984,0.37207-0.78223,0.37207-1.32617c0-0.55957-0.12207-1.00391-0.36621-1.33203s-0.56201-0.49219-0.9541-0.49219
			c-0.37598,0-0.68604,0.16602-0.92969,0.49805c-0.24414,0.33203-0.36621,0.77441-0.36621,1.32617
			c0,0.54395,0.12207,0.98633,0.36621,1.32617c0.24365,0.33984,0.55371,0.50977,0.92969,0.50977
			C181.37207,13.54025,181.68799,13.37033,181.93604,13.03049z"/>
		<path d="M191.48779,14.40451c-0.43164-0.15234-0.78809-0.37598-1.06787-0.67188l0.66016-1.11621l0.04785-0.09668l0.10791,0.06055
			c0.02393,0.08008,0.0498,0.14844,0.07812,0.2041c0.02783,0.05566,0.08594,0.12402,0.17383,0.2041
			c0.44824,0.34375,0.94824,0.51562,1.5,0.51562c0.36816,0,0.66602-0.08594,0.89404-0.25781s0.34229-0.41016,0.34229-0.71387
			c0-0.17578-0.03809-0.33008-0.11426-0.46191s-0.22021-0.27051-0.43164-0.41406c-0.2124-0.14453-0.52246-0.3125-0.93018-0.50391
			c-0.76025-0.32812-1.29199-0.66992-1.59619-1.02637c-0.3042-0.35547-0.45605-0.79004-0.45605-1.30176
			c0-0.36035,0.10205-0.68652,0.30615-0.97852c0.2041-0.29199,0.48779-0.52148,0.85205-0.68945
			c0.36377-0.16797,0.77393-0.25195,1.22998-0.25195c0.91992,0,1.67578,0.31934,2.26807,0.95996l-0.79199,0.91211l-0.07227,0.08398
			l-0.0957-0.07227c-0.0083-0.08008-0.02393-0.14844-0.04785-0.2041c-0.02441-0.05566-0.07617-0.12793-0.15625-0.21582
			c-0.15186-0.13574-0.31201-0.23047-0.47998-0.28223s-0.37207-0.07812-0.61182-0.07812c-0.31201,0-0.56836,0.07422-0.76807,0.22266
			c-0.2002,0.14746-0.30029,0.3252-0.30029,0.5332c0,0.17676,0.03809,0.32617,0.11426,0.4502
			c0.07568,0.12402,0.22168,0.25391,0.43799,0.38965c0.21582,0.13672,0.55176,0.30859,1.00781,0.5166
			c0.51221,0.23242,0.9082,0.45801,1.18799,0.67773c0.28027,0.2207,0.47998,0.45801,0.6001,0.71387
			c0.12012,0.25684,0.18018,0.56836,0.18018,0.93652c0,0.38379-0.09619,0.74219-0.28809,1.07422s-0.48584,0.59961-0.88184,0.80371
			s-0.89014,0.30566-1.48242,0.30566C192.39209,14.63205,191.91992,14.55588,191.48779,14.40451z"/>
		<path d="M197.11621,14.0383c-0.35254-0.4043-0.52832-1.01758-0.52832-1.8418V8.92013h1.36816v3.27637
			c0,0.47168,0.07812,0.81543,0.23389,1.03125c0.15625,0.2168,0.36621,0.32422,0.62988,0.32422
			c0.35205,0,0.63037-0.12207,0.83398-0.36621c0.2041-0.24316,0.30615-0.60547,0.30615-1.08594V8.92013h1.35596v4.69238
			c0,0.21582,0.00586,0.38574,0.01807,0.50977s0.0459,0.25,0.10205,0.37793h-1.23584
			c-0.05615-0.10352-0.09033-0.20996-0.10205-0.31836c-0.01221-0.10742-0.01807-0.24121-0.01807-0.40137
			c-0.16016,0.28027-0.37793,0.49414-0.6543,0.6416c-0.27588,0.14844-0.56982,0.22168-0.88184,0.22168
			C197.94385,14.64377,197.46777,14.44259,197.11621,14.0383z"/>
		<path d="M203.9082,8.90841v0.78027c0.34375-0.60059,0.86768-0.90039,1.57178-0.90039c0.41602,0,0.79004,0.1123,1.12207,0.33594
			s0.5957,0.55762,0.79199,1.00195c0.1958,0.44434,0.29395,0.97754,0.29395,1.60156c0,0.63281-0.10205,1.16699-0.30615,1.60254
			c-0.20361,0.43652-0.47607,0.76367-0.81592,0.98438c-0.33984,0.21973-0.70996,0.3291-1.10986,0.3291
			c-0.31201,0-0.6001-0.05371-0.86426-0.16113c-0.26367-0.1084-0.47607-0.2627-0.63574-0.46289v2.48438h-1.37988l-0.01221-7.5957
			H203.9082z M206.00195,13.13791c0.22803-0.2998,0.34229-0.79395,0.34229-1.48145c0-0.56836-0.1084-1.00977-0.32422-1.32617
			S205.5,9.85666,205.10791,9.85666c-0.77588,0-1.16406,0.65137-1.16406,1.95508c0.00781,0.60059,0.10596,1.04688,0.29395,1.33887
			s0.47021,0.4375,0.84619,0.4375C205.46777,13.5881,205.77393,13.43869,206.00195,13.13791z"/>
		<path d="M209.81201,14.29025c-0.42432-0.22852-0.75391-0.55762-0.99023-0.99023c-0.23584-0.43164-0.354-0.94824-0.354-1.54785
			s0.11621-1.12402,0.34814-1.57227c0.23193-0.44727,0.54785-0.79199,0.94824-1.03125
			c0.3999-0.24023,0.84375-0.36035,1.33203-0.36035c0.43945,0,0.8418,0.10352,1.20557,0.31152
			c0.36426,0.20898,0.6543,0.5166,0.87012,0.9248c0.21631,0.40723,0.32422,0.89941,0.32422,1.47559
			c0,0.17578-0.0083,0.36816-0.02393,0.57617h-3.69629c0.02393,0.48828,0.18408,0.86035,0.47998,1.11621
			s0.64795,0.38379,1.05615,0.38379c0.54395,0,0.98779-0.17578,1.33203-0.52832l0.6958,0.67188
			c-0.52002,0.6084-1.21582,0.91211-2.08789,0.91211C210.71582,14.63205,210.23584,14.51779,209.81201,14.29025z
			 M211.87598,10.16232c-0.2002-0.21191-0.47998-0.31836-0.83984-0.31836c-0.32812,0-0.60449,0.10254-0.82812,0.30664
			c-0.22412,0.20312-0.35986,0.50586-0.4082,0.90527h2.37598C212.17578,10.67209,212.07568,10.37424,211.87598,10.16232z"/>
		<path d="M219.61621,9.42404l-0.57617,1.14062l-0.03613,0.0957l-0.10791-0.04785c-0.0083-0.02441-0.02588-0.07812-0.0542-0.16211
			c-0.02783-0.08398-0.09375-0.17383-0.19775-0.27051c-0.24805-0.18359-0.5-0.27539-0.75586-0.27539
			c-0.41602,0-0.76025,0.13965-1.03223,0.41992s-0.40771,0.69531-0.40771,1.24805v2.92773h-1.38037V8.92013h1.4043l-0.01221,0.91211
			c0.15186-0.32031,0.37402-0.57422,0.66602-0.76172c0.29199-0.18848,0.60596-0.28223,0.94189-0.28223
			C218.69971,8.7883,219.21582,9.00021,219.61621,9.42404z"/>
		<path d="M225.56787,8.92013c-0.06396,0.56836-0.2998,1.34375-0.70801,2.32812l-1.34375,3.25195h-1.06787l-2.1001-5.58008h1.41602
			l1.34375,3.74414l0.64795-1.57227c0.32812-0.83984,0.5083-1.56348,0.54004-2.17188H225.56787z"/>
		<path d="M227.00781,13.43185h1.36816V9.98849h-1.2959V8.92013h2.66406v4.51172h1.24805v1.06836h-3.98438V13.43185z
			 M228.3999,7.75607c-0.16797-0.16016-0.25195-0.35156-0.25195-0.57617c0-0.23145,0.08008-0.42578,0.24023-0.58203
			c0.15967-0.15527,0.36377-0.2334,0.61182-0.2334c0.23193,0,0.43213,0.08008,0.6001,0.23926
			c0.16797,0.16016,0.25195,0.35254,0.25195,0.57617c0,0.22461-0.08398,0.41602-0.25195,0.57617S229.23193,7.9963,229,7.9963
			S228.56787,7.91623,228.3999,7.75607z"/>
		<path d="M232.54004,13.74435l0.6001-1.10449l0.04785-0.0957l0.09619,0.05957c0.02393,0.08887,0.0498,0.16016,0.07764,0.2168
			c0.02832,0.05566,0.08594,0.12402,0.17432,0.2041c0.20801,0.17578,0.43994,0.30957,0.6958,0.40137s0.55615,0.13867,0.8999,0.13867
			c0.32812,0,0.58594-0.05664,0.77393-0.16797c0.18799-0.1123,0.28223-0.26074,0.28223-0.44434
			c0-0.17578-0.09424-0.32031-0.28223-0.43262c-0.18799-0.11133-0.52979-0.23926-1.02588-0.38379
			c-0.64795-0.16797-1.14209-0.3916-1.48193-0.67188s-0.50977-0.63574-0.50977-1.06738c0-0.30469,0.08984-0.57812,0.27002-0.82227
			c0.17969-0.24414,0.43555-0.43652,0.76758-0.57617s0.71826-0.20996,1.1582-0.20996c0.91992,0,1.66797,0.28418,2.24414,0.85156
			l-0.66016,0.9248l-0.08398,0.0957L236.5,10.5881c-0.01611-0.08008-0.03809-0.14746-0.06592-0.2041
			c-0.02832-0.05566-0.08594-0.12402-0.17432-0.2041c-0.32812-0.23145-0.71191-0.34766-1.15186-0.34766
			c-0.28809,0-0.52588,0.0459-0.71387,0.1377c-0.18799,0.09277-0.28223,0.22656-0.28223,0.40234
			c0,0.15234,0.104,0.28613,0.31201,0.40234c0.20801,0.11523,0.56396,0.2373,1.06836,0.36523
			c0.67188,0.17676,1.15967,0.40039,1.46387,0.67188c0.30371,0.27246,0.45605,0.62402,0.45605,1.05664
			c0,0.32031-0.09033,0.61426-0.27002,0.88184c-0.18018,0.26855-0.44385,0.48242-0.79199,0.6416
			c-0.34814,0.16016-0.76221,0.24023-1.24219,0.24023C234.02002,14.63205,233.16406,14.33615,232.54004,13.74435z"/>
		<path d="M239.63818,14.25412c-0.4043-0.24414-0.72217-0.58789-0.9541-1.03223c-0.23242-0.44336-0.34814-0.94922-0.34814-1.51758
			c0-0.54395,0.11572-1.03809,0.34814-1.48242c0.23193-0.44336,0.5498-0.79395,0.9541-1.0498
			c0.40381-0.25586,0.85352-0.38379,1.34961-0.38379s0.94824,0.12793,1.35645,0.38379
			c0.40771,0.25586,0.72949,0.60645,0.96582,1.0498c0.23584,0.44434,0.354,0.93848,0.354,1.48242
			c0,0.56836-0.11816,1.07227-0.354,1.51172c-0.23633,0.44043-0.55811,0.78418-0.96582,1.03223
			c-0.4082,0.24805-0.86035,0.37207-1.35645,0.37207S240.04199,14.49826,239.63818,14.25412z M241.93604,13.03049
			c0.24805-0.33984,0.37207-0.78223,0.37207-1.32617c0-0.55957-0.12207-1.00391-0.36621-1.33203s-0.56201-0.49219-0.9541-0.49219
			c-0.37598,0-0.68604,0.16602-0.92969,0.49805c-0.24414,0.33203-0.36621,0.77441-0.36621,1.32617
			c0,0.54395,0.12207,0.98633,0.36621,1.32617c0.24365,0.33984,0.55371,0.50977,0.92969,0.50977
			C241.37207,13.54025,241.68799,13.37033,241.93604,13.03049z"/>
		<path d="M249.61621,9.42404l-0.57617,1.14062l-0.03613,0.0957l-0.10791-0.04785c-0.0083-0.02441-0.02588-0.07812-0.0542-0.16211
			c-0.02783-0.08398-0.09375-0.17383-0.19775-0.27051c-0.24805-0.18359-0.5-0.27539-0.75586-0.27539
			c-0.41602,0-0.76025,0.13965-1.03223,0.41992s-0.40771,0.69531-0.40771,1.24805v2.92773h-1.38037V8.92013h1.4043l-0.01221,0.91211
			c0.15186-0.32031,0.37402-0.57422,0.66602-0.76172c0.29199-0.18848,0.60596-0.28223,0.94189-0.28223
			C248.69971,8.7883,249.21582,9.00021,249.61621,9.42404z"/>
		<path d="M186.19296,8.16427h-2.01611V7.02463h5.43604v1.13965h-2.12402v6.33594h-1.2959V8.16427z"/>
	</g>
</g>
<path pointer-events="stroke" class="st0" d="M175.5,20.5v20c0,6.66667-3.33333,10-10,10h-85c-6.66666,0-10,3.33333-10,10V78.26"/>
<path pointer-events="all" class="st0" d="M67,72.38l3.5,7l3.5-7"/>
<path pointer-events="stroke" class="st0" d="M70.5,100.5v10c0,6.66666,0,6.66666,0,0v-5c0-3.33334,0-2.04,0,3.88v8.88"/>
<path pointer-events="all" class="st0" d="M67,112.38l3.5,7l3.5-7"/>
<g transform="translate(-0.5 -0.5)">
	<g class="st1">
		<path d="M40.90381,87.02463c0.88037,0,1.54004,0.19336,1.97998,0.58203c0.43994,0.3877,0.66016,0.92578,0.66016,1.61328
			c0,0.4248-0.12988,0.83203-0.39014,1.22461c-0.25977,0.3916-0.59814,0.66406-1.01367,0.81543l1.60791,3.24023h-1.42822
			l-1.51172-3.1084h-0.8999v3.1084h-1.36816v-7.47559H40.90381z M41.85791,90.00021c0.1958-0.17578,0.29395-0.42383,0.29395-0.74414
			c0-0.30371-0.1001-0.55566-0.2998-0.75586c-0.2002-0.2002-0.48438-0.2998-0.85205-0.2998h-1.0918v2.06348H41
			C41.37598,90.26389,41.66211,90.17599,41.85791,90.00021z"/>
		<path d="M45.63818,94.25412c-0.4043-0.24414-0.72217-0.58789-0.9541-1.03223c-0.23242-0.44336-0.34814-0.94922-0.34814-1.51758
			c0-0.54395,0.11572-1.03809,0.34814-1.48242c0.23193-0.44336,0.5498-0.79395,0.9541-1.0498
			c0.40381-0.25586,0.85352-0.38379,1.34961-0.38379s0.94824,0.12793,1.35645,0.38379
			c0.40771,0.25586,0.72949,0.60645,0.96582,1.0498c0.23584,0.44434,0.354,0.93848,0.354,1.48242
			c0,0.56836-0.11816,1.07227-0.354,1.51172c-0.23633,0.44043-0.55811,0.78418-0.96582,1.03223
			c-0.4082,0.24805-0.86035,0.37207-1.35645,0.37207S46.04199,94.49826,45.63818,94.25412z M47.93604,93.03049
			c0.24805-0.33984,0.37207-0.78223,0.37207-1.32617c0-0.55957-0.12207-1.00391-0.36621-1.33203s-0.56201-0.49219-0.9541-0.49219
			c-0.37598,0-0.68604,0.16602-0.92969,0.49805c-0.24414,0.33203-0.36621,0.77441-0.36621,1.32617
			c0,0.54395,0.12207,0.98633,0.36621,1.32617c0.24365,0.33984,0.55371,0.50977,0.92969,0.50977
			C47.37207,93.54025,47.68799,93.37033,47.93604,93.03049z"/>
		<path d="M51.63818,94.25412c-0.4043-0.24414-0.72217-0.58789-0.9541-1.03223c-0.23242-0.44336-0.34814-0.94922-0.34814-1.51758
			c0-0.54395,0.11572-1.03809,0.34814-1.48242c0.23193-0.44336,0.5498-0.79395,0.9541-1.0498
			c0.40381-0.25586,0.85352-0.38379,1.34961-0.38379s0.94824,0.12793,1.35645,0.38379
			c0.40771,0.25586,0.72949,0.60645,0.96582,1.0498c0.23584,0.44434,0.354,0.93848,0.354,1.48242
			c0,0.56836-0.11816,1.07227-0.354,1.51172c-0.23633,0.44043-0.55811,0.78418-0.96582,1.03223
			c-0.4082,0.24805-0.86035,0.37207-1.35645,0.37207S52.04199,94.49826,51.63818,94.25412z M53.93604,93.03049
			c0.24805-0.33984,0.37207-0.78223,0.37207-1.32617c0-0.55957-0.12207-1.00391-0.36621-1.33203s-0.56201-0.49219-0.9541-0.49219
			c-0.37598,0-0.68604,0.16602-0.92969,0.49805c-0.24414,0.33203-0.36621,0.77441-0.36621,1.32617
			c0,0.54395,0.12207,0.98633,0.36621,1.32617c0.24365,0.33984,0.55371,0.50977,0.92969,0.50977
			C53.37207,93.54025,53.68799,93.37033,53.93604,93.03049z"/>
		<path d="M57.5,88.92014v0.4082c0.12793-0.17578,0.27588-0.31055,0.44385-0.40234s0.34424-0.1377,0.52832-0.1377
			c0.21582,0,0.40771,0.05566,0.57568,0.16797s0.29199,0.28027,0.37207,0.50391c0.24805-0.44824,0.64014-0.67188,1.17627-0.67188
			c0.77588,0,1.15576,0.53223,1.13965,1.5957v4.11621h-1.17578v-3.82812c0-0.34375-0.02588-0.58203-0.07812-0.71387
			s-0.1377-0.19824-0.25781-0.19824c-0.16016,0-0.3042,0.11035-0.43213,0.33008c-0.12793,0.2207-0.19189,0.49805-0.19189,0.83398
			v3.57617h-1.104v-3.79199c0-0.37598-0.02832-0.62988-0.08398-0.76172c-0.05615-0.13184-0.16016-0.19824-0.31201-0.19824
			c-0.15234,0-0.28418,0.09961-0.396,0.2998c-0.1123,0.2002-0.16797,0.46777-0.16797,0.80371v3.64844h-1.17627v-5.58008H57.5z"/>
		<path d="M62.38379,87.02463h1.18799l1.45215,3.43164l1.45215-3.44434h1.18799v7.48828h-1.17627v-5.21973l-1.17578,2.74805
			h-0.66016l-1.104-2.73633v5.20801h-1.16406V87.02463z"/>
		<path d="M73.41211,91.28439v3.21582h-1.4043V93.9006c-0.19971,0.26367-0.43408,0.4541-0.70166,0.56934
			c-0.26807,0.11621-0.57812,0.17383-0.93018,0.17383c-0.60791,0-1.08398-0.14355-1.42773-0.43164
			c-0.34424-0.28809-0.51611-0.66797-0.51611-1.13965c0-0.40039,0.11963-0.75391,0.35986-1.0625
			c0.24023-0.30762,0.59424-0.5498,1.06201-0.72559s1.03369-0.26465,1.69775-0.26465c0.20801,0,0.37988,0.00488,0.51611,0.0127
			c-0.05615-0.44043-0.18213-0.74805-0.37793-0.92383c-0.19629-0.17676-0.48193-0.26465-0.85791-0.26465
			c-0.27197,0-0.52002,0.04395-0.74414,0.13184c-0.22412,0.08887-0.43994,0.24023-0.64795,0.45605l-0.74414-0.81543
			c0.58398-0.55176,1.31592-0.82812,2.19629-0.82812C72.57178,88.7883,73.41211,89.62033,73.41211,91.28439z M72.08008,91.96799
			c-0.13623-0.00781-0.32031-0.01172-0.55225-0.01172c-1.15967,0-1.73975,0.31641-1.73975,0.94824
			c0,0.45605,0.28369,0.68359,0.85205,0.68359C71.50391,93.5881,71.98389,93.04807,72.08008,91.96799z"/>
		<path d="M76.01611,88.92014v0.76855c0.45605-0.60059,0.9917-0.90039,1.60791-0.90039c0.52002,0,0.95215,0.19434,1.2959,0.58203
			s0.51611,0.97363,0.51611,1.75781v3.37207h-1.35596v-3.34766c0-0.44824-0.07227-0.78027-0.21631-0.99609
			c-0.14355-0.21582-0.34375-0.32422-0.59961-0.32422c-0.2085,0-0.4082,0.05566-0.6001,0.16797s-0.34814,0.26953-0.46826,0.47363
			c-0.11963,0.2041-0.17969,0.43848-0.17969,0.70215v3.32422h-1.35596v-5.58008H76.01611z"/>
		<path d="M85.41211,91.28439v3.21582h-1.4043V93.9006c-0.19971,0.26367-0.43408,0.4541-0.70166,0.56934
			c-0.26807,0.11621-0.57812,0.17383-0.93018,0.17383c-0.60791,0-1.08398-0.14355-1.42773-0.43164
			c-0.34424-0.28809-0.51611-0.66797-0.51611-1.13965c0-0.40039,0.11963-0.75391,0.35986-1.0625
			c0.24023-0.30762,0.59424-0.5498,1.06201-0.72559s1.03369-0.26465,1.69775-0.26465c0.20801,0,0.37988,0.00488,0.51611,0.0127
			c-0.05615-0.44043-0.18213-0.74805-0.37793-0.92383c-0.19629-0.17676-0.48193-0.26465-0.85791-0.26465
			c-0.27197,0-0.52002,0.04395-0.74414,0.13184c-0.22412,0.08887-0.43994,0.24023-0.64795,0.45605l-0.74414-0.81543
			c0.58398-0.55176,1.31592-0.82812,2.19629-0.82812C84.57178,88.7883,85.41211,89.62033,85.41211,91.28439z M84.08008,91.96799
			c-0.13623-0.00781-0.32031-0.01172-0.55225-0.01172c-1.15967,0-1.73975,0.31641-1.73975,0.94824
			c0,0.45605,0.28369,0.68359,0.85205,0.68359C83.50391,93.5881,83.98389,93.04807,84.08008,91.96799z"/>
		<path d="M91.05811,93.70822c0.2998,0.27246,0.44971,0.63184,0.44971,1.08008c0,0.32812-0.0957,0.63184-0.2876,0.91211
			c-0.19238,0.2793-0.48828,0.50781-0.88818,0.68359c-0.40039,0.17578-0.88818,0.26465-1.46387,0.26465
			c-0.78418,0-1.40234-0.13477-1.854-0.40234c-0.45215-0.26855-0.67822-0.62598-0.67822-1.07422
			c0-0.23242,0.07373-0.44824,0.22217-0.64746c0.14795-0.2002,0.3418-0.36816,0.58203-0.50488
			c-0.31201-0.19141-0.46826-0.45898-0.46826-0.80371c0-0.38379,0.22021-0.75195,0.66016-1.10352
			c-0.20801-0.17578-0.36816-0.38477-0.47998-0.62402c-0.1123-0.24023-0.16797-0.50391-0.16797-0.79199
			c0-0.36035,0.08984-0.68848,0.27002-0.98438c0.17969-0.2959,0.42773-0.53027,0.74414-0.70215
			c0.31592-0.17188,0.66992-0.25781,1.06152-0.25781c0.52832,0,0.97607,0.15234,1.34424,0.45605
			c0.47998-0.33594,1.00391-0.48047,1.57178-0.43164l0.13232,0.93555c-0.12793-0.02344-0.25195-0.03613-0.37207-0.03613
			c-0.2959,0-0.56396,0.06055-0.8042,0.18066c0.12793,0.27148,0.19238,0.55176,0.19238,0.83984
			c0,0.35938-0.09033,0.68555-0.27002,0.97754c-0.18018,0.29199-0.42627,0.52246-0.73828,0.69043s-0.66406,0.25195-1.05615,0.25195
			c-0.27979,0-0.54395-0.04395-0.79199-0.13184c-0.0957,0.08008-0.16406,0.14551-0.20361,0.19727
			c-0.04053,0.05273-0.06006,0.11426-0.06006,0.18652c0,0.14355,0.14795,0.25195,0.44385,0.32422
			c0.2959,0.07129,0.78418,0.10742,1.46387,0.10742C90.27588,93.30002,90.75781,93.43674,91.05811,93.70822z M90.02002,95.41232
			c0.24805-0.12012,0.37207-0.28027,0.37207-0.48047c0-0.18359-0.08008-0.31348-0.24023-0.38965s-0.46387-0.11426-0.91162-0.11426
			c-0.56836,0-1.04053-0.04785-1.41602-0.14355c-0.15234,0.1123-0.26416,0.21777-0.33643,0.31738
			c-0.07178,0.10059-0.10791,0.22266-0.10791,0.36621c0,0.20801,0.14404,0.36426,0.43213,0.46777
			c0.28809,0.10449,0.67578,0.15625,1.16406,0.15625C89.42383,95.59201,89.77197,95.53244,90.02002,95.41232z M88.10596,90.05392
			c-0.18799,0.18066-0.28174,0.39453-0.28174,0.64258c0,0.25586,0.08984,0.47559,0.27002,0.66016
			c0.17969,0.18359,0.39746,0.27539,0.65381,0.27539c0.27197,0,0.49609-0.08789,0.67188-0.26367s0.26416-0.40039,0.26416-0.67188
			c0-0.26465-0.08984-0.48242-0.27002-0.6543s-0.40186-0.25781-0.66602-0.25781
			C88.50781,89.78439,88.29395,89.87424,88.10596,90.05392z"/>
		<path d="M93.81201,94.29025c-0.42432-0.22852-0.75391-0.55762-0.99023-0.99023c-0.23584-0.43164-0.354-0.94824-0.354-1.54785
			s0.11621-1.12402,0.34814-1.57227c0.23193-0.44727,0.54785-0.79199,0.94824-1.03125
			c0.3999-0.24023,0.84375-0.36035,1.33203-0.36035c0.43945,0,0.8418,0.10352,1.20557,0.31152
			c0.36426,0.20898,0.6543,0.5166,0.87012,0.9248c0.21631,0.40723,0.32422,0.89941,0.32422,1.47559
			c0,0.17578-0.0083,0.36816-0.02393,0.57617h-3.69629c0.02393,0.48828,0.18408,0.86035,0.47998,1.11621
			s0.64795,0.38379,1.05615,0.38379c0.54395,0,0.98779-0.17578,1.33203-0.52832l0.6958,0.67188
			c-0.52002,0.6084-1.21582,0.91211-2.08789,0.91211C94.71582,94.63205,94.23584,94.51779,93.81201,94.29025z M95.87598,90.16232
			c-0.2002-0.21191-0.47998-0.31836-0.83984-0.31836c-0.32812,0-0.60449,0.10254-0.82812,0.30664
			c-0.22412,0.20312-0.35986,0.50586-0.4082,0.90527h2.37598C96.17578,90.67209,96.07568,90.37424,95.87598,90.16232z"/>
		<path d="M103.61621,89.42404l-0.57617,1.14062l-0.03613,0.0957l-0.10791-0.04785c-0.0083-0.02441-0.02588-0.07812-0.0542-0.16211
			c-0.02783-0.08398-0.09375-0.17383-0.19775-0.27051c-0.24805-0.18359-0.5-0.27539-0.75586-0.27539
			c-0.41602,0-0.76025,0.13965-1.03223,0.41992s-0.40771,0.69531-0.40771,1.24805v2.92773h-1.38037v-5.58008h1.4043
			l-0.01221,0.91211c0.15186-0.32031,0.37402-0.57422,0.66602-0.76172c0.29199-0.18848,0.60596-0.28223,0.94189-0.28223
			C102.69971,88.7883,103.21582,89.00021,103.61621,89.42404z"/>
	</g>
</g>
<g transform="translate(-0.5 -0.5)">
	<g class="st1">
		<path d="M170.83594,94.21799c-0.44824-0.27539-0.80371-0.70215-1.06787-1.27734c-0.26416-0.57617-0.396-1.28809-0.396-2.13672
			c0-0.91992,0.14795-1.66992,0.44385-2.25s0.67188-0.99805,1.12793-1.25391s0.93994-0.38379,1.45215-0.38379
			c0.56006,0,1.04004,0.12598,1.43994,0.37793s0.70801,0.61426,0.92383,1.08594l-0.85156,0.63574l-0.09619,0.06055l-0.06006-0.0957
			c0.00781-0.06445,0.00195-0.12402-0.01807-0.18066c-0.02002-0.05566-0.06201-0.13965-0.12598-0.25195
			c-0.16797-0.2002-0.34375-0.33984-0.52783-0.41992s-0.38818-0.12012-0.6123-0.12012c-0.31201,0-0.60205,0.10645-0.86963,0.31836
			c-0.26807,0.21191-0.48242,0.52344-0.64209,0.93555c-0.16016,0.41211-0.24023,0.90625-0.24023,1.48242
			c0,0.55957,0.07227,1.0498,0.21631,1.46973s0.3418,0.74219,0.59375,0.96582c0.25195,0.22461,0.53809,0.33594,0.85791,0.33594
			c0.3042,0,0.56445-0.06348,0.78027-0.19141s0.40771-0.33984,0.57617-0.63574l0.93555,0.69531
			c-0.27197,0.44824-0.5957,0.76855-0.97168,0.95996c-0.37646,0.19238-0.82812,0.28809-1.35596,0.28809
			C171.78809,94.63205,171.28418,94.49435,170.83594,94.21799z"/>
		<path d="M176.63818,94.25412c-0.4043-0.24414-0.72217-0.58789-0.9541-1.03223c-0.23242-0.44336-0.34814-0.94922-0.34814-1.51758
			c0-0.54395,0.11572-1.03809,0.34814-1.48242c0.23193-0.44336,0.5498-0.79395,0.9541-1.0498
			c0.40381-0.25586,0.85352-0.38379,1.34961-0.38379s0.94824,0.12793,1.35645,0.38379
			c0.40771,0.25586,0.72949,0.60645,0.96582,1.0498c0.23584,0.44434,0.354,0.93848,0.354,1.48242
			c0,0.56836-0.11816,1.07227-0.354,1.51172c-0.23633,0.44043-0.55811,0.78418-0.96582,1.03223
			c-0.4082,0.24805-0.86035,0.37207-1.35645,0.37207S177.04199,94.49826,176.63818,94.25412z M178.93604,93.03049
			c0.24805-0.33984,0.37207-0.78223,0.37207-1.32617c0-0.55957-0.12207-1.00391-0.36621-1.33203s-0.56201-0.49219-0.9541-0.49219
			c-0.37598,0-0.68604,0.16602-0.92969,0.49805c-0.24414,0.33203-0.36621,0.77441-0.36621,1.32617
			c0,0.54395,0.12207,0.98633,0.36621,1.32617c0.24365,0.33984,0.55371,0.50977,0.92969,0.50977
			C178.37207,93.54025,178.68799,93.37033,178.93604,93.03049z"/>
		<path d="M183.01611,88.92014v0.76855c0.45605-0.60059,0.9917-0.90039,1.60791-0.90039c0.52002,0,0.95215,0.19434,1.2959,0.58203
			s0.51611,0.97363,0.51611,1.75781v3.37207h-1.35596v-3.34766c0-0.44824-0.07227-0.78027-0.21631-0.99609
			c-0.14355-0.21582-0.34375-0.32422-0.59961-0.32422c-0.2085,0-0.4082,0.05566-0.6001,0.16797s-0.34814,0.26953-0.46826,0.47363
			c-0.11963,0.2041-0.17969,0.43848-0.17969,0.70215v3.32422h-1.35596v-5.58008H183.01611z"/>
		<path d="M192.44824,93.99631c-0.56055,0.41602-1.18018,0.62402-1.86035,0.62402c-0.62402,0-1.08594-0.2002-1.38574-0.60059
			c-0.30029-0.39941-0.4502-1.0752-0.4502-2.02734l0.01221-0.38379l0.06006-1.62012h-1.14014l0.02393-1.06836h1.16406
			l0.04785-1.32031l1.4043-0.17969l0.10791-0.01172l0.01172,0.10742c-0.05615,0.08008-0.09375,0.14844-0.11377,0.2041
			c-0.02002,0.05664-0.03418,0.14062-0.04199,0.25195l-0.07227,0.94824h1.78809l-0.01172,1.06836h-1.78809l-0.08398,1.5957
			c-0.0083,0.0957-0.01221,0.23242-0.01221,0.4082c0,0.57617,0.06592,0.97559,0.19824,1.2002
			c0.13184,0.22363,0.33008,0.33594,0.59375,0.33594c0.4082,0,0.82812-0.17188,1.26025-0.5166L192.44824,93.99631z"/>
		<path d="M198.61621,89.42404l-0.57617,1.14062l-0.03613,0.0957l-0.10791-0.04785c-0.0083-0.02441-0.02588-0.07812-0.0542-0.16211
			c-0.02783-0.08398-0.09375-0.17383-0.19775-0.27051c-0.24805-0.18359-0.5-0.27539-0.75586-0.27539
			c-0.41602,0-0.76025,0.13965-1.03223,0.41992s-0.40771,0.69531-0.40771,1.24805v2.92773h-1.38037v-5.58008h1.4043
			l-0.01221,0.91211c0.15186-0.32031,0.37402-0.57422,0.66602-0.76172c0.29199-0.18848,0.60596-0.28223,0.94189-0.28223
			C197.69971,88.7883,198.21582,89.00021,198.61621,89.42404z"/>
		<path d="M200.63818,94.25412c-0.4043-0.24414-0.72217-0.58789-0.9541-1.03223c-0.23242-0.44336-0.34814-0.94922-0.34814-1.51758
			c0-0.54395,0.11572-1.03809,0.34814-1.48242c0.23193-0.44336,0.5498-0.79395,0.9541-1.0498
			c0.40381-0.25586,0.85352-0.38379,1.34961-0.38379s0.94824,0.12793,1.35645,0.38379
			c0.40771,0.25586,0.72949,0.60645,0.96582,1.0498c0.23584,0.44434,0.354,0.93848,0.354,1.48242
			c0,0.56836-0.11816,1.07227-0.354,1.51172c-0.23633,0.44043-0.55811,0.78418-0.96582,1.03223
			c-0.4082,0.24805-0.86035,0.37207-1.35645,0.37207S201.04199,94.49826,200.63818,94.25412z M202.93604,93.03049
			c0.24805-0.33984,0.37207-0.78223,0.37207-1.32617c0-0.55957-0.12207-1.00391-0.36621-1.33203s-0.56201-0.49219-0.9541-0.49219
			c-0.37598,0-0.68604,0.16602-0.92969,0.49805c-0.24414,0.33203-0.36621,0.77441-0.36621,1.32617
			c0,0.54395,0.12207,0.98633,0.36621,1.32617c0.24365,0.33984,0.55371,0.50977,0.92969,0.50977
			C202.37207,93.54025,202.68799,93.37033,202.93604,93.03049z"/>
		<path d="M205.75586,93.43185h1.57227v-5.91602h-1.5v-1.06738h2.86768v6.9834h1.56006v1.06836h-4.5V93.43185z"/>
		<path d="M211.38379,87.02463h1.18799l1.45215,3.43164l1.45215-3.44434h1.18799v7.48828h-1.17627v-5.21973l-1.17578,2.74805
			h-0.66016l-1.104-2.73633v5.20801h-1.16406V87.02463z"/>
		<path d="M222.41211,91.28439v3.21582h-1.4043V93.9006c-0.19971,0.26367-0.43408,0.4541-0.70166,0.56934
			c-0.26807,0.11621-0.57812,0.17383-0.93018,0.17383c-0.60791,0-1.08398-0.14355-1.42773-0.43164
			c-0.34424-0.28809-0.51611-0.66797-0.51611-1.13965c0-0.40039,0.11963-0.75391,0.35986-1.0625
			c0.24023-0.30762,0.59424-0.5498,1.06201-0.72559s1.03369-0.26465,1.69775-0.26465c0.20801,0,0.37988,0.00488,0.51611,0.0127
			c-0.05615-0.44043-0.18213-0.74805-0.37793-0.92383c-0.19629-0.17676-0.48193-0.26465-0.85791-0.26465
			c-0.27197,0-0.52002,0.04395-0.74414,0.13184c-0.22412,0.08887-0.43994,0.24023-0.64795,0.45605l-0.74414-0.81543
			c0.58398-0.55176,1.31592-0.82812,2.19629-0.82812C221.57178,88.7883,222.41211,89.62033,222.41211,91.28439z M221.08008,91.96799
			c-0.13623-0.00781-0.32031-0.01172-0.55225-0.01172c-1.15967,0-1.73975,0.31641-1.73975,0.94824
			c0,0.45605,0.28369,0.68359,0.85205,0.68359C220.50391,93.5881,220.98389,93.04807,221.08008,91.96799z"/>
		<path d="M225.01611,88.92014v0.76855c0.45605-0.60059,0.9917-0.90039,1.60791-0.90039c0.52002,0,0.95215,0.19434,1.2959,0.58203
			s0.51611,0.97363,0.51611,1.75781v3.37207h-1.35596v-3.34766c0-0.44824-0.07227-0.78027-0.21631-0.99609
			c-0.14355-0.21582-0.34375-0.32422-0.59961-0.32422c-0.2085,0-0.4082,0.05566-0.6001,0.16797s-0.34814,0.26953-0.46826,0.47363
			c-0.11963,0.2041-0.17969,0.43848-0.17969,0.70215v3.32422h-1.35596v-5.58008H225.01611z"/>
		<path d="M234.41211,91.28439v3.21582h-1.4043V93.9006c-0.19971,0.26367-0.43408,0.4541-0.70166,0.56934
			c-0.26807,0.11621-0.57812,0.17383-0.93018,0.17383c-0.60791,0-1.08398-0.14355-1.42773-0.43164
			c-0.34424-0.28809-0.51611-0.66797-0.51611-1.13965c0-0.40039,0.11963-0.75391,0.35986-1.0625
			c0.24023-0.30762,0.59424-0.5498,1.06201-0.72559s1.03369-0.26465,1.69775-0.26465c0.20801,0,0.37988,0.00488,0.51611,0.0127
			c-0.05615-0.44043-0.18213-0.74805-0.37793-0.92383c-0.19629-0.17676-0.48193-0.26465-0.85791-0.26465
			c-0.27197,0-0.52002,0.04395-0.74414,0.13184c-0.22412,0.08887-0.43994,0.24023-0.64795,0.45605l-0.74414-0.81543
			c0.58398-0.55176,1.31592-0.82812,2.19629-0.82812C233.57178,88.7883,234.41211,89.62033,234.41211,91.28439z M233.08008,91.96799
			c-0.13623-0.00781-0.32031-0.01172-0.55225-0.01172c-1.15967,0-1.73975,0.31641-1.73975,0.94824
			c0,0.45605,0.28369,0.68359,0.85205,0.68359C232.50391,93.5881,232.98389,93.04807,233.08008,91.96799z"/>
		<path d="M240.05811,93.70822c0.2998,0.27246,0.44971,0.63184,0.44971,1.08008c0,0.32812-0.0957,0.63184-0.2876,0.91211
			c-0.19238,0.2793-0.48828,0.50781-0.88818,0.68359c-0.40039,0.17578-0.88818,0.26465-1.46387,0.26465
			c-0.78418,0-1.40234-0.13477-1.854-0.40234c-0.45215-0.26855-0.67822-0.62598-0.67822-1.07422
			c0-0.23242,0.07373-0.44824,0.22217-0.64746c0.14795-0.2002,0.3418-0.36816,0.58203-0.50488
			c-0.31201-0.19141-0.46826-0.45898-0.46826-0.80371c0-0.38379,0.22021-0.75195,0.66016-1.10352
			c-0.20801-0.17578-0.36816-0.38477-0.47998-0.62402c-0.1123-0.24023-0.16797-0.50391-0.16797-0.79199
			c0-0.36035,0.08984-0.68848,0.27002-0.98438c0.17969-0.2959,0.42773-0.53027,0.74414-0.70215
			c0.31592-0.17188,0.66992-0.25781,1.06152-0.25781c0.52832,0,0.97607,0.15234,1.34424,0.45605
			c0.47998-0.33594,1.00391-0.48047,1.57178-0.43164l0.13232,0.93555c-0.12793-0.02344-0.25195-0.03613-0.37207-0.03613
			c-0.2959,0-0.56396,0.06055-0.8042,0.18066c0.12793,0.27148,0.19238,0.55176,0.19238,0.83984
			c0,0.35938-0.09033,0.68555-0.27002,0.97754c-0.18018,0.29199-0.42627,0.52246-0.73828,0.69043s-0.66406,0.25195-1.05615,0.25195
			c-0.27979,0-0.54395-0.04395-0.79199-0.13184c-0.0957,0.08008-0.16406,0.14551-0.20361,0.19727
			c-0.04053,0.05273-0.06006,0.11426-0.06006,0.18652c0,0.14355,0.14795,0.25195,0.44385,0.32422
			c0.2959,0.07129,0.78418,0.10742,1.46387,0.10742C239.27588,93.30002,239.75781,93.43674,240.05811,93.70822z M239.02002,95.41232
			c0.24805-0.12012,0.37207-0.28027,0.37207-0.48047c0-0.18359-0.08008-0.31348-0.24023-0.38965s-0.46387-0.11426-0.91162-0.11426
			c-0.56836,0-1.04053-0.04785-1.41602-0.14355c-0.15234,0.1123-0.26416,0.21777-0.33643,0.31738
			c-0.07178,0.10059-0.10791,0.22266-0.10791,0.36621c0,0.20801,0.14404,0.36426,0.43213,0.46777
			c0.28809,0.10449,0.67578,0.15625,1.16406,0.15625C238.42383,95.59201,238.77197,95.53244,239.02002,95.41232z
			 M237.10596,90.05392c-0.18799,0.18066-0.28174,0.39453-0.28174,0.64258c0,0.25586,0.08984,0.47559,0.27002,0.66016
			c0.17969,0.18359,0.39746,0.27539,0.65381,0.27539c0.27197,0,0.49609-0.08789,0.67188-0.26367s0.26416-0.40039,0.26416-0.67188
			c0-0.26465-0.08984-0.48242-0.27002-0.6543s-0.40186-0.25781-0.66602-0.25781
			C237.50781,89.78439,237.29395,89.87424,237.10596,90.05392z"/>
		<path d="M242.81201,94.29025c-0.42432-0.22852-0.75391-0.55762-0.99023-0.99023c-0.23584-0.43164-0.354-0.94824-0.354-1.54785
			s0.11621-1.12402,0.34814-1.57227c0.23193-0.44727,0.54785-0.79199,0.94824-1.03125
			c0.3999-0.24023,0.84375-0.36035,1.33203-0.36035c0.43945,0,0.8418,0.10352,1.20557,0.31152
			c0.36426,0.20898,0.6543,0.5166,0.87012,0.9248c0.21631,0.40723,0.32422,0.89941,0.32422,1.47559
			c0,0.17578-0.0083,0.36816-0.02393,0.57617h-3.69629c0.02393,0.48828,0.18408,0.86035,0.47998,1.11621
			s0.64795,0.38379,1.05615,0.38379c0.54395,0,0.98779-0.17578,1.33203-0.52832l0.6958,0.67188
			c-0.52002,0.6084-1.21582,0.91211-2.08789,0.91211C243.71582,94.63205,243.23584,94.51779,242.81201,94.29025z
			 M244.87598,90.16232c-0.2002-0.21191-0.47998-0.31836-0.83984-0.31836c-0.32812,0-0.60449,0.10254-0.82812,0.30664
			c-0.22412,0.20312-0.35986,0.50586-0.4082,0.90527h2.37598C245.17578,90.67209,245.07568,90.37424,244.87598,90.16232z"/>
		<path d="M252.61621,89.42404l-0.57617,1.14062l-0.03613,0.0957l-0.10791-0.04785c-0.0083-0.02441-0.02588-0.07812-0.0542-0.16211
			c-0.02783-0.08398-0.09375-0.17383-0.19775-0.27051c-0.24805-0.18359-0.5-0.27539-0.75586-0.27539
			c-0.41602,0-0.76025,0.13965-1.03223,0.41992s-0.40771,0.69531-0.40771,1.24805v2.92773h-1.38037v-5.58008h1.4043
			l-0.01221,0.91211c0.15186-0.32031,0.37402-0.57422,0.66602-0.76172c0.29199-0.18848,0.60596-0.28223,0.94189-0.28223
			C251.69971,88.7883,252.21582,89.00021,252.61621,89.42404z"/>
	</g>
</g>
<g transform="translate(-0.5 -0.5)">
	<g class="st1">
		<path d="M314.43555,87.02463c0.625,0,1.12109,0.08398,1.48828,0.25195c0.36816,0.16797,0.6875,0.42773,0.95996,0.7793
			c0.52832,0.7207,0.79199,1.64062,0.79199,2.76074c-0.04785,2.45605-1.17578,3.68359-3.38379,3.68359h-1.78809v-7.47559H314.43555z
			 M316.34375,90.87619c0-0.9043-0.14648-1.5918-0.4375-2.06445c-0.29297-0.47168-0.79883-0.70801-1.51758-0.70801h-0.56445v5.34082
			h0.43164C315.64844,93.44455,316.34375,92.5881,316.34375,90.87619z"/>
		<path d="M319.8125,94.29025c-0.4248-0.22852-0.75391-0.55762-0.99023-0.99023c-0.23633-0.43164-0.35449-0.94824-0.35449-1.54785
			s0.11621-1.12402,0.34863-1.57227c0.23145-0.44727,0.54688-0.79199,0.94727-1.03125
			c0.40039-0.24023,0.84375-0.36035,1.33203-0.36035c0.43945,0,0.8418,0.10352,1.20605,0.31152
			c0.36426,0.20898,0.6543,0.5166,0.87012,0.9248c0.2168,0.40723,0.32422,0.89941,0.32422,1.47559
			c0,0.17578-0.00781,0.36816-0.02344,0.57617h-3.69727c0.02441,0.48828,0.18457,0.86035,0.48047,1.11621
			s0.64844,0.38379,1.05664,0.38379c0.54297,0,0.9873-0.17578,1.33203-0.52832l0.69531,0.67188
			c-0.51953,0.6084-1.21582,0.91211-2.08789,0.91211C320.71582,94.63205,320.23633,94.51779,319.8125,94.29025z M321.87598,90.16232
			c-0.2002-0.21191-0.47949-0.31836-0.83984-0.31836c-0.32812,0-0.60449,0.10254-0.82812,0.30664
			c-0.22363,0.20312-0.36035,0.50586-0.4082,0.90527h2.37598C322.17578,90.67209,322.07617,90.37424,321.87598,90.16232z"/>
		<path d="M329.56836,88.92014c-0.06445,0.56836-0.30078,1.34375-0.70898,2.32812l-1.34375,3.25195h-1.06738l-2.10059-5.58008
			h1.41602l1.34375,3.74414l0.64844-1.57227c0.32812-0.83984,0.50781-1.56348,0.54004-2.17188H329.56836z"/>
		<path d="M331.00781,93.43185h1.36816v-3.44336h-1.2959v-1.06836h2.66406v4.51172h1.24805v1.06836h-3.98438V93.43185z
			 M332.40039,87.75607c-0.16797-0.16016-0.25195-0.35156-0.25195-0.57617c0-0.23145,0.08008-0.42578,0.24023-0.58203
			c0.15918-0.15527,0.36328-0.2334,0.61133-0.2334c0.23242,0,0.43164,0.08008,0.59961,0.23926
			c0.16797,0.16016,0.25195,0.35254,0.25195,0.57617c0,0.22461-0.08398,0.41602-0.25195,0.57617S333.23242,87.99631,333,87.99631
			S332.56836,87.91623,332.40039,87.75607z"/>
		<path d="M337.87793,94.27267c-0.43652-0.24805-0.78027-0.59277-1.03223-1.03223c-0.25195-0.44043-0.37793-0.93652-0.37793-1.48828
			c0-0.54395,0.12598-1.04199,0.37793-1.49414s0.5957-0.80957,1.03223-1.07422c0.43652-0.26367,0.92578-0.39551,1.46973-0.39551
			c0.50391,0,0.94824,0.09375,1.33203,0.28223c0.38477,0.1875,0.69238,0.4541,0.92383,0.79785l-0.75586,0.82812l-0.07227,0.08398
			l-0.0957-0.07227c0-0.08008-0.00977-0.15039-0.0293-0.20996c-0.02051-0.05957-0.07031-0.1377-0.15039-0.23438
			c-0.14453-0.13574-0.30859-0.2334-0.49219-0.29395c-0.18359-0.05957-0.40039-0.08984-0.64844-0.08984
			c-0.27148,0-0.52344,0.07422-0.75586,0.22168c-0.23145,0.14844-0.41602,0.36426-0.55176,0.64844s-0.2041,0.61816-0.2041,1.00195
			c0,0.35254,0.07031,0.66406,0.21094,0.93652c0.13867,0.27148,0.32715,0.48145,0.56348,0.62988
			c0.23535,0.14746,0.49316,0.22168,0.77441,0.22168c0.55957,0,1.02734-0.23242,1.40332-0.69629l0.75684,0.86426
			c-0.28906,0.32031-0.62695,0.55566-1.01465,0.70801s-0.79004,0.22754-1.20605,0.22754
			C338.7998,94.64377,338.31445,94.51974,337.87793,94.27267z"/>
		<path d="M343.8125,94.29025c-0.4248-0.22852-0.75391-0.55762-0.99023-0.99023c-0.23633-0.43164-0.35449-0.94824-0.35449-1.54785
			s0.11621-1.12402,0.34863-1.57227c0.23145-0.44727,0.54688-0.79199,0.94727-1.03125
			c0.40039-0.24023,0.84375-0.36035,1.33203-0.36035c0.43945,0,0.8418,0.10352,1.20605,0.31152
			c0.36426,0.20898,0.6543,0.5166,0.87012,0.9248c0.2168,0.40723,0.32422,0.89941,0.32422,1.47559
			c0,0.17578-0.00781,0.36816-0.02344,0.57617h-3.69727c0.02441,0.48828,0.18457,0.86035,0.48047,1.11621
			s0.64844,0.38379,1.05664,0.38379c0.54297,0,0.9873-0.17578,1.33203-0.52832l0.69531,0.67188
			c-0.51953,0.6084-1.21582,0.91211-2.08789,0.91211C344.71582,94.63205,344.23633,94.51779,343.8125,94.29025z M345.87598,90.16232
			c-0.2002-0.21191-0.47949-0.31836-0.83984-0.31836c-0.32812,0-0.60449,0.10254-0.82812,0.30664
			c-0.22363,0.20312-0.36035,0.50586-0.4082,0.90527h2.37598C346.17578,90.67209,346.07617,90.37424,345.87598,90.16232z"/>
		<path d="M348.38379,87.02463h1.18848l1.45117,3.43164l1.45312-3.44434h1.1875v7.48828h-1.17578v-5.21973l-1.17578,2.74805
			h-0.66016l-1.10449-2.73633v5.20801h-1.16406V87.02463z"/>
		<path d="M359.41211,91.28439v3.21582h-1.4043V93.9006c-0.19922,0.26367-0.43359,0.4541-0.70117,0.56934
			c-0.26855,0.11621-0.57812,0.17383-0.93066,0.17383c-0.6084,0-1.08398-0.14355-1.42773-0.43164
			c-0.34473-0.28809-0.5166-0.66797-0.5166-1.13965c0-0.40039,0.12012-0.75391,0.36035-1.0625
			c0.24023-0.30762,0.59473-0.5498,1.06152-0.72559c0.46875-0.17578,1.03418-0.26465,1.69824-0.26465
			c0.20801,0,0.37988,0.00488,0.5166,0.0127c-0.05664-0.44043-0.18262-0.74805-0.37891-0.92383
			c-0.19531-0.17676-0.48145-0.26465-0.85742-0.26465c-0.27148,0-0.51953,0.04395-0.74414,0.13184
			c-0.22461,0.08887-0.43945,0.24023-0.64844,0.45605l-0.74414-0.81543c0.58398-0.55176,1.31641-0.82812,2.19727-0.82812
			C358.57227,88.7883,359.41211,89.62033,359.41211,91.28439z M358.08008,91.96799
			c-0.13672-0.00781-0.32031-0.01172-0.55273-0.01172c-1.15918,0-1.73926,0.31641-1.73926,0.94824
			c0,0.45605,0.28418,0.68359,0.85254,0.68359C357.50391,93.5881,357.98438,93.04807,358.08008,91.96799z"/>
		<path d="M362.01562,88.92014v0.76855c0.45703-0.60059,0.99219-0.90039,1.6084-0.90039c0.52051,0,0.95215,0.19434,1.2959,0.58203
			s0.51562,0.97363,0.51562,1.75781v3.37207h-1.35547v-3.34766c0-0.44824-0.07227-0.78027-0.2168-0.99609
			c-0.14258-0.21582-0.34375-0.32422-0.59961-0.32422c-0.20801,0-0.4082,0.05566-0.59961,0.16797s-0.34766,0.26953-0.46875,0.47363
			c-0.11914,0.2041-0.17969,0.43848-0.17969,0.70215v3.32422h-1.35547v-5.58008H362.01562z"/>
		<path d="M371.41211,91.28439v3.21582h-1.4043V93.9006c-0.19922,0.26367-0.43359,0.4541-0.70117,0.56934
			c-0.26855,0.11621-0.57812,0.17383-0.93066,0.17383c-0.6084,0-1.08398-0.14355-1.42773-0.43164
			c-0.34473-0.28809-0.5166-0.66797-0.5166-1.13965c0-0.40039,0.12012-0.75391,0.36035-1.0625
			c0.24023-0.30762,0.59473-0.5498,1.06152-0.72559c0.46875-0.17578,1.03418-0.26465,1.69824-0.26465
			c0.20801,0,0.37988,0.00488,0.5166,0.0127c-0.05664-0.44043-0.18262-0.74805-0.37891-0.92383
			c-0.19531-0.17676-0.48145-0.26465-0.85742-0.26465c-0.27148,0-0.51953,0.04395-0.74414,0.13184
			c-0.22461,0.08887-0.43945,0.24023-0.64844,0.45605l-0.74414-0.81543c0.58398-0.55176,1.31641-0.82812,2.19727-0.82812
			C370.57227,88.7883,371.41211,89.62033,371.41211,91.28439z M370.08008,91.96799
			c-0.13672-0.00781-0.32031-0.01172-0.55273-0.01172c-1.15918,0-1.73926,0.31641-1.73926,0.94824
			c0,0.45605,0.28418,0.68359,0.85254,0.68359C369.50391,93.5881,369.98438,93.04807,370.08008,91.96799z"/>
		<path d="M377.05859,93.70822c0.29883,0.27246,0.44922,0.63184,0.44922,1.08008c0,0.32812-0.0957,0.63184-0.28711,0.91211
			c-0.19336,0.2793-0.48828,0.50781-0.88867,0.68359s-0.88867,0.26465-1.46387,0.26465c-0.78418,0-1.40234-0.13477-1.85449-0.40234
			c-0.45117-0.26855-0.67773-0.62598-0.67773-1.07422c0-0.23242,0.07422-0.44824,0.22266-0.64746
			c0.14746-0.2002,0.3418-0.36816,0.58203-0.50488c-0.3125-0.19141-0.46875-0.45898-0.46875-0.80371
			c0-0.38379,0.2207-0.75195,0.66016-1.10352c-0.20801-0.17578-0.36816-0.38477-0.48047-0.62402
			c-0.11133-0.24023-0.16797-0.50391-0.16797-0.79199c0-0.36035,0.08984-0.68848,0.27051-0.98438
			c0.17969-0.2959,0.42773-0.53027,0.74414-0.70215c0.31543-0.17188,0.66992-0.25781,1.06152-0.25781
			c0.52832,0,0.97656,0.15234,1.34375,0.45605c0.48047-0.33594,1.00391-0.48047,1.57227-0.43164l0.13281,0.93555
			c-0.12891-0.02344-0.25195-0.03613-0.37305-0.03613c-0.29492,0-0.56348,0.06055-0.80371,0.18066
			c0.12793,0.27148,0.19238,0.55176,0.19238,0.83984c0,0.35938-0.08984,0.68555-0.26953,0.97754
			c-0.18066,0.29199-0.42676,0.52246-0.73828,0.69043c-0.3125,0.16797-0.66406,0.25195-1.05664,0.25195
			c-0.2793,0-0.54395-0.04395-0.79199-0.13184c-0.0957,0.08008-0.16406,0.14551-0.2041,0.19727
			c-0.04004,0.05273-0.05957,0.11426-0.05957,0.18652c0,0.14355,0.14746,0.25195,0.44434,0.32422
			c0.29492,0.07129,0.7832,0.10742,1.46289,0.10742C376.27539,93.30002,376.75781,93.43674,377.05859,93.70822z M376.01953,95.41232
			c0.24805-0.12012,0.37305-0.28027,0.37305-0.48047c0-0.18359-0.08008-0.31348-0.24023-0.38965s-0.46484-0.11426-0.91211-0.11426
			c-0.56836,0-1.04102-0.04785-1.41602-0.14355c-0.15234,0.1123-0.26367,0.21777-0.33594,0.31738
			c-0.07227,0.10059-0.1084,0.22266-0.1084,0.36621c0,0.20801,0.14355,0.36426,0.43262,0.46777
			c0.28711,0.10449,0.67578,0.15625,1.16406,0.15625C375.42383,95.59201,375.77148,95.53244,376.01953,95.41232z
			 M374.10547,90.05392c-0.1875,0.18066-0.28125,0.39453-0.28125,0.64258c0,0.25586,0.08984,0.47559,0.26953,0.66016
			c0.17969,0.18359,0.39844,0.27539,0.6543,0.27539c0.27148,0,0.49609-0.08789,0.67188-0.26367s0.26367-0.40039,0.26367-0.67188
			c0-0.26465-0.08984-0.48242-0.26953-0.6543s-0.40234-0.25781-0.66602-0.25781
			C374.50781,89.78439,374.29395,89.87424,374.10547,90.05392z"/>
		<path d="M379.8125,94.29025c-0.4248-0.22852-0.75391-0.55762-0.99023-0.99023c-0.23633-0.43164-0.35449-0.94824-0.35449-1.54785
			s0.11621-1.12402,0.34863-1.57227c0.23145-0.44727,0.54688-0.79199,0.94727-1.03125
			c0.40039-0.24023,0.84375-0.36035,1.33203-0.36035c0.43945,0,0.8418,0.10352,1.20605,0.31152
			c0.36426,0.20898,0.6543,0.5166,0.87012,0.9248c0.2168,0.40723,0.32422,0.89941,0.32422,1.47559
			c0,0.17578-0.00781,0.36816-0.02344,0.57617h-3.69727c0.02441,0.48828,0.18457,0.86035,0.48047,1.11621
			s0.64844,0.38379,1.05664,0.38379c0.54297,0,0.9873-0.17578,1.33203-0.52832l0.69531,0.67188
			c-0.51953,0.6084-1.21582,0.91211-2.08789,0.91211C380.71582,94.63205,380.23633,94.51779,379.8125,94.29025z M381.87598,90.16232
			c-0.2002-0.21191-0.47949-0.31836-0.83984-0.31836c-0.32812,0-0.60449,0.10254-0.82812,0.30664
			c-0.22363,0.20312-0.36035,0.50586-0.4082,0.90527h2.37598C382.17578,90.67209,382.07617,90.37424,381.87598,90.16232z"/>
		<path d="M389.61621,89.42404l-0.57617,1.14062l-0.03613,0.0957l-0.10742-0.04785
			c-0.00879-0.02441-0.02637-0.07812-0.05469-0.16211c-0.02734-0.08398-0.09375-0.17383-0.19727-0.27051
			c-0.24805-0.18359-0.5-0.27539-0.75586-0.27539c-0.41602,0-0.76074,0.13965-1.0332,0.41992
			c-0.27148,0.28027-0.40723,0.69531-0.40723,1.24805v2.92773h-1.37988v-5.58008h1.4043l-0.0127,0.91211
			c0.15137-0.32031,0.37402-0.57422,0.66602-0.76172c0.29199-0.18848,0.60645-0.28223,0.94238-0.28223
			C388.69922,88.7883,389.21582,89.00021,389.61621,89.42404z"/>
	</g>
</g>
<g transform="translate(-0.5 -0.5)">
	<g class="st1">
		<path d="M61.90381,126.96408c0.88037,0,1.54004,0.19336,1.97998,0.58203c0.43994,0.3877,0.66016,0.92578,0.66016,1.61328
			c0,0.4248-0.12988,0.83203-0.39014,1.22461c-0.25977,0.3916-0.59814,0.66406-1.01367,0.81543l1.60791,3.24023h-1.42822
			l-1.51172-3.1084h-0.8999v3.1084h-1.36816v-7.47559H61.90381z M62.85791,129.93967
			c0.1958-0.17578,0.29395-0.42383,0.29395-0.74414c0-0.30371-0.1001-0.55566-0.2998-0.75586
			c-0.2002-0.2002-0.48438-0.2998-0.85205-0.2998h-1.0918v2.06348H62C62.37598,130.20334,62.66211,130.11545,62.85791,129.93967z"/>
		<path d="M66.63818,134.19357c-0.4043-0.24414-0.72217-0.58789-0.9541-1.03223c-0.23242-0.44336-0.34814-0.94922-0.34814-1.51758
			c0-0.54395,0.11572-1.03809,0.34814-1.48242c0.23193-0.44336,0.5498-0.79395,0.9541-1.0498
			c0.40381-0.25586,0.85352-0.38379,1.34961-0.38379s0.94824,0.12793,1.35645,0.38379
			c0.40771,0.25586,0.72949,0.60645,0.96582,1.0498c0.23584,0.44434,0.354,0.93848,0.354,1.48242
			c0,0.56836-0.11816,1.07227-0.354,1.51172c-0.23633,0.44043-0.55811,0.78418-0.96582,1.03223
			c-0.4082,0.24805-0.86035,0.37207-1.35645,0.37207S67.04199,134.43771,66.63818,134.19357z M68.93604,132.96994
			c0.24805-0.33984,0.37207-0.78223,0.37207-1.32617c0-0.55957-0.12207-1.00391-0.36621-1.33203s-0.56201-0.49219-0.9541-0.49219
			c-0.37598,0-0.68604,0.16602-0.92969,0.49805c-0.24414,0.33203-0.36621,0.77441-0.36621,1.32617
			c0,0.54395,0.12207,0.98633,0.36621,1.32617c0.24365,0.33984,0.55371,0.50977,0.92969,0.50977
			C68.37207,133.47971,68.68799,133.30978,68.93604,132.96994z"/>
		<path d="M72.63818,134.19357c-0.4043-0.24414-0.72217-0.58789-0.9541-1.03223c-0.23242-0.44336-0.34814-0.94922-0.34814-1.51758
			c0-0.54395,0.11572-1.03809,0.34814-1.48242c0.23193-0.44336,0.5498-0.79395,0.9541-1.0498
			c0.40381-0.25586,0.85352-0.38379,1.34961-0.38379s0.94824,0.12793,1.35645,0.38379
			c0.40771,0.25586,0.72949,0.60645,0.96582,1.0498c0.23584,0.44434,0.354,0.93848,0.354,1.48242
			c0,0.56836-0.11816,1.07227-0.354,1.51172c-0.23633,0.44043-0.55811,0.78418-0.96582,1.03223
			c-0.4082,0.24805-0.86035,0.37207-1.35645,0.37207S73.04199,134.43771,72.63818,134.19357z M74.93604,132.96994
			c0.24805-0.33984,0.37207-0.78223,0.37207-1.32617c0-0.55957-0.12207-1.00391-0.36621-1.33203s-0.56201-0.49219-0.9541-0.49219
			c-0.37598,0-0.68604,0.16602-0.92969,0.49805c-0.24414,0.33203-0.36621,0.77441-0.36621,1.32617
			c0,0.54395,0.12207,0.98633,0.36621,1.32617c0.24365,0.33984,0.55371,0.50977,0.92969,0.50977
			C74.37207,133.47971,74.68799,133.30978,74.93604,132.96994z"/>
		<path d="M78.5,128.85959v0.4082c0.12793-0.17578,0.27588-0.31055,0.44385-0.40234s0.34424-0.1377,0.52832-0.1377
			c0.21582,0,0.40771,0.05566,0.57568,0.16797s0.29199,0.28027,0.37207,0.50391c0.24805-0.44824,0.64014-0.67188,1.17627-0.67188
			c0.77588,0,1.15576,0.53223,1.13965,1.5957v4.11621h-1.17578v-3.82812c0-0.34375-0.02588-0.58203-0.07812-0.71387
			s-0.1377-0.19824-0.25781-0.19824c-0.16016,0-0.3042,0.11035-0.43213,0.33008c-0.12793,0.2207-0.19189,0.49805-0.19189,0.83398
			v3.57617h-1.104v-3.79199c0-0.37598-0.02832-0.62988-0.08398-0.76172c-0.05615-0.13184-0.16016-0.19824-0.31201-0.19824
			c-0.15234,0-0.28418,0.09961-0.396,0.2998c-0.1123,0.2002-0.16797,0.46777-0.16797,0.80371v3.64844h-1.17627v-5.58008H78.5z"/>
	</g>
</g>
<path pointer-events="stroke" class="st0" d="M325.5,100.5v20c0,6.66667-3.33334,10-10,10h-75c-6.66667,0-10,3.33333-10,10v17.75999
	"/>
<path pointer-events="all" class="st0" d="M227,152.38l3.5,7l3.5-7"/>
<path pointer-events="stroke" class="st0" d="M350.5,100.5v57.75999"/>
<path pointer-events="all" class="st0" d="M347,152.38l3.5,7l3.5-7"/>
<path pointer-events="stroke" class="st0" d="M375.5,100.5v20c0,6.66667,3.33334,10,10,10h75c6.66666,0,10,3.33333,10,10v17.75999"
	/>
<path pointer-events="all" class="st0" d="M467,152.38l3.5,7l3.5-7"/>
<g transform="translate(-0.5 -0.5)">
	<g class="st1">
		<path d="M203.29199,168.16379h-2.01611v-1.13965h5.43604v1.13965h-2.12402v6.33594h-1.2959V168.16379z"/>
		<path d="M208.81201,174.28976c-0.42432-0.22852-0.75391-0.55762-0.99023-0.99023c-0.23584-0.43164-0.354-0.94824-0.354-1.54785
			s0.11621-1.12402,0.34814-1.57227c0.23193-0.44727,0.54785-0.79199,0.94824-1.03125
			c0.3999-0.24023,0.84375-0.36035,1.33203-0.36035c0.43945,0,0.8418,0.10352,1.20557,0.31152
			c0.36426,0.20898,0.6543,0.5166,0.87012,0.9248c0.21631,0.40723,0.32422,0.89941,0.32422,1.47559
			c0,0.17578-0.0083,0.36816-0.02393,0.57617h-3.69629c0.02393,0.48828,0.18408,0.86035,0.47998,1.11621
			s0.64795,0.38379,1.05615,0.38379c0.54395,0,0.98779-0.17578,1.33203-0.52832l0.6958,0.67188
			c-0.52002,0.6084-1.21582,0.91211-2.08789,0.91211C209.71582,174.63156,209.23584,174.5173,208.81201,174.28976z
			 M210.87598,170.16183c-0.2002-0.21191-0.47998-0.31836-0.83984-0.31836c-0.32812,0-0.60449,0.10254-0.82812,0.30664
			c-0.22412,0.20312-0.35986,0.50586-0.4082,0.90527h2.37598C211.17578,170.6716,211.07568,170.37375,210.87598,170.16183z"/>
		<path d="M214.5,168.91965v0.4082c0.12793-0.17578,0.27588-0.31055,0.44385-0.40234s0.34424-0.1377,0.52832-0.1377
			c0.21582,0,0.40771,0.05566,0.57568,0.16797s0.29199,0.28027,0.37207,0.50391c0.24805-0.44824,0.64014-0.67188,1.17627-0.67188
			c0.77588,0,1.15576,0.53223,1.13965,1.5957v4.11621h-1.17578v-3.82812c0-0.34375-0.02588-0.58203-0.07812-0.71387
			s-0.1377-0.19824-0.25781-0.19824c-0.16016,0-0.3042,0.11035-0.43213,0.33008c-0.12793,0.2207-0.19189,0.49805-0.19189,0.83398
			v3.57617h-1.104v-3.79199c0-0.37598-0.02832-0.62988-0.08398-0.76172c-0.05615-0.13184-0.16016-0.19824-0.31201-0.19824
			c-0.15234,0-0.28418,0.09961-0.396,0.2998c-0.1123,0.2002-0.16797,0.46777-0.16797,0.80371v3.64844h-1.17627v-5.58008H214.5z"/>
		<path d="M220.9082,168.90793v0.78027c0.34375-0.60059,0.86768-0.90039,1.57178-0.90039c0.41602,0,0.79004,0.1123,1.12207,0.33594
			s0.5957,0.55762,0.79199,1.00195c0.1958,0.44434,0.29395,0.97754,0.29395,1.60156c0,0.63281-0.10205,1.16699-0.30615,1.60254
			c-0.20361,0.43652-0.47607,0.76367-0.81592,0.98438c-0.33984,0.21973-0.70996,0.3291-1.10986,0.3291
			c-0.31201,0-0.6001-0.05371-0.86426-0.16113c-0.26367-0.1084-0.47607-0.2627-0.63574-0.46289v2.48438h-1.37988l-0.01221-7.5957
			H220.9082z M223.00195,173.13742c0.22803-0.2998,0.34229-0.79395,0.34229-1.48145c0-0.56836-0.1084-1.00977-0.32422-1.32617
			s-0.52002-0.47363-0.91211-0.47363c-0.77588,0-1.16406,0.65137-1.16406,1.95508c0.00781,0.60059,0.10596,1.04688,0.29395,1.33887
			s0.47021,0.4375,0.84619,0.4375C222.46777,173.58762,222.77393,173.4382,223.00195,173.13742z"/>
		<path d="M226.48779,174.40402c-0.43164-0.15234-0.78809-0.37598-1.06787-0.67188l0.66016-1.11621l0.04785-0.09668l0.10791,0.06055
			c0.02393,0.08008,0.0498,0.14844,0.07812,0.2041c0.02783,0.05566,0.08594,0.12402,0.17383,0.2041
			c0.44824,0.34375,0.94824,0.51562,1.5,0.51562c0.36816,0,0.66602-0.08594,0.89404-0.25781s0.34229-0.41016,0.34229-0.71387
			c0-0.17578-0.03809-0.33008-0.11426-0.46191s-0.22021-0.27051-0.43164-0.41406c-0.2124-0.14453-0.52246-0.3125-0.93018-0.50391
			c-0.76025-0.32812-1.29199-0.66992-1.59619-1.02637c-0.3042-0.35547-0.45605-0.79004-0.45605-1.30176
			c0-0.36035,0.10205-0.68652,0.30615-0.97852s0.48779-0.52148,0.85205-0.68945c0.36377-0.16797,0.77393-0.25195,1.22998-0.25195
			c0.91992,0,1.67578,0.31934,2.26807,0.95996l-0.79199,0.91211l-0.07227,0.08398l-0.0957-0.07227
			c-0.0083-0.08008-0.02393-0.14844-0.04785-0.2041c-0.02441-0.05566-0.07617-0.12793-0.15625-0.21582
			c-0.15186-0.13574-0.31201-0.23047-0.47998-0.28223s-0.37207-0.07812-0.61182-0.07812c-0.31201,0-0.56836,0.07422-0.76807,0.22266
			c-0.2002,0.14746-0.30029,0.3252-0.30029,0.5332c0,0.17676,0.03809,0.32617,0.11426,0.4502
			c0.07568,0.12402,0.22168,0.25391,0.43799,0.38965c0.21582,0.13672,0.55176,0.30859,1.00781,0.5166
			c0.51221,0.23242,0.9082,0.45801,1.18799,0.67773c0.28027,0.2207,0.47998,0.45801,0.6001,0.71387
			c0.12012,0.25684,0.18018,0.56836,0.18018,0.93652c0,0.38379-0.09619,0.74219-0.28809,1.07422s-0.48584,0.59961-0.88184,0.80371
			s-0.89014,0.30566-1.48242,0.30566C227.39209,174.63156,226.91992,174.55539,226.48779,174.40402z"/>
		<path d="M232.81201,174.28976c-0.42432-0.22852-0.75391-0.55762-0.99023-0.99023c-0.23584-0.43164-0.354-0.94824-0.354-1.54785
			s0.11621-1.12402,0.34814-1.57227c0.23193-0.44727,0.54785-0.79199,0.94824-1.03125
			c0.3999-0.24023,0.84375-0.36035,1.33203-0.36035c0.43945,0,0.8418,0.10352,1.20557,0.31152
			c0.36426,0.20898,0.6543,0.5166,0.87012,0.9248c0.21631,0.40723,0.32422,0.89941,0.32422,1.47559
			c0,0.17578-0.0083,0.36816-0.02393,0.57617h-3.69629c0.02393,0.48828,0.18408,0.86035,0.47998,1.11621
			s0.64795,0.38379,1.05615,0.38379c0.54395,0,0.98779-0.17578,1.33203-0.52832l0.6958,0.67188
			c-0.52002,0.6084-1.21582,0.91211-2.08789,0.91211C233.71582,174.63156,233.23584,174.5173,232.81201,174.28976z
			 M234.87598,170.16183c-0.2002-0.21191-0.47998-0.31836-0.83984-0.31836c-0.32812,0-0.60449,0.10254-0.82812,0.30664
			c-0.22412,0.20312-0.35986,0.50586-0.4082,0.90527h2.37598C235.17578,170.6716,235.07568,170.37375,234.87598,170.16183z"/>
		<path d="M239.01611,168.91965v0.76855c0.45605-0.60059,0.9917-0.90039,1.60791-0.90039c0.52002,0,0.95215,0.19434,1.2959,0.58203
			s0.51611,0.97363,0.51611,1.75781v3.37207h-1.35596v-3.34766c0-0.44824-0.07227-0.78027-0.21631-0.99609
			c-0.14355-0.21582-0.34375-0.32422-0.59961-0.32422c-0.2085,0-0.4082,0.05566-0.6001,0.16797s-0.34814,0.26953-0.46826,0.47363
			c-0.11963,0.2041-0.17969,0.43848-0.17969,0.70215v3.32422h-1.35596v-5.58008H239.01611z"/>
		<path d="M243.54004,173.74387l0.6001-1.10449l0.04785-0.0957l0.09619,0.05957c0.02393,0.08887,0.0498,0.16016,0.07764,0.2168
			c0.02832,0.05566,0.08594,0.12402,0.17432,0.2041c0.20801,0.17578,0.43994,0.30957,0.6958,0.40137s0.55615,0.13867,0.8999,0.13867
			c0.32812,0,0.58594-0.05664,0.77393-0.16797c0.18799-0.1123,0.28223-0.26074,0.28223-0.44434
			c0-0.17578-0.09424-0.32031-0.28223-0.43262c-0.18799-0.11133-0.52979-0.23926-1.02588-0.38379
			c-0.64795-0.16797-1.14209-0.3916-1.48193-0.67188s-0.50977-0.63574-0.50977-1.06738c0-0.30469,0.08984-0.57812,0.27002-0.82227
			c0.17969-0.24414,0.43555-0.43652,0.76758-0.57617s0.71826-0.20996,1.1582-0.20996c0.91992,0,1.66797,0.28418,2.24414,0.85156
			l-0.66016,0.9248l-0.08398,0.0957L247.5,170.58762c-0.01611-0.08008-0.03809-0.14746-0.06592-0.2041
			c-0.02832-0.05566-0.08594-0.12402-0.17432-0.2041c-0.32812-0.23145-0.71191-0.34766-1.15186-0.34766
			c-0.28809,0-0.52588,0.0459-0.71387,0.1377c-0.18799,0.09277-0.28223,0.22656-0.28223,0.40234
			c0,0.15234,0.104,0.28613,0.31201,0.40234c0.20801,0.11523,0.56396,0.2373,1.06836,0.36523
			c0.67188,0.17676,1.15967,0.40039,1.46387,0.67188c0.30371,0.27246,0.45605,0.62402,0.45605,1.05664
			c0,0.32031-0.09033,0.61426-0.27002,0.88184c-0.18018,0.26855-0.44385,0.48242-0.79199,0.6416
			c-0.34814,0.16016-0.76221,0.24023-1.24219,0.24023C245.02002,174.63156,244.16406,174.33566,243.54004,173.74387z"/>
		<path d="M250.63818,174.25363c-0.4043-0.24414-0.72217-0.58789-0.9541-1.03223c-0.23242-0.44336-0.34814-0.94922-0.34814-1.51758
			c0-0.54395,0.11572-1.03809,0.34814-1.48242c0.23193-0.44336,0.5498-0.79395,0.9541-1.0498
			c0.40381-0.25586,0.85352-0.38379,1.34961-0.38379s0.94824,0.12793,1.35645,0.38379
			c0.40771,0.25586,0.72949,0.60645,0.96582,1.0498c0.23584,0.44434,0.354,0.93848,0.354,1.48242
			c0,0.56836-0.11816,1.07227-0.354,1.51172c-0.23633,0.44043-0.55811,0.78418-0.96582,1.03223
			c-0.4082,0.24805-0.86035,0.37207-1.35645,0.37207S251.04199,174.49777,250.63818,174.25363z M252.93604,173.03
			c0.24805-0.33984,0.37207-0.78223,0.37207-1.32617c0-0.55957-0.12207-1.00391-0.36621-1.33203s-0.56201-0.49219-0.9541-0.49219
			c-0.37598,0-0.68604,0.16602-0.92969,0.49805c-0.24414,0.33203-0.36621,0.77441-0.36621,1.32617
			c0,0.54395,0.12207,0.98633,0.36621,1.32617c0.24365,0.33984,0.55371,0.50977,0.92969,0.50977
			C252.37207,173.53976,252.68799,173.36984,252.93604,173.03z"/>
		<path d="M260.61621,169.42355l-0.57617,1.14062l-0.03613,0.0957l-0.10791-0.04785c-0.0083-0.02441-0.02588-0.07812-0.0542-0.16211
			c-0.02783-0.08398-0.09375-0.17383-0.19775-0.27051c-0.24805-0.18359-0.5-0.27539-0.75586-0.27539
			c-0.41602,0-0.76025,0.13965-1.03223,0.41992s-0.40771,0.69531-0.40771,1.24805v2.92773h-1.38037v-5.58008h1.4043
			l-0.01221,0.91211c0.15186-0.32031,0.37402-0.57422,0.66602-0.76172c0.29199-0.18848,0.60596-0.28223,0.94189-0.28223
			C259.69971,168.78781,260.21582,168.99973,260.61621,169.42355z"/>
	</g>
</g>
<g transform="translate(-0.5 -0.5)">
	<g class="st1">
		<path d="M340.93164,167.13156c-0.04785,0.04785-0.07812,0.10059-0.08984,0.15625s-0.01758,0.15234-0.01758,0.28809v2.4834h2.30371
			v-3.03516h1.47559v0.10742c-0.03906,0.04785-0.06543,0.10059-0.07812,0.15625c-0.01172,0.05566-0.01758,0.15234-0.01758,0.28809
			v6.92383h-1.37988v-3.36035h-2.30371v3.36035h-1.36816v-7.47559h1.47559V167.13156z"/>
		<path d="M346.8125,174.28976c-0.4248-0.22852-0.75391-0.55762-0.99023-0.99023c-0.23633-0.43164-0.35449-0.94824-0.35449-1.54785
			s0.11621-1.12402,0.34863-1.57227c0.23145-0.44727,0.54688-0.79199,0.94727-1.03125
			c0.40039-0.24023,0.84375-0.36035,1.33203-0.36035c0.43945,0,0.8418,0.10352,1.20605,0.31152
			c0.36426,0.20898,0.6543,0.5166,0.87012,0.9248c0.2168,0.40723,0.32422,0.89941,0.32422,1.47559
			c0,0.17578-0.00781,0.36816-0.02344,0.57617h-3.69727c0.02441,0.48828,0.18457,0.86035,0.48047,1.11621
			s0.64844,0.38379,1.05664,0.38379c0.54297,0,0.9873-0.17578,1.33203-0.52832l0.69531,0.67188
			c-0.51953,0.6084-1.21582,0.91211-2.08789,0.91211C347.71582,174.63156,347.23633,174.5173,346.8125,174.28976z
			 M348.87598,170.16183c-0.2002-0.21191-0.47949-0.31836-0.83984-0.31836c-0.32812,0-0.60449,0.10254-0.82812,0.30664
			c-0.22363,0.20312-0.36035,0.50586-0.4082,0.90527h2.37598C349.17578,170.6716,349.07617,170.37375,348.87598,170.16183z"/>
		<path d="M356.41211,171.28391v3.21582h-1.4043v-0.59961c-0.19922,0.26367-0.43359,0.4541-0.70117,0.56934
			c-0.26855,0.11621-0.57812,0.17383-0.93066,0.17383c-0.6084,0-1.08398-0.14355-1.42773-0.43164
			c-0.34473-0.28809-0.5166-0.66797-0.5166-1.13965c0-0.40039,0.12012-0.75391,0.36035-1.0625
			c0.24023-0.30762,0.59473-0.5498,1.06152-0.72559c0.46875-0.17578,1.03418-0.26465,1.69824-0.26465
			c0.20801,0,0.37988,0.00488,0.5166,0.0127c-0.05664-0.44043-0.18262-0.74805-0.37891-0.92383
			c-0.19531-0.17676-0.48145-0.26465-0.85742-0.26465c-0.27148,0-0.51953,0.04395-0.74414,0.13184
			c-0.22461,0.08887-0.43945,0.24023-0.64844,0.45605l-0.74414-0.81543c0.58398-0.55176,1.31641-0.82812,2.19727-0.82812
			C355.57227,168.78781,356.41211,169.61984,356.41211,171.28391z M355.08008,171.9675
			c-0.13672-0.00781-0.32031-0.01172-0.55273-0.01172c-1.15918,0-1.73926,0.31641-1.73926,0.94824
			c0,0.45605,0.28418,0.68359,0.85254,0.68359C354.50391,173.58762,354.98438,173.04758,355.08008,171.9675z"/>
		<path d="M362.44824,173.99582c-0.56055,0.41602-1.18066,0.62402-1.86035,0.62402c-0.62402,0-1.08594-0.2002-1.38574-0.60059
			c-0.2998-0.39941-0.4502-1.0752-0.4502-2.02734l0.01172-0.38379l0.06055-1.62012h-1.14062l0.02441-1.06836h1.16406
			l0.04785-1.32031l1.4043-0.17969l0.10742-0.01172l0.01172,0.10742c-0.05566,0.08008-0.09375,0.14844-0.11328,0.2041
			c-0.01953,0.05664-0.03418,0.14062-0.04199,0.25195l-0.07227,0.94824h1.78809l-0.01172,1.06836h-1.78809l-0.08398,1.5957
			c-0.00879,0.0957-0.0127,0.23242-0.0127,0.4082c0,0.57617,0.06641,0.97559,0.19922,1.2002
			c0.13086,0.22363,0.33008,0.33594,0.59375,0.33594c0.4082,0,0.82812-0.17188,1.25977-0.5166L362.44824,173.99582z"/>
	</g>
</g>
<g transform="translate(-0.5 -0.5)">
	<g class="st1">
		<path d="M433.48828,174.49973l-0.51562-1.74023h-1.95703l-0.52734,1.74023h-1.34375l2.53125-7.52441h0.64844l2.53125,7.52441
			H433.48828z M431.30469,171.78781h1.37891L432,169.4841L431.30469,171.78781z"/>
		<path d="M436.00781,173.43137h1.36816v-3.44336h-1.2959v-1.06836h2.66406v4.51172h1.24805v1.06836h-3.98438V173.43137z
			 M437.40039,167.75558c-0.16797-0.16016-0.25195-0.35156-0.25195-0.57617c0-0.23145,0.08008-0.42578,0.24023-0.58203
			c0.15918-0.15527,0.36328-0.2334,0.61133-0.2334c0.23242,0,0.43164,0.08008,0.59961,0.23926
			c0.16797,0.16016,0.25195,0.35254,0.25195,0.57617c0,0.22461-0.08398,0.41602-0.25195,0.57617s-0.36719,0.24023-0.59961,0.24023
			S437.56836,167.91574,437.40039,167.75558z"/>
		<path d="M446.61621,169.42355l-0.57617,1.14062l-0.03613,0.0957l-0.10742-0.04785
			c-0.00879-0.02441-0.02637-0.07812-0.05469-0.16211c-0.02734-0.08398-0.09375-0.17383-0.19727-0.27051
			c-0.24805-0.18359-0.5-0.27539-0.75586-0.27539c-0.41602,0-0.76074,0.13965-1.0332,0.41992
			c-0.27148,0.28027-0.40723,0.69531-0.40723,1.24805v2.92773h-1.37988v-5.58008h1.4043l-0.0127,0.91211
			c0.15137-0.32031,0.37402-0.57422,0.66602-0.76172c0.29199-0.18848,0.60645-0.28223,0.94238-0.28223
			C445.69922,168.78781,446.21582,168.99973,446.61621,169.42355z"/>
		<path d="M448.83594,174.2175c-0.44824-0.27539-0.80371-0.70215-1.06836-1.27734c-0.26367-0.57617-0.39551-1.28809-0.39551-2.13672
			c0-0.91992,0.14746-1.66992,0.44434-2.25c0.29492-0.58008,0.67188-0.99805,1.12695-1.25391
			c0.45703-0.25586,0.94043-0.38379,1.45312-0.38379c0.55957,0,1.03906,0.12598,1.43945,0.37793s0.70801,0.61426,0.92383,1.08594
			l-0.85156,0.63574l-0.0957,0.06055l-0.06055-0.0957c0.00781-0.06445,0.00195-0.12402-0.01758-0.18066
			c-0.02051-0.05566-0.0625-0.13965-0.12695-0.25195c-0.16797-0.2002-0.34375-0.33984-0.52734-0.41992
			s-0.38867-0.12012-0.6123-0.12012c-0.31152,0-0.60254,0.10645-0.87012,0.31836s-0.48242,0.52344-0.6416,0.93555
			c-0.16016,0.41211-0.24023,0.90625-0.24023,1.48242c0,0.55957,0.07227,1.0498,0.21582,1.46973
			c0.14453,0.41992,0.3418,0.74219,0.59375,0.96582c0.25195,0.22461,0.53906,0.33594,0.8584,0.33594
			c0.30371,0,0.56445-0.06348,0.78027-0.19141s0.4082-0.33984,0.57617-0.63574l0.93555,0.69531
			c-0.27148,0.44824-0.5957,0.76855-0.97168,0.95996c-0.37598,0.19238-0.82812,0.28809-1.35645,0.28809
			C449.78809,174.63156,449.28418,174.49387,448.83594,174.2175z"/>
		<path d="M454.63867,174.25363c-0.4043-0.24414-0.72266-0.58789-0.95508-1.03223c-0.23242-0.44336-0.34766-0.94922-0.34766-1.51758
			c0-0.54395,0.11523-1.03809,0.34766-1.48242c0.23242-0.44336,0.55078-0.79395,0.95508-1.0498
			c0.40332-0.25586,0.85352-0.38379,1.34961-0.38379s0.94727,0.12793,1.35547,0.38379s0.73047,0.60645,0.9668,1.0498
			c0.23535,0.44434,0.35352,0.93848,0.35352,1.48242c0,0.56836-0.11816,1.07227-0.35352,1.51172
			c-0.23633,0.44043-0.55859,0.78418-0.9668,1.03223s-0.85938,0.37207-1.35547,0.37207S455.04199,174.49777,454.63867,174.25363z
			 M456.93555,173.03c0.24805-0.33984,0.37305-0.78223,0.37305-1.32617c0-0.55957-0.12305-1.00391-0.36719-1.33203
			s-0.56152-0.49219-0.95312-0.49219c-0.37695,0-0.68652,0.16602-0.92969,0.49805c-0.24414,0.33203-0.36719,0.77441-0.36719,1.32617
			c0,0.54395,0.12305,0.98633,0.36719,1.32617c0.24316,0.33984,0.55273,0.50977,0.92969,0.50977
			C456.37207,173.53976,456.6875,173.36984,456.93555,173.03z"/>
		<path d="M461.01562,168.91965v0.76855c0.45703-0.60059,0.99219-0.90039,1.6084-0.90039c0.52051,0,0.95215,0.19434,1.2959,0.58203
			s0.51562,0.97363,0.51562,1.75781v3.37207h-1.35547v-3.34766c0-0.44824-0.07227-0.78027-0.2168-0.99609
			c-0.14258-0.21582-0.34375-0.32422-0.59961-0.32422c-0.20801,0-0.4082,0.05566-0.59961,0.16797s-0.34766,0.26953-0.46875,0.47363
			c-0.11914,0.2041-0.17969,0.43848-0.17969,0.70215v3.32422h-1.35547v-5.58008H461.01562z"/>
		<path d="M466.54785,174.29562c-0.35254-0.22363-0.63184-0.55762-0.83984-1.00195s-0.31152-0.98145-0.31152-1.61426
			c0-0.62402,0.10156-1.15332,0.30566-1.58984c0.2041-0.43555,0.48145-0.76367,0.83398-0.9834
			c0.35156-0.2207,0.74805-0.33008,1.18848-0.33008c0.29492,0,0.55859,0.05371,0.79102,0.16211
			c0.23242,0.10742,0.41602,0.27344,0.55273,0.49707v-2.9873h1.45117v0.10742c-0.04688,0.04785-0.07812,0.10059-0.08984,0.15625
			s-0.01758,0.15234-0.01758,0.28809l-0.01172,6.75586c0,0.3125,0.04297,0.56055,0.13184,0.74414h-1.33203
			c-0.05566-0.12012-0.09082-0.21582-0.10254-0.28809s-0.01758-0.17969-0.01758-0.32422
			c-0.15234,0.24805-0.3457,0.43457-0.58203,0.55859s-0.49805,0.18555-0.78613,0.18555
			C467.28809,174.63156,466.90039,174.51926,466.54785,174.29562z M469.04395,171.69211c0-0.62402-0.09473-1.08984-0.28223-1.39844
			c-0.1875-0.30762-0.47363-0.46191-0.85742-0.46191c-0.37695,0-0.66602,0.16211-0.87012,0.48633
			c-0.2041,0.32324-0.30566,0.76953-0.30566,1.33789c0,0.57617,0.11523,1.03418,0.34766,1.37402s0.51953,0.50977,0.86328,0.50977
			C468.67578,173.53976,469.04395,172.92355,469.04395,171.69211z"/>
		<path d="M472.00781,173.43137h1.36816v-3.44336h-1.2959v-1.06836h2.66406v4.51172h1.24805v1.06836h-3.98438V173.43137z
			 M473.40039,167.75558c-0.16797-0.16016-0.25195-0.35156-0.25195-0.57617c0-0.23145,0.08008-0.42578,0.24023-0.58203
			c0.15918-0.15527,0.36328-0.2334,0.61133-0.2334c0.23242,0,0.43164,0.08008,0.59961,0.23926
			c0.16797,0.16016,0.25195,0.35254,0.25195,0.57617c0,0.22461-0.08398,0.41602-0.25195,0.57617s-0.36719,0.24023-0.59961,0.24023
			S473.56836,167.91574,473.40039,167.75558z"/>
		<path d="M482.44824,173.99582c-0.56055,0.41602-1.18066,0.62402-1.86035,0.62402c-0.62402,0-1.08594-0.2002-1.38574-0.60059
			c-0.2998-0.39941-0.4502-1.0752-0.4502-2.02734l0.01172-0.38379l0.06055-1.62012h-1.14062l0.02441-1.06836h1.16406
			l0.04785-1.32031l1.4043-0.17969l0.10742-0.01172l0.01172,0.10742c-0.05566,0.08008-0.09375,0.14844-0.11328,0.2041
			c-0.01953,0.05664-0.03418,0.14062-0.04199,0.25195l-0.07227,0.94824h1.78809l-0.01172,1.06836h-1.78809l-0.08398,1.5957
			c-0.00879,0.0957-0.0127,0.23242-0.0127,0.4082c0,0.57617,0.06641,0.97559,0.19922,1.2002
			c0.13086,0.22363,0.33008,0.33594,0.59375,0.33594c0.4082,0,0.82812-0.17188,1.25977-0.5166L482.44824,173.99582z"/>
		<path d="M484.00781,173.43137h1.36816v-3.44336h-1.2959v-1.06836h2.66406v4.51172h1.24805v1.06836h-3.98438V173.43137z
			 M485.40039,167.75558c-0.16797-0.16016-0.25195-0.35156-0.25195-0.57617c0-0.23145,0.08008-0.42578,0.24023-0.58203
			c0.15918-0.15527,0.36328-0.2334,0.61133-0.2334c0.23242,0,0.43164,0.08008,0.59961,0.23926
			c0.16797,0.16016,0.25195,0.35254,0.25195,0.57617c0,0.22461-0.08398,0.41602-0.25195,0.57617s-0.36719,0.24023-0.59961,0.24023
			S485.56836,167.91574,485.40039,167.75558z"/>
		<path d="M490.63867,174.25363c-0.4043-0.24414-0.72266-0.58789-0.95508-1.03223c-0.23242-0.44336-0.34766-0.94922-0.34766-1.51758
			c0-0.54395,0.11523-1.03809,0.34766-1.48242c0.23242-0.44336,0.55078-0.79395,0.95508-1.0498
			c0.40332-0.25586,0.85352-0.38379,1.34961-0.38379s0.94727,0.12793,1.35547,0.38379s0.73047,0.60645,0.9668,1.0498
			c0.23535,0.44434,0.35352,0.93848,0.35352,1.48242c0,0.56836-0.11816,1.07227-0.35352,1.51172
			c-0.23633,0.44043-0.55859,0.78418-0.9668,1.03223s-0.85938,0.37207-1.35547,0.37207S491.04199,174.49777,490.63867,174.25363z
			 M492.93555,173.03c0.24805-0.33984,0.37305-0.78223,0.37305-1.32617c0-0.55957-0.12305-1.00391-0.36719-1.33203
			s-0.56152-0.49219-0.95312-0.49219c-0.37695,0-0.68652,0.16602-0.92969,0.49805c-0.24414,0.33203-0.36719,0.77441-0.36719,1.32617
			c0,0.54395,0.12305,0.98633,0.36719,1.32617c0.24316,0.33984,0.55273,0.50977,0.92969,0.50977
			C492.37207,173.53976,492.6875,173.36984,492.93555,173.03z"/>
		<path d="M497.01562,168.91965v0.76855c0.45703-0.60059,0.99219-0.90039,1.6084-0.90039c0.52051,0,0.95215,0.19434,1.2959,0.58203
			s0.51562,0.97363,0.51562,1.75781v3.37207h-1.35547v-3.34766c0-0.44824-0.07227-0.78027-0.2168-0.99609
			c-0.14258-0.21582-0.34375-0.32422-0.59961-0.32422c-0.20801,0-0.4082,0.05566-0.59961,0.16797s-0.34766,0.26953-0.46875,0.47363
			c-0.11914,0.2041-0.17969,0.43848-0.17969,0.70215v3.32422h-1.35547v-5.58008H497.01562z"/>
		<path d="M502.8125,174.28976c-0.4248-0.22852-0.75391-0.55762-0.99023-0.99023c-0.23633-0.43164-0.35449-0.94824-0.35449-1.54785
			s0.11621-1.12402,0.34863-1.57227c0.23145-0.44727,0.54688-0.79199,0.94727-1.03125
			c0.40039-0.24023,0.84375-0.36035,1.33203-0.36035c0.43945,0,0.8418,0.10352,1.20605,0.31152
			c0.36426,0.20898,0.6543,0.5166,0.87012,0.9248c0.2168,0.40723,0.32422,0.89941,0.32422,1.47559
			c0,0.17578-0.00781,0.36816-0.02344,0.57617h-3.69727c0.02441,0.48828,0.18457,0.86035,0.48047,1.11621
			s0.64844,0.38379,1.05664,0.38379c0.54297,0,0.9873-0.17578,1.33203-0.52832l0.69531,0.67188
			c-0.51953,0.6084-1.21582,0.91211-2.08789,0.91211C503.71582,174.63156,503.23633,174.5173,502.8125,174.28976z
			 M504.87598,170.16183c-0.2002-0.21191-0.47949-0.31836-0.83984-0.31836c-0.32812,0-0.60449,0.10254-0.82812,0.30664
			c-0.22363,0.20312-0.36035,0.50586-0.4082,0.90527h2.37598C505.17578,170.6716,505.07617,170.37375,504.87598,170.16183z"/>
		<path d="M512.61621,169.42355l-0.57617,1.14062l-0.03613,0.0957l-0.10742-0.04785
			c-0.00879-0.02441-0.02637-0.07812-0.05469-0.16211c-0.02734-0.08398-0.09375-0.17383-0.19727-0.27051
			c-0.24805-0.18359-0.5-0.27539-0.75586-0.27539c-0.41602,0-0.76074,0.13965-1.0332,0.41992
			c-0.27148,0.28027-0.40723,0.69531-0.40723,1.24805v2.92773h-1.37988v-5.58008h1.4043l-0.0127,0.91211
			c0.15137-0.32031,0.37402-0.57422,0.66602-0.76172c0.29199-0.18848,0.60645-0.28223,0.94238-0.28223
			C511.69922,168.78781,512.21582,168.99973,512.61621,169.42355z"/>
	</g>
</g>
<path d="M251.94453,160.5"/>
<path class="st2" d="M264.38568,24.67819V8.50394c0-4.69659-3.80734-8.50394-8.50394-8.50394h-89.99591
	c-4.69659,0-8.50394,3.80734-8.50394,8.50394v16.17426c0,4.69659-3.80734,8.50394-8.50394,8.50394H25.64023
	c-4.69659,0-8.50394,3.80734-8.50394,8.50394v97.81348c0,4.69659,3.80734,8.50394,8.50394,8.50394h89.99591
	c4.69659,0,8.50394-3.80734,8.50394-8.50394V68.89468c0-4.69659,3.80734-8.50394,8.50394-8.50394H288.5181
	c4.69659,0,8.50394,3.80734,8.50394,8.50394v34.98138c0,4.69659,3.80734,8.50394,8.50394,8.50394h89.99591
	c4.69659,0,8.50394-3.80734,8.50394-8.50394v-62.19c0-4.69659-3.80734-8.50394-8.50394-8.50394H272.88962
	C268.19302,33.18213,264.38568,29.37479,264.38568,24.67819z"/>
<path class="st3" d="M267.897,107.44954H153.09128c-4.69659,0-8.50394-3.80734-8.50394-8.50394V80.88393
	c0-4.69659,3.80734-8.50394,8.50394-8.50394H267.897c4.69659,0,8.50394,3.80734,8.50394,8.50394V98.9456
	C276.40094,103.6422,272.5936,107.44954,267.897,107.44954z"/>
<path class="st4" d="M275.3606,184.25197h-89.8291c-4.69659,0-8.50394-3.80734-8.50394-8.50394V164.3315
	c0-4.69659,3.80734-8.50394,8.50394-8.50394h89.8291c4.69659,0,8.50394,3.80734,8.50394,8.50394v11.41653
	C283.86453,180.44463,280.05719,184.25197,275.3606,184.25197z"/>
<path class="st4" d="M395.84619,184.25197h-89.8291c-4.69659,0-8.50394-3.80734-8.50394-8.50394V164.3315
	c0-4.69659,3.80734-8.50394,8.50394-8.50394h89.8291c4.69659,0,8.50394,3.80734,8.50394,8.50394v11.41653
	C404.35013,180.44463,400.54279,184.25197,395.84619,184.25197z"/>
<path class="st4" d="M515.41455,184.25197h-89.8291c-4.69659,0-8.50394-3.80734-8.50394-8.50394V164.3315
	c0-4.69659,3.80734-8.50394,8.50394-8.50394h89.8291c4.69659,0,8.50391,3.80734,8.50391,8.50394v11.41653
	C523.91846,180.44463,520.11115,184.25197,515.41455,184.25197z"/>
</svg>
