[
    {
        "id": "4c4c1848.c96db8",
        "type": "Kafka Producer",
        "z": "80557b2.051a988",
        "name": "healthcheck",
        "broker": "bcd0c2e8.2532a8",
        "topic": "healthcheck",
        "topicSlash2dot": false,
        "requireAcks": 1,
        "ackTimeoutMs": 100,
        "partitionerType": 0,
        "key": "",
        "partition": 0,
        "attributes": 0,
        "connectionType": "Producer",
        "convertFromJson": false,
        "x": 830,
        "y": 100,
        "wires": []
    },
    {
        "id": "91fb59fd.ee389",
        "type": "inject",
        "z": "80557b2.051a988",
        "name": "heartbeat - node-red1",
        "props": [
            {
                "p": "payload"
            }
        ],
        "repeat": "1",
        "crontab": "",
        "once": false,
        "onceDelay": 0.1,
        "topic": "",
        "payload": "node-red1",
        "payloadType": "str",
        "x": 450,
        "y": 100,
        "wires": [
            [
                "4c4c1848.c96db8"
            ]
        ]
    },
    {
        "id": "bcd0c2e8.2532a8",
        "type": "Kafka Broker",
        "name": "kafka-cluster",
        "hosts": [
            {
                "host": "kafka1",
                "port": 9092
            },
            {
                "host": "kafka2",
                "port": 9092
            },
            {
                "host": "kafka3",
                "port": 9092
            }
        ],
        "hostsEnvVar": "",
        "connectTimeout": "10000",
        "requestTimeout": "30000",
        "autoConnect": "true",
        "idleConnection": "5",
        "reconnectOnIdle": "true",
        "maxAsyncRequests": "10",
        "checkInterval": "10",
        "selfSign": true,
        "usetls": false,
        "useCredentials": false
    }
]