<svg xmlns="http://www.w3.org/2000/svg" width="48" height="48" fill="none" viewBox="0 0 48 48">
    <circle cx="24" cy="24" r="24" fill="#FF6400"/>
    <path fill="#fff" d="M12.831 27.028c0 .001-1.013 3.752 2.303 4.914.171.06.36-.008.459-.16.474-.732 1.235-1.42 2.444-1.904.296-.119.651-.018.807.26.196.35.028.762-.321.902-1.017.408-1.62.986-1.97 1.584-.119.202-.117.453.002.656.488.828 1.386 1.86 2.903 2.09 0 0 1.599.377 3.078-.05.496-.143.835-.599.835-1.114V14.075c0-.658-.451-1.234-1.093-1.377-1.342-.298-3.641-.362-5.296 1.972-.106.15-.128.348-.047.514.39.797 1.083 1.653 2.284 1.765.278.026.58.253.638.527.09.421-.225.803-.642.814-.927.024-2.523-.424-3.436-2.431-.047-.104-.165-.155-.271-.113-1.01.402-2.408 1.4-2.156 3.817-.001 0-1.31.353-2.034 1.966-.562 1.249-.543 2.698.052 3.931.293.607.75 1.214 1.461 1.568zm4.592-1.6c.056-.57.245-1.36.807-2.065.597-.748 1.467-1.235 2.594-1.452.361-.07.703.196.736.563.028.322-.192.613-.51.675-.818.16-1.434.495-1.835.999-.381.477-.505 1.03-.541 1.417-.034.363-.372.636-.763.558-.315-.064-.52-.375-.488-.694zM36.683 21.524c-.725-1.612-2.033-1.965-2.034-1.965.24-2.3-1.012-3.315-2.005-3.754-.183-.082-.396 0-.484.18-.915 1.884-2.447 2.318-3.356 2.301-.286-.005-.552-.178-.64-.45-.14-.434.157-.856.567-.887 1.18-.089 1.878-.888 2.282-1.666.116-.222.097-.493-.051-.696-1.65-2.254-3.912-2.188-5.239-1.893-.642.142-1.094.719-1.094 1.376v20.131c0 .516.34.972.836 1.115 1.48.427 3.078.05 3.078.05 1.53-.233 2.431-1.28 2.916-2.113.109-.188.112-.42.004-.608-.348-.606-.951-1.194-1.978-1.606-.245-.099-.42-.335-.412-.599.013-.456.46-.736.853-.582 1.247.491 2.023 1.198 2.5 1.947.087.137.257.196.41.144 3.353-1.15 2.334-4.924 2.334-4.925.71-.355 1.168-.962 1.46-1.568.596-1.233.615-2.683.053-3.931zm-6.91 4.581c-.25-.071-.422-.302-.447-.56-.038-.387-.164-.93-.54-1.402-.401-.503-1.017-.838-1.836-.998-.317-.062-.538-.353-.509-.675.033-.367.374-.633.736-.563 1.127.217 1.997.703 2.593 1.452.57.713.756 1.513.81 2.085.04.435-.367.789-.808.662z"/>
</svg>
