<svg xmlns="http://www.w3.org/2000/svg" width="20" height="20" fill="none" viewBox="0 0 20 20">
    <path fill="#0C0" d="M13.493 9.855c0-1.592-1.295-2.887-2.887-2.887S7.719 8.263 7.719 9.855s1.295 2.887 2.887 2.887 2.887-1.295 2.887-2.887zm-4.92 0c0-1.121.912-2.033 2.033-2.033 1.12 0 2.033.912 2.033 2.033s-.912 2.033-2.033 2.033-2.034-.912-2.034-2.033zM12.04 14.539l-.044.002-.276-1.12c-.056-.23-.287-.37-.516-.313-.23.057-.37.288-.313.517l.283 1.148c-.516.3-.865.857-.865 1.496 0 .955.776 1.731 1.73 1.731.955 0 1.731-.776 1.731-1.73 0-.955-.776-1.731-1.73-1.731zm0 2.607c-.484 0-.878-.393-.878-.877 0-.379.242-.701.58-.823l.036-.007c.024-.006.046-.015.068-.024.062-.014.127-.022.193-.022.484 0 .877.393.877.876 0 .484-.393.877-.877.877zM17.155 8.826c-.747 0-1.384.477-1.625 1.143l-1.166-.117c-.235-.023-.444.148-.467.382-.024.235.147.444.382.467l1.168.117c.127.83.843 1.47 1.709 1.47.954 0 1.73-.777 1.73-1.732 0-.954-.776-1.73-1.73-1.73zm0 2.607c-.483 0-.877-.393-.877-.877 0-.483.394-.876.878-.876.483 0 .877.393.877.877 0 .483-.394.876-.878.876zM12.442 7.11c.069.04.144.06.219.06.145 0 .286-.074.366-.207l.957-1.596c.124.028.253.045.386.045.954 0 1.73-.777 1.73-1.731 0-.954-.776-1.73-1.73-1.73-.955 0-1.731.776-1.731 1.73 0 .515.227.976.585 1.294l-.929 1.549c-.121.202-.055.464.147.586zm1.928-4.306c.483 0 .877.394.877.877 0 .484-.394.877-.877.877-.484 0-.877-.393-.877-.877 0-.483.393-.877.877-.877zM8.278 7.512c.157-.176.141-.446-.035-.603l-.46-.409c.174-.27.276-.59.276-.933 0-.955-.776-1.731-1.73-1.731-.955 0-1.731.776-1.731 1.73 0 .955.776 1.731 1.73 1.731.3 0 .583-.077.829-.211l.519.461c.08.073.182.108.283.108.118 0 .235-.048.32-.143zM5.451 5.567c0-.484.394-.877.877-.877.484 0 .878.393.878.877 0 .483-.394.877-.877.877-.484 0-.878-.394-.878-.877zM7.09 10.815l-1.812.435c-.284-.568-.87-.96-1.547-.96-.955 0-1.731.777-1.731 1.731 0 .955.776 1.731 1.73 1.731.934 0 1.695-.742 1.728-1.667l1.832-.44c.229-.055.37-.285.315-.514-.055-.23-.285-.37-.514-.316zm-3.36 2.083c-.483 0-.876-.393-.876-.877 0-.483.393-.877.877-.877.483 0 .877.394.877.877 0 .484-.394.877-.877.877z"/>
</svg>
