<svg xmlns="http://www.w3.org/2000/svg" width="24" height="24" fill="none" viewBox="0 0 24 24">
    <path fill="#25282B" fill-rule="evenodd" d="M7.893 19.328H6.472v.434c0 .987.795 1.782 1.782 1.782h10.214c.963 0 1.782-.795 1.782-1.782V6.778c0-.987-.819-1.782-1.782-1.782h-.555v1.421h.555c.192 0 .337.145.337.361v12.984c0 .192-.145.361-.337.361H8.254c-.192 0-.36-.169-.36-.361v-.434zM5.533 2.25h10.213c.963 0 1.782.795 1.782 1.782v12.984c0 .987-.819 1.782-1.782 1.782H5.532c-.987 0-1.782-.795-1.782-1.782V4.032c0-.987.795-1.782 1.782-1.782zm5.082 3.372c.94 0 .94 1.446 0 1.446H7.797c-.94 0-.94-1.446 0-1.446h2.818zm2.866 8.359c.94 0 .94 1.42 0 1.42H7.797c-.94 0-.94-1.42 0-1.42h5.684zm0-2.794c.94 0 .94 1.445 0 1.445H7.797c-.94 0-.94-1.445 0-1.445h5.684zm0-2.77c.94 0 .94 1.42 0 1.42H7.797c-.94 0-.94-1.42 0-1.42h5.684zm2.265-4.746H5.532c-.192 0-.36.145-.36.361v12.984c0 .192.168.361.36.361h10.214c.192 0 .36-.169.36-.361V4.032c0-.216-.168-.36-.36-.36z" clip-rule="evenodd" opacity=".7"/>
</svg>
