<svg xmlns="http://www.w3.org/2000/svg" width="20" height="20" fill="none" viewBox="0 0 20 20">
    <path fill="#FF6400" d="M15.9 4.39c-.298-.299-.772-.299-1.07 0-.3.298-.3.772 0 1.07 2.668 2.67 2.668 7.005 0 9.674-.3.298-.3.772 0 1.07.14.141.333.229.526.229s.386-.07.527-.228c3.265-3.266 3.265-8.567.017-11.815z"/>
    <path fill="#FF6400" d="M13.392 6.882c-.298-.299-.772-.299-1.07 0-.299.298-.299.772 0 1.07 1.281 1.282 1.299 3.389 0 4.67-.299.299-.299.773 0 1.071.14.14.333.229.526.229s.386-.07.527-.229c1.913-1.878 1.896-4.933.017-6.811zM5.175 5.46c.298-.298.298-.772 0-1.07-.299-.299-.773-.299-1.071 0-3.248 3.248-3.248 8.55 0 11.797.14.14.333.228.526.228.194 0 .387-.07.527-.228.299-.298.299-.772 0-1.07-2.65-2.652-2.65-6.988.018-9.656z"/>
    <path fill="#FF6400" d="M7.667 7.953c.299-.299.299-.773 0-1.071-.298-.299-.772-.299-1.07 0-1.88 1.878-1.88 4.933 0 6.811.14.14.333.229.526.229s.386-.07.527-.229c.298-.298.298-.772 0-1.07-1.264-1.282-1.264-3.389.017-4.67zM10.004 11.57c.708 0 1.282-.574 1.282-1.281 0-.708-.574-1.282-1.282-1.282-.708 0-1.281.574-1.281 1.282 0 .707.573 1.281 1.281 1.281z"/>
</svg>
