<svg width="24" height="24" viewBox="0 0 24 24" fill="none" xmlns="http://www.w3.org/2000/svg">
<path d="M20.7255 15.3103L18.8635 13.4482V10.2758C18.8613 8.56323 18.2264 6.91186 17.0807 5.63892C15.9351 4.36597 14.3595 3.56122 12.6566 3.37925V1.99994H11.2773V3.37925C9.57911 3.57284 8.01045 4.38104 6.86708 5.65145C5.72371 6.92186 5.08464 8.5667 5.07038 10.2758V13.4482L3.20831 15.3103C3.141 15.371 3.08765 15.4456 3.05193 15.529C3.01621 15.6123 2.99898 15.7024 3.00141 15.793V17.862C2.99532 17.9542 3.00898 18.0465 3.04148 18.133C3.07398 18.2194 3.12458 18.2979 3.18988 18.3632C3.25517 18.4285 3.33367 18.4791 3.42011 18.5116C3.50654 18.5441 3.59892 18.5578 3.69107 18.5517H8.51865C8.51865 19.4662 8.88195 20.3433 9.52863 20.99C10.1753 21.6366 11.0524 21.9999 11.9669 21.9999C12.8815 21.9999 13.7586 21.6366 14.4052 20.99C15.0519 20.3433 15.4152 19.4662 15.4152 18.5517H20.2428C20.3349 18.5578 20.4273 18.5441 20.5138 18.5116C20.6002 18.4791 20.6787 18.4285 20.744 18.3632C20.8093 18.2979 20.8599 18.2194 20.8924 18.133C20.9249 18.0465 20.9385 17.9542 20.9324 17.862V15.793C20.9349 15.7024 20.9176 15.6123 20.8819 15.529C20.8462 15.4456 20.7929 15.371 20.7255 15.3103ZM11.9669 20.6206C11.4182 20.6206 10.892 20.4027 10.5039 20.0146C10.1159 19.6266 9.89796 19.1004 9.89796 18.5517H14.0359C14.0359 19.1004 13.8179 19.6266 13.4299 20.0146C13.0419 20.4027 12.5157 20.6206 11.9669 20.6206ZM19.5531 17.1724H4.38072V16.0689L6.24279 14.2068C6.3101 14.1461 6.36346 14.0715 6.39917 13.9881C6.43489 13.9048 6.45212 13.8147 6.44969 13.7241V10.2758C6.44969 8.81254 7.03097 7.40921 8.06565 6.37452C9.10033 5.33984 10.5037 4.75856 11.9669 4.75856C13.4302 4.75856 14.8335 5.33984 15.8682 6.37452C16.9029 7.40921 17.4842 8.81254 17.4842 10.2758V13.7241C17.4817 13.8147 17.499 13.9048 17.5347 13.9881C17.5704 14.0715 17.6238 14.1461 17.6911 14.2068L19.5531 16.0689V17.1724Z" fill="#25282B"/>
<path d="M11.9668 20.6206C11.4181 20.6206 10.8919 20.4026 10.5038 20.0146C10.1158 19.6266 9.89786 19.1004 9.89786 18.5516H14.0358C14.0358 19.1004 13.8178 19.6266 13.4298 20.0146C13.0418 20.4026 12.5156 20.6206 11.9668 20.6206Z" fill="#00CC00"/>
</svg>
