<svg width="24" height="24" viewBox="0 0 24 24" fill="none" xmlns="http://www.w3.org/2000/svg">
    <path d="M20.375 3.341H14.31a2.358 2.358 0 0 0-4.256 0H3.998v18.66h16.377V3.34zM11.08 4.685l.114-.53a1.017 1.017 0 0 1 1.987 0l.114.53h1.301v1.243H9.78V4.685h1.301zm7.95 15.974H5.343V4.685h3.093v2.587h7.503V4.685h3.093V20.66z" fill="#ffffff"/>
    <path d="M17.848 10.534H12.55v1.344h5.297v-1.344zM8.767 11.13l-.92-.746L7 11.43l1.935 1.566 2.683-3.12L10.6 9l-1.832 2.13zM17.584 15.922h-5.297v1.343h5.297v-1.343zM9.981 14.515 8.85 15.644 7.72 14.515l-.95.95 1.13 1.13-1.13 1.13.95.95 1.129-1.13 1.131 1.13.95-.95-1.13-1.13 1.13-1.13-.95-.95z" fill="#fff"/>
</svg>
