<?xml version="1.0" encoding="UTF-8"?>
<svg width="1209px" height="645px" viewBox="0 0 1209 645" version="1.1" xmlns="http://www.w3.org/2000/svg" xmlns:xlink="http://www.w3.org/1999/xlink">
    <!-- Generator: Sketch 52.1 (67048) - http://www.bohemiancoding.com/sketch -->
    <title>Group 12</title>
    <desc>Created with Sketch.</desc>
    <g id="Landing" stroke="none" stroke-width="1" fill="none" fill-rule="evenodd">
        <g id="2_Home-Copy" transform="translate(-71.000000, -1634.000000)">
            <g id="Group-12" transform="translate(66.000000, 1634.000000)">
                <text id="Insights-Copy-2" font-family="SFProText-Medium, SF Pro Text" font-size="36" font-weight="400" letter-spacing="0.9" fill="#FFAB00">
                    <tspan x="999.484961" y="139">Insights</tspan>
                </text>
                <text id="Analysis-Copy-2" font-family="SFProText-Medium, SF Pro Text" font-size="36" font-weight="400" letter-spacing="0.9" fill="#FFAB00">
                    <tspan x="999.162695" y="318">Analysis</tspan>
                </text>
                <text id="Reports-Copy-2" font-family="SFProText-Medium, SF Pro Text" font-size="36" font-weight="400" letter-spacing="0.9" fill="#FFAB00">
                    <tspan x="1000.49746" y="502">Reports</tspan>
                </text>
                <g id="Group-16-Copy-5" transform="translate(38.000000, 0.000000)">
                    <g id="Group-15">
                        <path d="M6.5,1.5 L6.5,596" id="Line-2" stroke="#DCDCFA" stroke-linecap="square" stroke-dasharray="4,8"></path>
                        <path d="M900.199514,598.694941 L6.5,598.694941" id="Line-2-Copy-12" stroke="#DCDCFA" stroke-linecap="square" stroke-dasharray="4,8"></path>
                        <polygon id="Path-13-Copy-2" fill="#DCDCFA" transform="translate(904.431493, 598.657494) rotate(90.000000) translate(-904.431493, -598.657494) " points="904.620465 594 898 603.314987 910.862985 603.314987"></polygon>
                        <polygon id="Path-13" fill="#DCDCFA" points="6.62046519 0 0 9.31498727 12.862985 9.31498727"></polygon>
                        <path d="M900.767536,24.0479786 L900.767536,598 L7.27026852,598 C169.943775,568.918186 336.359453,505.528355 506.517303,407.830505 C676.675153,310.132655 808.091897,182.205146 900.767536,24.0479786 Z" id="Path-47" fill-opacity="0.700096241" fill="#302E46"></path>
                    </g>
                </g>
                <text id="What’s-the-best-that-Copy-2" font-family="SFProText-Light, SF Pro Text" font-size="20" font-weight="300" letter-spacing="0.8333333" fill="#FFFFFF">
                    <tspan x="89" y="68">What’s the best that can happen?</tspan>
                </text>
                <text id="What-will-happen-nex-Copy-2" font-family="SFProText-Light, SF Pro Text" font-size="20" font-weight="300" letter-spacing="0.8333333" fill="#FFFFFF">
                    <tspan x="89" y="137">What will happen next?</tspan>
                </text>
                <text id="What-if-these-trends-Copy-2" font-family="SFProText-Light, SF Pro Text" font-size="20" font-weight="300" letter-spacing="0.8333333" fill="#FFFFFF">
                    <tspan x="89" y="206">What if these trends continue?</tspan>
                </text>
                <text id="Why-is-this-happenin-Copy-2" font-family="SFProText-Light, SF Pro Text" font-size="20" font-weight="300" letter-spacing="0.8333333" fill="#FFFFFF">
                    <tspan x="89" y="275">Why is this happening?</tspan>
                </text>
                <text id="What-actions-are-nee-Copy-2" font-family="SFProText-Light, SF Pro Text" font-size="20" font-weight="300" letter-spacing="0.8333333" fill="#FFFFFF">
                    <tspan x="89" y="344">What actions are needed?</tspan>
                </text>
                <text id="Where-exactly-is-the-Copy-2" font-family="SFProText-Light, SF Pro Text" font-size="20" font-weight="300" letter-spacing="0.8333333" fill="#FFFFFF">
                    <tspan x="89" y="423">Where exactly is the problem?</tspan>
                </text>
                <text id="How-many,-how-often,-Copy-2" font-family="SFProText-Light, SF Pro Text" font-size="20" font-weight="300" letter-spacing="0.8333333" fill="#FFFFFF">
                    <tspan x="89" y="492">How many, how often, where?</tspan>
                </text>
                <text id="What-happened?-Copy-2" font-family="SFProText-Light, SF Pro Text" font-size="20" font-weight="300" letter-spacing="0.8333333" fill="#FFFFFF">
                    <tspan x="89" y="561">What happened?</tspan>
                </text>
                <text id="Optimization-Copy-2" font-family="SFProText-Semibold, SF Pro Text" font-size="18" font-weight="500" letter-spacing="1" fill="#FFFFFF">
                    <tspan x="745.074219" y="68">OPTIMIZATION</tspan>
                </text>
                <text id="Predictive-modelling-Copy-2" font-family="SFProText-Semibold, SF Pro Text" font-size="18" font-weight="500" letter-spacing="0.9" fill="#FFFFFF">
                    <tspan x="651.412109" y="137">PREDICTIVE MODELLING</tspan>
                </text>
                <text id="Forecasting-Copy-2" font-family="SFProText-Semibold, SF Pro Text" font-size="18" font-weight="500" letter-spacing="0.9" fill="#FFFFFF">
                    <tspan x="750.355859" y="206">FORECASTING</tspan>
                </text>
                <text id="Statistical-analysis-Copy-2" font-family="SFProText-Semibold, SF Pro Text" font-size="18" font-weight="500" letter-spacing="0.9" fill="#FFFFFF">
                    <tspan x="662.029297" y="275">STATISTICAL ANALYSIS</tspan>
                </text>
                <text id="Alerts-Copy-2" font-family="SFProText-Semibold, SF Pro Text" font-size="18" font-weight="500" letter-spacing="0.9" fill="#FFFFFF">
                    <tspan x="814.419336" y="344">ALERTS</tspan>
                </text>
                <text id="Query-drill-down-Copy-2" font-family="SFProText-Semibold, SF Pro Text" font-size="18" font-weight="500" letter-spacing="0.9" fill="#FFFFFF">
                    <tspan x="692.629297" y="423">QUERY DRILL DOWN</tspan>
                </text>
                <text id="Ad-hoc-reports-Copy-2" font-family="SFProText-Semibold, SF Pro Text" font-size="18" font-weight="500" letter-spacing="0.9" fill="#FFFFFF">
                    <tspan x="715.637305" y="492">AD HOC REPORTS</tspan>
                </text>
                <text id="Standard-reports-Copy-2" font-family="SFProText-Semibold, SF Pro Text" font-size="18" font-weight="500" letter-spacing="0.9" fill="#FFFFFF">
                    <tspan x="686.090234" y="561">STANDARD REPORTS</tspan>
                </text>
                <path d="M1213.94241,234.5 L45,234.5" id="Line-2-Copy-17" stroke="#DCDCFA" stroke-linecap="square" stroke-dasharray="4,8"></path>
                <text id="Degree-of-Intelligen" font-family="SFProText-Light, SF Pro Text" font-size="24" font-weight="300" letter-spacing="0.600000024" fill="#FFFFFF">
                    <tspan x="351" y="640">Degree of Intelligence</tspan>
                </text>
                <text id="Institute’s-Competit" transform="translate(14.500000, 331.500000) rotate(270.000000) translate(-14.500000, -331.500000) " font-family="SFProText-Light, SF Pro Text" font-size="24" font-weight="300" letter-spacing="0.600000024" fill="#FFFFFF">
                    <tspan x="-183" y="340">Institute’s Competitive Advantage</tspan>
                </text>
                <path d="M1213.94241,380.5 L45,380.5" id="Line-2-Copy-18" stroke="#DCDCFA" stroke-linecap="square" stroke-dasharray="4,8"></path>
            </g>
        </g>
    </g>
</svg>