<svg xmlns="http://www.w3.org/2000/svg" width="104" height="104" fill="none" viewBox="0 0 104 104">
    <g filter="url(#filter0_d)">
        <circle cx="52" cy="52" r="40" fill="#fff"/>
    </g>
    <path fill="#25282B" d="M65.06 39.653h-2.307v-3.46c0-.306-.121-.6-.338-.816-.216-.216-.51-.338-.815-.338-.306 0-.6.122-.816.338-.216.216-.338.51-.338.816v3.46H44.297v-3.46c0-.306-.121-.6-.338-.816-.216-.216-.51-.338-.815-.338-.306 0-.6.122-.816.338-.216.216-.338.51-.338.816v3.46h-2.307c-.918 0-1.798.365-2.447 1.014s-1.013 1.529-1.013 2.447v20.763c0 .917.364 1.798 1.013 2.447.65.649 1.53 1.013 2.447 1.013H65.06c.918 0 1.798-.364 2.447-1.013.65-.65 1.014-1.53 1.014-2.447V43.114c0-.918-.365-1.798-1.014-2.447-.649-.65-1.529-1.014-2.447-1.014zm1.154 24.224c0 .306-.122.599-.338.815-.216.217-.51.338-.816.338H39.683c-.306 0-.6-.121-.816-.338-.216-.216-.337-.51-.337-.815v-16.15h27.684v16.15zm0-18.456H38.53v-2.307c0-.306.121-.6.337-.816.217-.216.51-.338.816-.338h2.307v1.154c0 .306.122.599.338.815.216.217.51.338.816.338.306 0 .599-.121.815-.338.217-.216.338-.51.338-.815V41.96h16.15v1.154c0 .306.12.599.337.815.216.217.51.338.816.338.306 0 .6-.121.815-.338.217-.216.338-.51.338-.815V41.96h2.307c.306 0 .6.122.816.338.216.216.338.51.338.816v2.307zm-19.61 6.92c0-.305.122-.599.338-.815.216-.216.51-.338.816-.338h14.995c.306 0 .6.122.816.338.216.216.338.51.338.816 0 .306-.122.599-.338.815-.216.217-.51.338-.816.338H47.758c-.306 0-.6-.121-.816-.338-.216-.216-.338-.51-.338-.815zm0 8.075c0-.306.122-.6.338-.816.216-.216.51-.337.816-.337h14.995c.306 0 .6.121.816.337.216.217.338.51.338.816 0 .306-.122.6-.338.816-.216.216-.51.338-.816.338H47.758c-.306 0-.6-.122-.816-.338-.216-.216-.338-.51-.338-.816zm-5.767 0c0-.306.121-.6.337-.816.217-.216.51-.337.816-.337h2.307c.306 0 .6.121.816.337.216.217.338.51.338.816 0 .306-.122.6-.338.816-.216.216-.51.338-.816.338H41.99c-.306 0-.6-.122-.816-.338-.216-.216-.337-.51-.337-.816zm0-8.074c0-.306.121-.6.337-.816.217-.216.51-.338.816-.338h2.307c.306 0 .6.122.816.338.216.216.338.51.338.816 0 .306-.122.599-.338.815-.216.217-.51.338-.816.338H41.99c-.306 0-.6-.121-.816-.338-.216-.216-.337-.51-.337-.815z"/>
    <defs>
        <filter id="filter0_d" width="103.778" height="103.778" x=".111" y=".111" color-interpolation-filters="sRGB" filterUnits="userSpaceOnUse">
            <feFlood flood-opacity="0" result="BackgroundImageFix"/>
            <feColorMatrix in="SourceAlpha" values="0 0 0 0 0 0 0 0 0 0 0 0 0 0 0 0 0 0 127 0"/>
            <feOffset/>
            <feGaussianBlur stdDeviation="5.945"/>
            <feColorMatrix values="0 0 0 0 0 0 0 0 0 0 0 0 0 0 0 0 0 0 0.12 0"/>
            <feBlend in2="BackgroundImageFix" result="effect1_dropShadow"/>
            <feBlend in="SourceGraphic" in2="effect1_dropShadow" result="shape"/>
        </filter>
    </defs>
</svg>
