<svg xmlns="http://www.w3.org/2000/svg" width="24" height="24" fill="none" viewBox="0 0 24 24">
    <path fill="#25282B" d="M6.128 4.002c-.131.008-.254.066-.344.161-.09.096-.14.223-.14.354v4.808c0 .069.012.136.038.2.025.063.063.12.11.17.049.048.106.087.169.113.063.026.13.04.199.04.068 0 .136-.014.199-.04.063-.026.12-.065.168-.114.048-.048.086-.106.111-.17.026-.063.038-.13.037-.199v-3.3c.1.057.216.079.33.062.114-.016.219-.07.298-.153l.644-.677.645.677c.048.05.106.09.17.118.064.027.133.041.203.041s.138-.014.203-.041c.064-.028.122-.068.17-.118l.638-.671.645.67c.048.051.106.091.17.119.064.027.133.041.203.041s.139-.014.203-.041c.064-.028.122-.068.17-.118L12 5.268l.633.666c.049.05.107.09.17.118.065.027.134.041.204.041.07 0 .138-.014.203-.041.064-.028.121-.068.17-.118l.644-.671.639.67c.048.051.106.091.17.119.064.027.133.041.203.041s.138-.014.203-.041c.064-.028.122-.068.17-.118l.644-.671.639.67c.08.085.186.14.3.156.115.017.233-.006.333-.064v11.41c-.1-.059-.218-.082-.332-.065-.115.017-.221.071-.301.156l-.64.67-.643-.67c-.048-.05-.106-.09-.17-.118-.065-.028-.134-.042-.203-.042-.07 0-.14.014-.203.042-.064.027-.122.067-.17.118l-.64.67-.643-.67c-.049-.05-.106-.09-.17-.118-.065-.028-.134-.042-.203-.042-.07 0-.14.014-.203.042-.065.027-.122.067-.17.118L12 18.19l-.633-.665c-.048-.05-.106-.09-.17-.118-.064-.028-.134-.042-.203-.042-.07 0-.14.014-.203.042-.064.027-.122.067-.17.118l-.645.67-.638-.67c-.048-.05-.106-.09-.17-.118-.065-.028-.134-.042-.203-.042-.07 0-.14.014-.203.042-.064.027-.122.067-.17.118l-.645.676-.644-.676c-.08-.083-.184-.137-.298-.154-.114-.017-.23.006-.33.063v-6.392c.001-.068-.011-.136-.037-.2-.025-.063-.063-.12-.111-.17-.048-.048-.105-.087-.168-.113-.063-.026-.13-.04-.2-.04-.067 0-.135.014-.198.04-.063.026-.12.065-.168.114-.048.048-.086.106-.111.17-.026.063-.038.13-.037.199v7.9c0 .109.034.215.098.303.065.088.155.154.26.187.103.034.215.033.318-.001.104-.034.194-.1.258-.189l.408-.563.59.617c.048.05.106.089.17.116.063.027.131.04.2.04.07 0 .138-.013.202-.04.063-.027.12-.067.169-.116l.639-.671.638.67c.048.051.106.091.17.119.065.027.134.042.203.042.07 0 .14-.015.203-.042.064-.027.122-.068.17-.118l.645-.671.638.67c.049.052.107.093.171.121.065.028.135.042.205.042.07 0 .14-.014.205-.042.065-.028.123-.069.17-.12l.64-.671.644.67c.048.051.106.091.17.119.064.027.133.042.203.042s.139-.015.203-.042c.064-.027.122-.068.17-.118l.639-.671.644.67c.048.051.106.091.17.119.064.027.133.042.203.042s.139-.015.203-.042c.064-.027.122-.068.17-.118l.58-.612.408.558c.063.089.153.155.257.189.104.034.215.035.32.001.103-.033.194-.099.258-.187s.099-.194.099-.303V4.517c0-.11-.035-.216-.1-.304-.063-.088-.154-.153-.258-.187-.104-.033-.215-.033-.319.001-.104.035-.194.1-.257.19l-.408.557-.58-.611c-.048-.05-.106-.091-.17-.119-.064-.027-.133-.041-.203-.041s-.139.014-.203.041c-.064.028-.122.068-.17.119l-.644.67-.64-.67c-.047-.05-.105-.091-.17-.119-.063-.027-.132-.041-.202-.041s-.139.014-.203.041c-.064.028-.122.068-.17.119l-.644.67-.64-.67c-.047-.052-.105-.093-.17-.12C12.14 4.013 12.07 4 12 4c-.07 0-.14.014-.205.042-.064.028-.122.07-.17.12l-.64.671-.643-.67c-.049-.05-.107-.091-.17-.119-.065-.027-.134-.041-.204-.041-.07 0-.138.014-.203.041-.064.028-.122.068-.17.119l-.638.67-.64-.67c-.047-.05-.105-.09-.168-.117-.064-.026-.132-.04-.202-.04-.069 0-.137.014-.2.04-.064.027-.122.067-.17.117l-.59.617-.408-.564c-.051-.07-.12-.128-.198-.165-.079-.038-.166-.055-.253-.05zm8.578 4.116c-.134.012-.257.076-.344.177l-5.497 6.182c-.046.051-.08.11-.104.175-.022.064-.032.132-.028.2.003.068.02.135.05.197.03.06.072.116.123.16.052.046.111.08.176.102.064.022.133.031.2.027.069-.005.136-.023.197-.054.06-.03.115-.073.16-.125l5.496-6.182c.07-.077.114-.174.128-.276.014-.103-.003-.208-.05-.3-.046-.093-.12-.17-.21-.22-.09-.05-.194-.073-.297-.063zm-4.939.177c-.753 0-1.374.621-1.374 1.374 0 .753.621 1.374 1.374 1.374.753 0 1.374-.621 1.374-1.374 0-.753-.621-1.374-1.374-1.374zm0 1.03c.196 0 .344.148.344.344 0 .196-.148.343-.344.343-.196 0-.343-.147-.343-.343 0-.196.147-.344.343-.344zm4.466 3.092c-.753 0-1.374.62-1.374 1.373s.621 1.374 1.374 1.374c.753 0 1.374-.62 1.374-1.373s-.621-1.374-1.374-1.374zm0 1.03c.196 0 .344.148.344.344 0 .195-.148.343-.344.343-.196 0-.343-.148-.343-.344 0-.195.147-.343.343-.343z" opacity=".7"/>
</svg>
