<svg xmlns="http://www.w3.org/2000/svg" width="20" height="20" fill="none" viewBox="0 0 20 20">
    <path fill="#8800FE" fill-rule="evenodd" d="M6.578 16.107H5.393v.361c0 .823.663 1.485 1.486 1.485h8.51c.803 0 1.486-.662 1.486-1.485V5.648c0-.822-.683-1.485-1.485-1.485h-.462v1.185h.462c.16 0 .28.12.28.3v10.82c0 .16-.12.301-.28.301H6.879c-.16 0-.301-.14-.301-.3v-.362zM4.61 1.875h8.511c.803 0 1.486.662 1.486 1.485v10.82c0 .823-.683 1.485-1.486 1.485h-8.51c-.824 0-1.486-.662-1.486-1.485V3.36c0-.823.662-1.485 1.485-1.485zm4.236 2.81c.783 0 .783 1.205 0 1.205H6.497c-.783 0-.783-1.205 0-1.205h2.349zm2.389 6.965c.782 0 .782 1.185 0 1.185H6.497c-.783 0-.783-1.185 0-1.185h4.738zm0-2.328c.782 0 .782 1.205 0 1.205H6.497c-.783 0-.783-1.205 0-1.205h4.738zm0-2.308c.782 0 .782 1.184 0 1.184H6.497c-.783 0-.783-1.184 0-1.184h4.738zm1.886-3.955h-8.51c-.161 0-.302.12-.302.301v10.82c0 .16.14.3.301.3h8.511c.16 0 .301-.14.301-.3V3.36c0-.18-.14-.3-.3-.3z" clip-rule="evenodd"/>
</svg>
