<?xml version="1.0" encoding="UTF-8"?>
<svg width="60px" height="60px" viewBox="0 0 60 60" version="1.1" xmlns="http://www.w3.org/2000/svg" xmlns:xlink="http://www.w3.org/1999/xlink">
    <!-- Generator: Sketch 52.1 (67048) - http://www.bohemiancoding.com/sketch -->
    <title>noun_City_1078322 Copy 2</title>
    <desc>Created with Sketch.</desc>
    <g id="Landing" stroke="none" stroke-width="1" fill="none" fill-rule="evenodd">
        <g id="JEET" transform="translate(-1048.000000, -799.000000)" fill="#DCDCFA" fill-rule="nonzero">
            <g id="Group-5" transform="translate(0.000000, 724.000000)">
                <g id="Group-2">
                    <g id="noun_City_1078322-Copy-2" transform="translate(1048.000000, 75.000000)">
                        <path d="M58.6111111,57.7140741 L55.7985185,57.7140741 L55.7985185,0.804444444 C55.7985185,0.556296296 55.6748148,0.325185185 55.4681481,0.187407407 C55.2622222,0.0503703704 55,0.0259259259 54.7718519,0.120740741 L37.0844444,7.52814815 C36.8088889,7.6437037 36.6296296,7.91333333 36.6296296,8.21185185 L36.6296296,15.6007407 L26.9444444,15.6007407 C26.5355556,15.6007407 26.2037037,15.9318519 26.2037037,16.3414815 L26.2037037,40.7222222 L23.0859259,40.7222222 L23.0859259,9.64814815 C23.0859259,9.23851852 22.7540741,8.90740741 22.3451852,8.90740741 L20.9385185,8.90740741 L20.9385185,0.804444444 C20.9385185,0.394814815 20.6066667,0.0637037037 20.1977778,0.0637037037 L6.80518519,0.0637037037 C6.3962963,0.0637037037 6.06444444,0.394814815 6.06444444,0.804444444 L6.06444444,8.90740741 L4.65851852,8.90740741 C4.24962963,8.90740741 3.91777778,9.23851852 3.91777778,9.64814815 L3.91777778,57.7140741 L0.834074074,57.7140741 C0.425185185,57.7140741 0.0933333333,58.0451852 0.0933333333,58.4548148 C0.0933333333,58.8644444 0.425185185,59.1955556 0.834074074,59.1955556 L58.6118519,59.1955556 C59.0207407,59.1955556 59.3525926,58.8644444 59.3525926,58.4548148 C59.3525926,58.0451852 59.02,57.7140741 58.6111111,57.7140741 Z M38.1111111,8.70444444 L54.317037,1.91777778 L54.317037,57.7140741 L48.8888889,57.7140741 L48.8888889,54.6607407 C50.3511111,54.3222222 51.4474074,53.0155556 51.4474074,51.4518519 C51.4474074,49.6325926 49.9674074,48.1525926 48.1481481,48.1525926 C46.3288889,48.1525926 44.8488889,49.6325926 44.8488889,51.4518519 C44.8488889,53.0155556 45.9451852,54.322963 47.4074074,54.6607407 L47.4074074,57.7140741 L43.1281481,57.7140741 L43.1281481,16.3414815 C43.1281481,15.9318519 42.7962963,15.6007407 42.3874074,15.6007407 L38.1111111,15.6007407 L38.1111111,8.70444444 Z M48.1481481,53.2703704 C47.1459259,53.2703704 46.3303704,52.4540741 46.3303704,51.4518519 C46.3303704,50.4496296 47.1459259,49.6340741 48.1481481,49.6340741 C49.1503704,49.6340741 49.9659259,50.4496296 49.9659259,51.4518519 C49.9659259,52.4540741 49.1503704,53.2703704 48.1481481,53.2703704 Z M41.6466667,17.0822222 L41.6466667,57.7148148 L38.6881481,57.7148148 L38.6881481,53.0681481 C38.6881481,50.8503704 36.8837037,49.0451852 34.6659259,49.0451852 C32.4481481,49.0451852 30.6437037,50.8503704 30.6437037,53.0681481 L30.6437037,57.7148148 L27.6851852,57.7148148 L27.6851852,55.962963 C29.0607407,55.3511111 30.0274074,53.0562963 30.0274074,50.1444444 C30.0274074,47.2318519 29.0607407,44.937037 27.6851852,44.3251852 L27.6851852,17.0822222 L41.6466667,17.0822222 Z M37.2066667,57.7140741 L32.1251852,57.7140741 L32.1251852,53.0674074 C32.1251852,51.6659259 33.2651852,50.5259259 34.6659259,50.5259259 C36.0666667,50.5259259 37.2066667,51.6659259 37.2066667,53.0674074 L37.2066667,57.7140741 Z M26.9444444,45.6385185 C27.5822222,45.6385185 28.5459259,47.4355556 28.5459259,50.142963 C28.5459259,52.8503704 27.5822222,54.6466667 26.9444444,54.6466667 C26.3066667,54.6466667 25.342963,52.8503704 25.342963,50.142963 C25.342963,47.4355556 26.3066667,45.6385185 26.9444444,45.6385185 Z M26.2037037,44.3237037 C24.8281481,44.9355556 23.8614815,47.2303704 23.8614815,50.142963 C23.8614815,53.0548148 24.8281481,55.3496296 26.2037037,55.9614815 L26.2037037,57.7133333 L18.7244444,57.7133333 L18.7244444,54.66 C20.1866667,54.3214815 21.282963,53.0148148 21.282963,51.4511111 C21.282963,50.3096296 20.6992593,49.3022222 19.8155556,48.7096296 C20.4311111,48.1874074 20.8303704,47.4177778 20.8303704,46.5496296 C20.8303704,44.98 19.5533333,43.702963 17.9837037,43.702963 C16.4140741,43.702963 15.137037,44.98 15.137037,46.5496296 C15.137037,47.4185185 15.5362963,48.1874074 16.1518519,48.7096296 C15.2681481,49.3022222 14.6844444,50.3088889 14.6844444,51.4511111 C14.6844444,53.0148148 15.7807407,54.3222222 17.242963,54.66 L17.242963,57.7133333 L11.2496296,57.7133333 L11.2496296,55.2251852 C12.5192593,54.8940741 13.4637037,53.7474074 13.4637037,52.3755556 C13.4637037,51.4 12.982963,50.5407407 12.2518519,50.0022222 C12.7533333,49.5340741 13.0718519,48.8725926 13.0718519,48.1340741 C13.0718519,46.98 12.3,46.0133333 11.2496296,45.6933333 L11.2496296,42.2022222 L26.2037037,42.2022222 L26.2037037,44.3237037 Z M17.9837037,47.9155556 C17.2311111,47.9155556 16.6185185,47.302963 16.6185185,46.5503704 C16.6185185,45.7977778 17.2311111,45.1851852 17.9837037,45.1851852 C18.7362963,45.1851852 19.3488889,45.7977778 19.3488889,46.5503704 C19.3488889,47.302963 18.7362963,47.9155556 17.9837037,47.9155556 Z M17.9837037,49.6340741 C18.9859259,49.6340741 19.8014815,50.4496296 19.8014815,51.4518519 C19.8014815,52.4540741 18.9859259,53.2703704 17.9837037,53.2703704 C16.9814815,53.2703704 16.1659259,52.4540741 16.1659259,51.4518519 C16.1659259,50.4496296 16.9814815,49.6340741 17.9837037,49.6340741 Z M10.5088889,47.0533333 C11.1051852,47.0533333 11.5903704,47.5385185 11.5903704,48.1348148 C11.5903704,48.7311111 11.1051852,49.2162963 10.5088889,49.2162963 C9.91259259,49.2162963 9.42740741,48.7311111 9.42740741,48.1348148 C9.42740741,47.5385185 9.91185185,47.0533333 10.5088889,47.0533333 Z M10.5088889,50.9037037 C11.3214815,50.9037037 11.9822222,51.5644444 11.9822222,52.3762963 C11.9822222,53.1881481 11.3214815,53.8496296 10.5088889,53.8496296 C9.6962963,53.8496296 9.03555556,53.1881481 9.03555556,52.3762963 C9.03555556,51.5644444 9.6962963,50.9037037 10.5088889,50.9037037 Z M7.54592593,1.54518519 L19.457037,1.54518519 L19.457037,8.90740741 L7.54592593,8.90740741 L7.54592593,1.54518519 Z M5.39851852,10.3888889 L21.6044444,10.3888889 L21.6044444,40.7214815 L10.5088889,40.7214815 C10.1,40.7214815 9.76814815,41.0525926 9.76814815,41.4622222 L9.76814815,45.6940741 C8.71777778,46.0140741 7.94592593,46.9807407 7.94592593,48.1348148 C7.94592593,48.8733333 8.26444444,49.5348148 8.76592593,50.002963 C8.03481481,50.5414815 7.55407407,51.4007407 7.55407407,52.3762963 C7.55407407,53.7481481 8.49851852,54.8948148 9.76814815,55.2259259 L9.76814815,57.7140741 L5.39925926,57.7140741 L5.39925926,10.3888889 L5.39851852,10.3888889 Z" id="Shape"></path>
                        <path d="M9.67481481,18.4207407 C10.0837037,18.4207407 10.4155556,18.0896296 10.4155556,17.68 L10.4155556,14.1755556 C10.4155556,13.7659259 10.0837037,13.4348148 9.67481481,13.4348148 C9.26592593,13.4348148 8.93407407,13.7659259 8.93407407,14.1755556 L8.93407407,17.68 C8.93407407,18.0896296 9.26518519,18.4207407 9.67481481,18.4207407 Z" id="Shape"></path>
                        <path d="M13.5014815,18.4207407 C13.9103704,18.4207407 14.2422222,18.0896296 14.2422222,17.68 L14.2422222,14.1755556 C14.2422222,13.7659259 13.9103704,13.4348148 13.5014815,13.4348148 C13.0925926,13.4348148 12.7607407,13.7659259 12.7607407,14.1755556 L12.7607407,17.68 C12.7607407,18.0896296 13.0925926,18.4207407 13.5014815,18.4207407 Z" id="Shape"></path>
                        <path d="M17.3288889,18.4207407 C17.7377778,18.4207407 18.0696296,18.0896296 18.0696296,17.68 L18.0696296,14.1755556 C18.0696296,13.7659259 17.7377778,13.4348148 17.3288889,13.4348148 C16.92,13.4348148 16.5881481,13.7659259 16.5881481,14.1755556 L16.5881481,17.68 C16.5881481,18.0896296 16.9192593,18.4207407 17.3288889,18.4207407 Z" id="Shape"></path>
                        <path d="M9.67481481,25.3474074 C10.0837037,25.3474074 10.4155556,25.0162963 10.4155556,24.6066667 L10.4155556,21.102963 C10.4155556,20.6933333 10.0837037,20.3622222 9.67481481,20.3622222 C9.26592593,20.3622222 8.93407407,20.6933333 8.93407407,21.102963 L8.93407407,24.6066667 C8.93407407,25.0155556 9.26518519,25.3474074 9.67481481,25.3474074 Z" id="Shape"></path>
                        <path d="M13.5014815,25.3474074 C13.9103704,25.3474074 14.2422222,25.0162963 14.2422222,24.6066667 L14.2422222,21.102963 C14.2422222,20.6933333 13.9103704,20.3622222 13.5014815,20.3622222 C13.0925926,20.3622222 12.7607407,20.6933333 12.7607407,21.102963 L12.7607407,24.6066667 C12.7607407,25.0155556 13.0925926,25.3474074 13.5014815,25.3474074 Z" id="Shape"></path>
                        <path d="M17.3288889,25.3474074 C17.7377778,25.3474074 18.0696296,25.0162963 18.0696296,24.6066667 L18.0696296,21.102963 C18.0696296,20.6933333 17.7377778,20.3622222 17.3288889,20.3622222 C16.92,20.3622222 16.5881481,20.6933333 16.5881481,21.102963 L16.5881481,24.6066667 C16.5881481,25.0155556 16.9192593,25.3474074 17.3288889,25.3474074 Z" id="Shape"></path>
                        <path d="M46.2140741,18.4207407 C46.622963,18.4207407 46.9548148,18.0896296 46.9548148,17.68 L46.9548148,14.1755556 C46.9548148,13.7659259 46.622963,13.4348148 46.2140741,13.4348148 C45.8051852,13.4348148 45.4733333,13.7659259 45.4733333,14.1755556 L45.4733333,17.68 C45.4733333,18.0896296 45.8051852,18.4207407 46.2140741,18.4207407 Z" id="Shape"></path>
                        <path d="M50.0414815,18.4207407 C50.4503704,18.4207407 50.7822222,18.0896296 50.7822222,17.68 L50.7822222,14.1755556 C50.7822222,13.7659259 50.4503704,13.4348148 50.0414815,13.4348148 C49.6325926,13.4348148 49.3007407,13.7659259 49.3007407,14.1755556 L49.3007407,17.68 C49.3007407,18.0896296 49.6325926,18.4207407 50.0414815,18.4207407 Z" id="Shape"></path>
                        <path d="M46.2140741,25.3474074 C46.622963,25.3474074 46.9548148,25.0162963 46.9548148,24.6066667 L46.9548148,21.102963 C46.9548148,20.6933333 46.622963,20.3622222 46.2140741,20.3622222 C45.8051852,20.3622222 45.4733333,20.6933333 45.4733333,21.102963 L45.4733333,24.6066667 C45.4733333,25.0155556 45.8051852,25.3474074 46.2140741,25.3474074 Z" id="Shape"></path>
                        <path d="M50.0414815,25.3474074 C50.4503704,25.3474074 50.7822222,25.0162963 50.7822222,24.6066667 L50.7822222,21.102963 C50.7822222,20.6933333 50.4503704,20.3622222 50.0414815,20.3622222 C49.6325926,20.3622222 49.3007407,20.6933333 49.3007407,21.102963 L49.3007407,24.6066667 C49.3007407,25.0155556 49.6325926,25.3474074 50.0414815,25.3474074 Z" id="Shape"></path>
                        <path d="M46.2140741,32.2740741 C46.622963,32.2740741 46.9548148,31.942963 46.9548148,31.5333333 L46.9548148,28.0288889 C46.9548148,27.6192593 46.622963,27.2881481 46.2140741,27.2881481 C45.8051852,27.2881481 45.4733333,27.6192593 45.4733333,28.0288889 L45.4733333,31.5333333 C45.4733333,31.942963 45.8051852,32.2740741 46.2140741,32.2740741 Z" id="Shape"></path>
                        <path d="M50.0414815,32.2740741 C50.4503704,32.2740741 50.7822222,31.942963 50.7822222,31.5333333 L50.7822222,28.0288889 C50.7822222,27.6192593 50.4503704,27.2881481 50.0414815,27.2881481 C49.6325926,27.2881481 49.3007407,27.6192593 49.3007407,28.0288889 L49.3007407,31.5333333 C49.3007407,31.942963 49.6325926,32.2740741 50.0414815,32.2740741 Z" id="Shape"></path>
                        <path d="M46.2140741,39.2014815 C46.622963,39.2014815 46.9548148,38.8703704 46.9548148,38.4607407 L46.9548148,34.9555556 C46.9548148,34.5459259 46.622963,34.2148148 46.2140741,34.2148148 C45.8051852,34.2148148 45.4733333,34.5459259 45.4733333,34.9555556 L45.4733333,38.46 C45.4733333,38.8703704 45.8051852,39.2014815 46.2140741,39.2014815 Z" id="Shape"></path>
                        <path d="M50.0414815,39.2014815 C50.4503704,39.2014815 50.7822222,38.8703704 50.7822222,38.4607407 L50.7822222,34.9555556 C50.7822222,34.5459259 50.4503704,34.2148148 50.0414815,34.2148148 C49.6325926,34.2148148 49.3007407,34.5459259 49.3007407,34.9555556 L49.3007407,38.46 C49.3007407,38.8703704 49.6325926,39.2014815 50.0414815,39.2014815 Z" id="Shape"></path>
                        <path d="M46.2140741,46.1274074 C46.622963,46.1274074 46.9548148,45.7962963 46.9548148,45.3866667 L46.9548148,41.8822222 C46.9548148,41.4725926 46.622963,41.1414815 46.2140741,41.1414815 C45.8051852,41.1414815 45.4733333,41.4725926 45.4733333,41.8822222 L45.4733333,45.3866667 C45.4733333,45.7962963 45.8051852,46.1274074 46.2140741,46.1274074 Z" id="Shape"></path>
                        <path d="M31.3844444,46.1274074 L37.9474074,46.1274074 C38.3562963,46.1274074 38.6881481,45.7962963 38.6881481,45.3866667 C38.6881481,44.977037 38.3562963,44.6459259 37.9474074,44.6459259 L31.3844444,44.6459259 C30.9755556,44.6459259 30.6437037,44.977037 30.6437037,45.3866667 C30.6437037,45.7962963 30.9748148,46.1274074 31.3844444,46.1274074 Z" id="Shape"></path>
                        <path d="M31.3844444,42.0807407 L37.9474074,42.0807407 C38.3562963,42.0807407 38.6881481,41.7496296 38.6881481,41.34 C38.6881481,40.9303704 38.3562963,40.5992593 37.9474074,40.5992593 L31.3844444,40.5992593 C30.9755556,40.5992593 30.6437037,40.9303704 30.6437037,41.34 C30.6437037,41.7496296 30.9748148,42.0807407 31.3844444,42.0807407 Z" id="Shape"></path>
                        <path d="M31.3844444,38.0333333 L37.9474074,38.0333333 C38.3562963,38.0333333 38.6881481,37.7022222 38.6881481,37.2925926 C38.6881481,36.882963 38.3562963,36.5518519 37.9474074,36.5518519 L31.3844444,36.5518519 C30.9755556,36.5518519 30.6437037,36.882963 30.6437037,37.2925926 C30.6437037,37.7022222 30.9748148,38.0333333 31.3844444,38.0333333 Z" id="Shape"></path>
                        <path d="M31.3844444,33.9851852 L37.9474074,33.9851852 C38.3562963,33.9851852 38.6881481,33.6540741 38.6881481,33.2444444 C38.6881481,32.8348148 38.3562963,32.5037037 37.9474074,32.5037037 L31.3844444,32.5037037 C30.9755556,32.5037037 30.6437037,32.8348148 30.6437037,33.2444444 C30.6437037,33.6540741 30.9748148,33.9851852 31.3844444,33.9851852 Z" id="Shape"></path>
                        <path d="M31.3844444,29.9377778 L37.9474074,29.9377778 C38.3562963,29.9377778 38.6881481,29.6066667 38.6881481,29.197037 C38.6881481,28.7874074 38.3562963,28.4562963 37.9474074,28.4562963 L31.3844444,28.4562963 C30.9755556,28.4562963 30.6437037,28.7874074 30.6437037,29.197037 C30.6437037,29.6066667 30.9748148,29.9377778 31.3844444,29.9377778 Z" id="Shape"></path>
                        <path d="M31.3844444,25.8903704 L37.9474074,25.8903704 C38.3562963,25.8903704 38.6881481,25.5592593 38.6881481,25.1496296 C38.6881481,24.74 38.3562963,24.4088889 37.9474074,24.4088889 L31.3844444,24.4088889 C30.9755556,24.4088889 30.6437037,24.74 30.6437037,25.1496296 C30.6437037,25.5592593 30.9748148,25.8903704 31.3844444,25.8903704 Z" id="Shape"></path>
                        <path d="M31.3844444,21.842963 L37.9474074,21.842963 C38.3562963,21.842963 38.6881481,21.5118519 38.6881481,21.1022222 C38.6881481,20.6925926 38.3562963,20.3614815 37.9474074,20.3614815 L31.3844444,20.3614815 C30.9755556,20.3614815 30.6437037,20.6925926 30.6437037,21.1022222 C30.6437037,21.5118519 30.9748148,21.842963 31.3844444,21.842963 Z" id="Shape"></path>
                        <path d="M50.0414815,46.1274074 C50.4503704,46.1274074 50.7822222,45.7962963 50.7822222,45.3866667 L50.7822222,41.8822222 C50.7822222,41.4725926 50.4503704,41.1414815 50.0414815,41.1414815 C49.6325926,41.1414815 49.3007407,41.4725926 49.3007407,41.8822222 L49.3007407,45.3866667 C49.3007407,45.7962963 49.6325926,46.1274074 50.0414815,46.1274074 Z" id="Shape"></path>
                        <path d="M9.67481481,32.2740741 C10.0837037,32.2740741 10.4155556,31.942963 10.4155556,31.5333333 L10.4155556,28.0288889 C10.4155556,27.6192593 10.0837037,27.2881481 9.67481481,27.2881481 C9.26592593,27.2881481 8.93407407,27.6192593 8.93407407,28.0288889 L8.93407407,31.5333333 C8.93407407,31.942963 9.26518519,32.2740741 9.67481481,32.2740741 Z" id="Shape"></path>
                        <path d="M13.5014815,32.2740741 C13.9103704,32.2740741 14.2422222,31.942963 14.2422222,31.5333333 L14.2422222,28.0288889 C14.2422222,27.6192593 13.9103704,27.2881481 13.5014815,27.2881481 C13.0925926,27.2881481 12.7607407,27.6192593 12.7607407,28.0288889 L12.7607407,31.5333333 C12.7607407,31.942963 13.0925926,32.2740741 13.5014815,32.2740741 Z" id="Shape"></path>
                        <path d="M17.3288889,32.2740741 C17.7377778,32.2740741 18.0696296,31.942963 18.0696296,31.5333333 L18.0696296,28.0288889 C18.0696296,27.6192593 17.7377778,27.2881481 17.3288889,27.2881481 C16.92,27.2881481 16.5881481,27.6192593 16.5881481,28.0288889 L16.5881481,31.5333333 C16.5881481,31.942963 16.9192593,32.2740741 17.3288889,32.2740741 Z" id="Shape"></path>
                        <path d="M9.67481481,38.902963 C10.0837037,38.902963 10.4155556,38.5718519 10.4155556,38.1622222 L10.4155556,34.6577778 C10.4155556,34.2481481 10.0837037,33.917037 9.67481481,33.917037 C9.26592593,33.917037 8.93407407,34.2481481 8.93407407,34.6577778 L8.93407407,38.1622222 C8.93407407,38.5711111 9.26518519,38.902963 9.67481481,38.902963 Z" id="Shape"></path>
                        <path d="M13.5014815,38.902963 C13.9103704,38.902963 14.2422222,38.5718519 14.2422222,38.1622222 L14.2422222,34.6577778 C14.2422222,34.2481481 13.9103704,33.917037 13.5014815,33.917037 C13.0925926,33.917037 12.7607407,34.2481481 12.7607407,34.6577778 L12.7607407,38.1622222 C12.7607407,38.5711111 13.0925926,38.902963 13.5014815,38.902963 Z" id="Shape"></path>
                        <path d="M17.3288889,38.902963 C17.7377778,38.902963 18.0696296,38.5718519 18.0696296,38.1622222 L18.0696296,34.6577778 C18.0696296,34.2481481 17.7377778,33.917037 17.3288889,33.917037 C16.92,33.917037 16.5881481,34.2481481 16.5881481,34.6577778 L16.5881481,38.1622222 C16.5881481,38.5711111 16.9192593,38.902963 17.3288889,38.902963 Z" id="Shape"></path>
                    </g>
                </g>
            </g>
        </g>
    </g>
</svg>