<svg xmlns="http://www.w3.org/2000/svg" xmlns:xlink="http://www.w3.org/1999/xlink" width="774" height="550" fill="none" viewBox="0 0 774 550">
    <path fill="#FFB400" d="M468.469 205.064v.802c-.047 4.634-.322 9.257-.824 13.868.002.028.002.056 0 .084-.04.383-.084.762-.128 1.145-.075.648-.154 1.291-.242 1.938-1.027 7.883-2.726 15.663-5.079 23.256-3.153 10.261-7.609 20.074-13.261 29.199-1.738 2.79-3.59 5.491-5.555 8.102-1.048 1.383-2.119 2.735-3.224 4.066-.776.931-1.566 1.847-2.371 2.749l-.502.555c-4.234 4.649-8.798 8.986-13.656 12.978-7.93 6.573-16.468 12.291-25.142 17.595-.493.304-.991.603-1.489.881-.034.025-.071.047-.11.066-11.789 7.128-24.014 13.56-36.608 18.71-13.789 5.652-28.027 9.762-42.635 11.559-20.362 2.502-40.97.467-61.209-3.031-16.831-2.892-33.459-6.865-49.78-11.894l-2.687-.842c-1.392-.443-2.783-.895-4.172-1.356-8.391-2.776-16.688-5.86-24.89-9.252-20.602-8.485-40.283-19.052-58.737-31.538-2.35-1.58-4.665-3.195-6.947-4.846-3.19-2.296-6.341-4.66-9.454-7.092l-1.921-1.489c-8.147-6.38-15.78-13.39-22.829-20.965-9.48-10.318-17.581-21.957-22.907-35.243-.84-2.088-1.61-4.216-2.309-6.383l-.066-.216c-.352-1.102-.678-2.203-.978-3.348-.44-1.639-.827-3.299-1.158-4.978-.071-.322-.133-.644-.19-.97-1.053-5.653-1.518-11.4-1.388-17.15.11-5.037.7-10.052 1.762-14.978 1.087-5.106 2.762-10.068 4.992-14.789 2.015-4.244 4.582-8.204 7.634-11.775 2.145-2.497 4.558-4.752 7.194-6.723 4.78-3.559 10.08-6.04 15.573-8 2.582-.925 5.198-1.736 7.828-2.489 1.864-.537 3.736-1.048 5.6-1.551l5.498-1.484c3.524-.961 7.048-1.947 10.52-3.014 9.462-2.889 18.736-6.387 27.313-11.603 1.357-.824 2.74-1.727 4.123-2.696 1.762-1.225 3.498-2.555 5.216-3.992 1.736-1.453 3.436-3.008 5.058-4.656.251-.256.497-.511.744-.771 1.322-1.392 2.604-2.85 3.793-4.366.582-.74 1.145-1.493 1.683-2.26.744-1.061 1.449-2.14 2.101-3.25 3.269-5.551 5.287-11.675 5.049-18.129-.035-1.063-.131-2.124-.287-3.176-.572-3.89-1.123-7.687-1.528-11.401-1.701-15.362-.983-29.291 10.546-42.38C190.768 2.272 213.266-1.045 233.747.255c59.212 3.744 113.116 37.551 160.487 77.798 4.097 3.478 8.144 7.002 12.141 10.573 1.008.899 2.016 1.803 3.027 2.714 7.489 6.745 14.863 13.74 21.731 21.234.555.608 1.11 1.216 1.657 1.828.335.379.674.753 1.004 1.136 2.141 2.423 4.219 4.905 6.234 7.446 5.397 6.744 10.163 13.97 14.238 21.586 6.239 11.952 10.464 24.853 12.502 38.181.767 4.84 1.271 9.718 1.511 14.613.075 1.44.124 2.885.15 4.326v1.383c.044.67.044 1.322.04 1.991z" opacity=".1"/>
    <path fill="#3F3D56" d="M219.562 197.676l-7.048 125.46 7.048.093 5.727-127.315-5.727 1.762z"/>
    <path fill="#FFB400" d="M193.57 261.242h-87.226v18.943h87.226v-18.943z"/>
    <path fill="#3F3D56" d="M199.297 277.977v11.894h-90.103c-3.189-2.297-6.341-4.661-9.454-7.093v-4.801h99.557z"/>
    <path fill="#35323E" d="M217.287 250.902c-.247 1.141-.569 2.269-.908 3.392-1 3.247-2.203 6.45-2.436 9.824-.313 4.459.881 9.644-2.203 12.882-.793.837-1.828 1.462-2.537 2.357-.109.14-.209.287-.3.44-.634 1.049-.709 2.326-.718 3.524.008 2.556.174 5.109.498 7.644 1.044 8.722 3.106 17.463.396 25.696-.49 1.428-1.063 2.827-1.713 4.19-1.322 2.907-2.762 5.775-3.194 8.925-.317 2.335-.22 4.74-.238 7.115-1.392-.444-2.783-.896-4.172-1.357-8.391-2.776-16.687-5.859-24.89-9.252.022-.119.044-.242.062-.361.63-3.921-.234-7.929-1.282-11.753-2.203-8.102-5.322-16.124-7.168-24.283-.743-3.186-1.231-6.427-1.458-9.691-.053-.732-.084-1.467-.088-2.203-.022-.96 0-1.921.039-2.89.093-1.934.177-4.229-1.37-5.405-.85-.639-1.973-.749-2.964-1.137-1.912-.744-3.221-2.471-4.736-3.855-.723-.701-1.606-1.216-2.572-1.5-.966-.284-1.987-.328-2.975-.13-9.903 2.269-17.18 10.67-26.396 14.917-.357.167-.714.326-1.075.476-1.192.436-2.327 1.016-3.379 1.727-.74.513-1.276 1.269-1.516 2.136-.233.934-.031 1.912.084 2.872.185 1.562.118 3.143-.198 4.683-.12.597-.277 1.186-.472 1.762-.352 1.045-.823 2.067-1.273 3.084-2.349-1.58-4.665-3.195-6.947-4.846-3.189-2.296-6.341-4.661-9.454-7.092l-1.89-1.52c-8.147-6.38-15.78-13.39-22.828-20.965.938-2.643 2.295-5.102 2.947-7.811.37-1.555.506-3.172 1.017-4.683.59-1.566 1.41-3.036 2.432-4.361 3.746-5.224 8.32-9.802 13.542-13.551 5.459-3.912 11.763-7.049 16.675-11.489 1.993-1.745 3.711-3.782 5.097-6.04.083-.136.163-.282.233-.44.383-.798.649-1.647.789-2.52.352-1.974.299-4.141.475-6.036 5.984 1.036 12.084 1.22 18.12.547 7.026-.789 13.899-2.741 20.925-3.498.529-.062 1.062-.11 1.595-.154 2.251-.181 4.506-.221 6.766-.194 1.89 0 3.78.083 5.67.145l20.807.705c2.304.079 4.656.167 6.801 1.009 2.547 1 4.586 2.991 6.221 5.18.207.282.414.564.608.855 1.345 1.962 2.423 4.094 3.207 6.339.084.23.163.441.238.692.198.612.37 1.229.524 1.855.119.489.225.978.322 1.471.484 2.441.771 4.934 1.537 7.291.053.172.11.344.172.511.921 2.582 2.449 4.894 3.604 7.375.832 1.795 1.467 3.675 1.894 5.608.863 3.88.881 7.9.053 11.788z"/>
    <path fill="#FFB400" d="M154.044 93.25c-1.859-1.48-4.555-.396-6.731.56-1.825.806-3.703 1.485-5.621 2.031-.393.151-.818.196-1.234.128-.881-.211-1.251-1.255-1.907-1.89-1.141-1.097-3.009-.837-4.48-.242-1.472.595-2.926 1.454-4.503 1.321-1.683-.132-3.145-1.374-4.846-1.414-2.995-.07-5.511 3.621-8.343 2.644-1.727-.595-3.084-2.842-4.785-2.203-1.321.502-1.44 2.33-2.238 3.524-.938 1.392-2.766 1.784-4.33 2.401-4.93 1.947-8.194 7.441-7.55 12.701.356 2.903 1.761 5.564 2.691 8.335 2.758 8.057 1.811 17.145 5.286 24.916.441-.414.688-.568 1.115-.978-1.099 2.28-1.311 4.886-.595 7.313.366 1.221.961 2.357 1.41 3.551.467 1.339.843 2.708 1.128 4.097l3.832 16.908c1.498 6.608 3 13.216 3.26 19.982.162 4.4-.175 8.804-1.004 13.128 6.943-1.149 13.295-4.229 20.331-4.189 2.581 0 5.141.44 7.7.793 7.462 1.044 14.99 1.555 22.525 1.529 1.172.066 2.345-.098 3.454-.485.969-.414 1.762-1.15 2.678-1.683 1.793-1.057 3.965-1.322 6.031-1.322 9.423-.171 18.502 3.278 27.864 4.494 3.696-7.758 3.916-17.053 1.079-25.163-.841-2.41-1.973-4.758-2.308-7.291-.135-1.557-.17-3.122-.106-4.683-.015-3.998-.735-7.962-2.128-11.71-.546-1.467-1.202-2.96-1.145-4.524.057-1.564.828-3.022 1.586-4.405 1.537-2.82 3.084-5.666 5.255-8.045 2.225-2.458 5.009-4.33 7.763-6.167l6.797-4.564c-.929-5.872-2.128-12.057-4.617-17.458-2.489-5.401-6.211-10.366-11.247-13.525-1.697-1.021-3.474-1.905-5.312-2.643-2.573-1.084-5.252-2.04-8.04-2.203-3.172-.18-6.296.67-9.428 1.198-9.859 1.661-21.463 1.459-29.287-4.766z"/>
    <path fill="#3F3D56" d="M228.373 195.157l-3.233 4.084-6.097 7.696-7.049 8.895-1.969 2.484h-3.819l-94.579.11-59.23.066h-2.643c-.353-1.101-.679-2.202-.978-3.348-.44-1.638-.827-3.298-1.159-4.978-.07-.321-.132-.643-.19-.969l21.49-14.049 8.08-.044 24.714-.141 13.802-.079h4.101l9.198-.048 70.107-.401 3.586-.022h1.555l4.119-.022 15.326-.088 2.943-1.119.216.229 1.709 1.744z"/>
    <path fill="#504F60" d="M227.051 192.953l-.366.441-2.405 2.832-4.952 5.846-10.383 12.243-91.984-2.348-69.362-1.762c-.071-.322-.133-.644-.19-.97-1.053-5.653-1.518-11.4-1.388-17.15l7.692-3.938 1.762-.907 13.714-7.049 12.036-6.168 31.392 4.08 6.952.903 3.145.405 4.604.599.388.053 72.19 9.362 7.978 1.035 4.683.608 14.432 1.876.062.009z"/>
    <path fill="#3F3D56" d="M212.073 214.102l-.075 1.731-.441 9.775-2.37 53.746-.502 11.617-1.322 29.886-.744 16.881-2.687-.842c-1.392-.443-2.783-.895-4.172-1.356l6.445-117.183.136-2.458 2.837-.881 2.895-.916zM52.6 213.969l-.199 4.524-.29 6.608c-.84-2.088-1.61-4.216-2.31-6.383l-.065-.216c-.353-1.101-.679-2.203-.978-3.348l3.841-1.185z"/>
    <path fill="#A1616A" d="M167.798 147.361c11.192 0 20.265-12.229 20.265-27.313 0-15.085-9.073-27.314-20.265-27.314s-20.265 12.229-20.265 27.314c0 15.084 9.073 27.313 20.265 27.313z"/>
    <path fill="#000" d="M167.798 147.361c11.192 0 20.265-12.229 20.265-27.313 0-15.085-9.073-27.314-20.265-27.314s-20.265 12.229-20.265 27.314c0 15.084 9.073 27.313 20.265 27.313z" opacity=".1"/>
    <path fill="#A1616A" d="M170.663 131.725c15.571 0 28.194-12.623 28.194-28.195 0-15.571-12.623-28.194-28.194-28.194s-28.194 12.623-28.194 28.194c0 15.572 12.623 28.195 28.194 28.195z"/>
    <path fill="#464353" d="M171.222 60.073c-1.721.137-3.43.398-5.114.78-4.459 1.083-8.313 3.488-12.067 5.85-1.683 1.061-3.414 2.167-4.458 3.727-1.877 2.797-1.15 6.357-2.203 9.462-.546 1.595-1.55 3.027-2.401 4.512-2.339 4.07-3.563 8.541-4.766 12.969-.247.916-.317 2.159.683 2.511.576.12 1.175.052 1.709-.194 3.159-1.044 7.172-1.343 9.516.775 2.343 2.119 2.145 5.877 4.934 7.49 3.193 1.863 8.18-.388 11.079 1.81 1.242.943 1.692 2.454 2.709 3.591 2.37 2.643 6.93 2.515 10.723 1.982 2.176-.308 4.846-.515 6.167 1.013.635.723.815 1.714 1.551 2.366 1.322 1.181 3.74.581 5.031-.63 1.291-1.212 1.908-2.85 2.982-4.212 2.093-2.643 5.772-4.083 7.93-6.696 1.806-2.202 2.353-4.96 2.846-7.621l1.837-9.864c.745-4 1.423-8.37-.828-11.894-.802-1.269-1.952-2.361-2.643-3.674-.463-.881-.723-1.81-1.26-2.643-.638-.868-1.399-1.637-2.26-2.282l-4.348-3.6c-1.487-1.3-3.077-2.48-4.754-3.524-6.207-3.617-15.502-2.665-22.595-2.004z"/>
    <path fill="#A1616A" d="M78.356 132.701c-1.044 1.11-2.009 2.308-3.128 3.348-.984.875-2.013 1.699-3.084 2.467-1.726 1.292-3.415 2.63-5.066 4.013-1.722 1.362-3.28 2.918-4.643 4.639-2.352 3.159-3.467 7.088-5.67 10.353-1.947 2.894-4.691 5.18-6.67 8.053-.867 1.207-1.512 2.561-1.902 3.995-.292 1.389-.424 2.806-.392 4.225-.04 2.326-.075 4.679.4 6.956.476 2.278 1.52 4.516 3.309 6.009 1.66 1.388 3.806 2.026 5.907 2.555 1.084.269 2.256.52 3.287.093.754-.381 1.409-.934 1.912-1.613l5.361-6.167c3.586-4.141 7.313-8.37 12.234-10.793 1.542-.754 3.167-1.322 4.713-2.053 6.556-3.159 11.19-9.626 12.987-16.675.441-1.722.723-3.48 1.01-5.237l.775-4.82c.06-.242.06-.494 0-.736-.122-.271-.317-.503-.564-.669-3.735-3.016-7.231-6.315-10.459-9.868-.766-.846-1.484-2.005-2.37-2.714-1.11-.881-1.026-.815-2.361 0-2.053 1.3-3.93 2.859-5.586 4.639z"/>
    <path fill="#3F3D56" d="M115.031 164.771c-.044-.102-.109-.195-.19-.271-.082-.077-.177-.136-.282-.175-.105-.039-.216-.056-.328-.051-.111.006-.22.034-.321.083-.1.048-.19.117-.263.201-.073.084-.129.182-.163.288-.034.107-.047.219-.037.33.01.111.042.219.095.317l-.44.216 13.136 26.926 2.375-1.159-13.137-26.943-.445.238z"/>
    <path fill="#000" d="M78.356 132.701c-1.044 1.11-2.009 2.308-3.128 3.348-.984.875-2.013 1.699-3.084 2.467-1.726 1.292-3.415 2.63-5.066 4.013-1.722 1.362-3.28 2.918-4.643 4.639-2.352 3.159-3.467 7.088-5.67 10.353-1.947 2.894-4.691 5.18-6.67 8.053-.867 1.207-1.512 2.561-1.902 3.995-.292 1.389-.424 2.806-.392 4.225-.04 2.326-.075 4.679.4 6.956.476 2.278 1.52 4.516 3.309 6.009 1.66 1.388 3.806 2.026 5.907 2.555 1.084.269 2.256.52 3.287.093.754-.381 1.409-.934 1.912-1.613l5.361-6.167c3.586-4.141 7.313-8.37 12.234-10.793 1.542-.754 3.167-1.322 4.713-2.053 6.556-3.159 11.19-9.626 12.987-16.675.441-1.722.723-3.48 1.01-5.237l.775-4.82c.06-.242.06-.494 0-.736-.122-.271-.317-.503-.564-.669-3.735-3.016-7.231-6.315-10.459-9.868-.766-.846-1.484-2.005-2.37-2.714-1.11-.881-1.026-.815-2.361 0-2.053 1.3-3.93 2.859-5.586 4.639z" opacity=".04"/>
    <path fill="#A1616A" d="M230.227 182.321c-.044 2.81-.154 5.705-1.322 8.268-.502 1.111-1.282 2.203-2.449 2.569-.707.163-1.438.19-2.154.079-8.643-.76-17.352-.069-25.767 2.044 2.246-4.493.956-9.881 1.577-14.868.172-1.361.484-2.7.603-4.066.441-4.846-1.634-9.551-2.586-14.335-.826-4.141-.826-8.405 0-12.547.162-1.066.529-2.09 1.08-3.017.645-.902 1.493-1.64 2.475-2.154 3.569-2.031 7.776-2.265 11.785-1.996 2.7.181 8.114-.075 10.366 1.586 2.462 1.819 3.242 7.929 3.907 10.753.996 4.331 1.673 8.729 2.027 13.159.431 4.828.524 9.679.458 14.525z"/>
    <path fill="#fff" d="M72.424 192.078l15.86 10.573 71.366-2.643-47.137-7.93h-40.09z"/>
    <path fill="#FFB400" d="M93.333 108.069c-2.603 2.295-4.81 5-7.278 7.445-3.383 3.357-7.229 6.212-11.057 9.053 1.373.384 2.622 1.118 3.626 2.129 1.004 1.012 1.728 2.267 2.101 3.642.167.648.251 1.322.44 1.956.441 1.503 1.41 2.798 2.45 3.965 4.467 5.036 10.718 8.762 13.353 14.978.085.303.272.567.528.749.215.095.453.123.683.08 2.383-.251 4.207-2.172 5.727-4.04 3.172-3.965 5.925-8.344 7.489-13.181s1.815-10.185.11-14.978c-.85-2.388-2.163-4.582-3.467-6.754-1.142-1.9-2.282-3.797-3.418-5.691-.595-1-1.353-3.031-2.52-3.525-2.52-1.083-7.15 2.556-8.767 4.172zM223.09 136.546l3.749 8.81c-4.081-1.426-8.443-1.86-12.726-1.266-4.282.594-8.361 2.198-11.9 4.68-2.137 1.529-4.097 3.45-5.062 5.89-.476.091-.968.045-1.42-.132-.451-.177-.843-.478-1.131-.868-.564-.791-.891-1.726-.942-2.696-.349-3.383.933-6.7 2.202-9.863.591-1.481 1.198-2.992 2.247-4.194 1.048-1.203 2.44-1.996 3.833-2.745 4.441-2.456 9.092-4.511 13.898-6.141 2.027-.656 4.15-.643 5.287 1.251 1.317 2.26.934 4.868 1.965 7.274z"/>
    <path fill="#A1616A" d="M72.514 162.977c.938.749 1.762 1.635 2.727 2.349 1.02.708 2.106 1.317 3.242 1.819l4.343 2.088c1.347.7 2.755 1.272 4.208 1.709 1.859.498 3.81.547 5.678 1.009 2.357.582 4.511 1.793 6.833 2.494 2.321.7 5.04.815 6.978-.644 1.211-.911 2.128-2.418 3.63-2.643.969-.128 1.903.339 2.767.793l11.304 5.943c1.524.802 3.136 1.692 3.934 3.22.797 1.529.26 3.851-1.419 4.247-.585.067-1.173.101-1.762.101-.582.071-1.216.415-1.295 1-.003.364.093.722.277 1.036.507 1.163.657 2.555.066 3.683-.59 1.127-2.039 1.828-3.198 1.321.198 1.705-1.656 2.899-3.308 3.353-4.168 1.141-8.586.44-12.846-.282-1.674-.282-3.375-.573-4.9-1.322-.73-.357-1.409-.815-2.149-1.145-2.03-.903-4.34-.784-6.56-.745-10.268.181-20.45-1.722-30.546-3.617-1.873-.352-3.798-.726-5.397-1.762-3.084-2.009-4.229-6.132-3.722-9.78.506-3.647 2.357-6.951 4.176-10.158l2.357-4.155c.308-.636.74-1.205 1.269-1.674 3.467-2.647 10.343-.625 13.313 1.762z"/>
    <path fill="#000" d="M72.514 162.977c.938.749 1.762 1.635 2.727 2.349 1.02.708 2.106 1.317 3.242 1.819l4.343 2.088c1.347.7 2.755 1.272 4.208 1.709 1.859.498 3.81.547 5.678 1.009 2.357.582 4.511 1.793 6.833 2.494 2.321.7 5.04.815 6.978-.644 1.211-.911 2.128-2.418 3.63-2.643.969-.128 1.903.339 2.767.793l11.304 5.943c1.524.802 3.136 1.692 3.934 3.22.797 1.529.26 3.851-1.419 4.247-.585.067-1.173.101-1.762.101-.582.071-1.216.415-1.295 1-.003.364.093.722.277 1.036.507 1.163.657 2.555.066 3.683-.59 1.127-2.039 1.828-3.198 1.321.198 1.705-1.656 2.899-3.308 3.353-4.168 1.141-8.586.44-12.846-.282-1.674-.282-3.375-.573-4.9-1.322-.73-.357-1.409-.815-2.149-1.145-2.03-.903-4.34-.784-6.56-.745-10.268.181-20.45-1.722-30.546-3.617-1.873-.352-3.798-.726-5.397-1.762-3.084-2.009-4.229-6.132-3.722-9.78.506-3.647 2.357-6.951 4.176-10.158l2.357-4.155c.308-.636.74-1.205 1.269-1.674 3.467-2.647 10.343-.625 13.313 1.762z" opacity=".04"/>
    <path fill="#A1616A" d="M206.993 170.591c-2.295 1.084-4.93 1.19-7.326 2.022-2.397.833-4.432 2.331-6.63 3.551-5.727 3.198-12.335 4.405-18.824 5.555-3.934.705-7.93 1.41-11.895 1.242-5.365-.229-10.52-2.017-15.718-3.365-5.198-1.348-10.745-2.256-15.895-.74-2.689.818-5.147 2.259-7.175 4.206-2.029 1.946-3.57 4.343-4.499 6.996-1.079 3.168-1.229 6.582-1.022 9.921 1.084.798 2.599-.308 3.19-1.52.59-1.211.912-2.696 2.057-3.401 1.987.674 2.471 3.322 4.11 4.63 1.022.82 2.388 1.036 3.687 1.221l6.697.951c1.612.229 3.484.384 4.652-.753.568-.551.881-1.322 1.401-1.912 1.066-1.181 2.845-1.383 4.431-1.225 4.952.494 9.595 3.705 14.512 2.943 1.691-.26 3.264-.982 4.876-1.551 9.556-3.374 20.172-1.321 30.115-3.255 3.793-.736 7.445-2.04 11.053-3.414 1.961-.745 3.943-1.525 5.617-2.784 1.586-1.22 2.837-2.822 3.635-4.656.798-1.835 1.118-3.842.929-5.834-.369-3.035-1.883-5.815-4.233-7.771-.776-.66-1.793-1.925-2.723-2.339-1.775-.78-3.515.573-5.022 1.282z"/>
    <g opacity=".1">
        <path fill="#000" d="M194.121 114.318c-.736-.652-.916-1.643-1.551-2.366-1.321-1.529-3.991-1.322-6.167-1.013-3.793.533-8.37.656-10.723-1.983-1.017-1.136-1.467-2.643-2.709-3.59-2.899-2.203-7.886.053-11.08-1.811-2.788-1.625-2.608-5.396-4.934-7.489-2.326-2.092-6.357-1.82-9.515-.775-.535.246-1.134.313-1.709.194-1-.353-.93-1.595-.683-2.511 1.202-4.428 2.427-8.9 4.766-12.97.851-1.484 1.855-2.916 2.401-4.51.956-2.794.467-5.952 1.723-8.596-1.348.882-2.643 1.842-3.476 3.084-1.877 2.798-1.15 6.357-2.203 9.463-.546 1.595-1.55 3.026-2.401 4.511-2.339 4.07-3.564 8.542-4.766 12.97-.247.916-.317 2.158.683 2.51.575.12 1.174.052 1.709-.193 3.158-1.044 7.172-1.344 9.515.775 2.344 2.119 2.146 5.877 4.934 7.489 3.194 1.863 8.181-.388 11.08 1.811 1.242.942 1.692 2.453 2.709 3.59 2.37 2.643 6.93 2.515 10.723 1.982 2.176-.308 4.846-.515 6.167 1.014.635.722.815 1.713 1.551 2.365 1.322 1.181 3.74.582 5.031-.63.828-.862 1.536-1.831 2.106-2.881-1.146.348-2.366.295-3.181-.44zM202.148 109.469c-.284.365-.547.746-.789 1.141 1.692-1.207 3.485-2.335 4.749-3.873.329-.397.623-.822.881-1.268-1.757 1.26-3.59 2.418-4.841 4z" opacity=".1"/>
    </g>
    <path fill="#3F3D56" d="M291.148 196.703l1.322 126.434 6.168-.881-1.322-125.553h-6.168zM328.152 219.613l1.322 126.434 6.167-.881-1.321-125.553h-6.168zM443.366 283.479l-.026-2.427v-1.445l-.233-22.238-.366-34.767-.062-3h-6.167l.031 2.889.193 18.622.084 8.062.071 6.528.114 11.287.071 6.656v.705l.092 8.749.079 7.714.503-.555c.807-.902 1.597-1.818 2.37-2.749l3.246-4.031z"/>
    <path fill="#FFB400" d="M321.327 240.094l-3.524 5.269 3.524 24.004 29.956 8.199h48.459l29.076 1.757 13.85-9.48-2.396-16.282-10.573-13.467H321.327z"/>
    <path fill="#3F3D56" d="M317.801 245.363l-1.763 14.635s-9.251 28.692 65.2 26.934c74.45-1.757 61.675-7.612 61.675-7.612l-.441-16.978s2.595 8.035-35.243 6.947c-37.837-1.088-73.129-4.604-73.129-4.604s-13.216 2.339-16.299-19.322z"/>
    <path fill="#FBBEBE" d="M379.828 114.186c-4.246 1.934-7.462 5.683-9.617 9.829-2.154 4.145-3.365 8.696-4.559 13.216-1.26 4.766-2.524 9.546-3.176 14.432-1.163 8.687-.291 17.819 3.7 25.621s11.366 14.097 20 15.6c3.335.586 6.763.467 10.133.119 6.091-.645 12.092-1.968 17.89-3.943 6.057-2.049 12.361-5.203 15.058-11.014 1.563-3.37 1.696-7.211 1.621-10.92-.208-10.11-1.735-20.15-4.542-29.864-.815-2.82-1.762-5.661-3.489-8.036-1.727-2.374-4.088-4.114-6.498-5.727-10.304-6.938-23.846-15.075-36.521-9.313z"/>
    <path fill="#000" d="M379.828 114.186c-4.246 1.934-7.462 5.683-9.617 9.829-2.154 4.145-3.365 8.696-4.559 13.216-1.26 4.766-2.524 9.546-3.176 14.432-1.163 8.687-.291 17.819 3.7 25.621s11.366 14.097 20 15.6c3.335.586 6.763.467 10.133.119 6.091-.645 12.092-1.968 17.89-3.943 6.057-2.049 12.361-5.203 15.058-11.014 1.563-3.37 1.696-7.211 1.621-10.92-.208-10.11-1.735-20.15-4.542-29.864-.815-2.82-1.762-5.661-3.489-8.036-1.727-2.374-4.088-4.114-6.498-5.727-10.304-6.938-23.846-15.075-36.521-9.313z" opacity=".05"/>
    <path fill="#FFB400" d="M375.058 169.64c1.229 1.689 2.716 3.176 4.406 4.405 4.193 2.899 9.577 3.291 14.669 3.449 4.089.124 8.776-.11 11.34-3.299 1.154-1.436 1.674-3.269 2.141-5.053 2.882-10.956 4.929-22.114 6.123-33.379l11.666.039c5.048 21.617 4.634 44.089 4.194 66.288l-.639 32.37-7.516-.797c-17.846-1.89-35.718-3.78-53.661-4.106-10.514-.193-21.03.154-31.508 1.04l16.366-48.662c2.124-6.326 4.269-12.736 4.767-19.383.718-9.644-1.987-19.825 1.762-28.745.3-.719.679-1.463 1.361-1.837.683-.375 1.547-.282 2.331-.181 1.48.198 6.004 0 7.079.947 1.586 1.375.538 1.582-.022 3.797-1 3.965-1.947 7.635-1.934 11.767.013 7.503 2.339 15.423 7.075 21.34z"/>
    <path fill="#464353" d="M443.366 283.482c1.965-2.608 3.817-5.308 5.556-8.101-.882-1.886-1.851-3.727-2.622-5.652-1.18-2.952-1.859-6.08-2.528-9.185-.229-1.058-.457-2.115-.683-3.172-2.467-11.503-4.784-23.168-5.265-34.829-.044-.969-.072-1.938-.083-2.907v-.441-3.181c.053-2.643.22-5.308.524-7.96.057-.52.123-1.04.194-1.56 0-.114.026-.224.044-.339l29.956-1.092 2.52-.093c1.731-.062 3.564-.159 4.991-1.141 2.401-1.648 2.683-5.026 2.644-7.93-.146-7.337-.978-14.645-2.485-21.828-1.137-5.401-2.758-10.921-6.397-15.071-2.986-3.41-7.312-5.89-8.868-10.132-.577-1.577-.722-3.309-1.471-4.815-.749-1.507-1.987-2.613-3.154-3.776-4.109-4.071-7.517-8.792-10.088-13.973-1.785-3.595-3.719-7.56-6.049-10.045-.115-.127-.229-.246-.348-.361-1.982-1.96-4.251-2.819-6.938-1.484-.484.242-.944.528-1.375.854-.958.732-1.833 1.565-2.612 2.485-2.715 3.121-5.096 6.517-7.106 10.132-1.413 2.546-2.627 5.197-3.63 7.93-.792 2.159-1.447 4.366-1.961 6.608-.378 1.661-.678 3.339-.916 5.022-.881 6.326-.881 12.775-.758 19.181.133 5.885.392 11.784.926 17.648.132 1.418.279 2.835.44 4.251.323 2.799.723 5.589 1.198 8.37.19 1.062.384 2.123.599 3.181.053.282.111.564.168.841l.026.119c.582 2.458 1.034 4.944 1.353 7.45.035.314.061.627.079.938.074 1.44.062 2.883-.035 4.322-.102 1.7-.26 3.396-.339 5.097 0 .299 0 .594-.031.881-.022.859 0 1.718 0 2.577.089 2.055.334 4.1.731 6.119.743 3.754 2.027 7.381 3.811 10.767.167.317.339.629.511.938 2.233 3.991 5.053 7.652 7.119 11.736 1.782 3.675 3.113 7.552 3.965 11.546.293 1.319.572 2.64.837 3.965.409 2.115.775 4.247 1.149 6.379.036.211.075.44.115.634.498 2.829 1.022 5.644 1.696 8.406.392 1.608.833 3.194 1.348 4.753l3.242-4.062z"/>
    <path fill="#F86D70" d="M437.483 248.756c0 .397-.027.793-.044 1.194-.079 1.933-.257 3.861-.533 5.776-.365 2.613-1.005 5.181-1.908 7.661-.598 1.63-1.36 3.196-2.273 4.674-.81 1.312-1.758 2.533-2.828 3.643-2.643 2.749-6.45 3.626-10.133 4.784-1.694.491-3.332 1.16-4.885 1.996-.278.154-.551.321-.815.498l-4.608 3.052c-1.436.948-2.903 1.93-3.89 3.335-.162.239-.309.488-.441.745-.623 1.293-1.079 2.661-1.356 4.07-2.397 9.983-4.798 19.974-6.441 30.107-.11.669-.216 1.343-.33 2.017l-.04.212c-.02-.05-.044-.099-.071-.146-11.788 7.128-24.013 13.56-36.608 18.71l-2.736-22.908c-.285-1.862-.379-3.749-.282-5.63.26-2.965 1.467-5.775 1.793-8.731.309-2.894-.238-5.815-1.573-8.401-.519-1.005-1.171-1.992-1.29-3.115-.119-1.123.528-2.15 1.656-2.264.881-.978.952-2.313.692-3.635-.138-.69-.345-1.364-.617-2.013-.749-1.841-1.696-3.846-1.053-5.727.17-.341.246-.721.22-1.101.005-.024.005-.048 0-.071-.149-.493-.735-.709-1.039-1.128-.573-.779 0-1.841.352-2.74.343-.965.542-1.976.591-3 .048-.568.083-1.141.145-1.705.086-.763.223-1.519.41-2.264 1.07-4.22 3.643-7.904 7.238-10.361 1.713-1.155 3.621-1.996 5.37-3.084 1.791-1.208 3.501-2.532 5.119-3.965 3.879-3.231 7.913-6.276 12.101-9.137 4.504-3.075 9.168-5.907 13.974-8.484 1.028-.555 2.056-1.096 3.084-1.622 1.119-.587 2.245-1.144 3.379-1.669 3.63-1.732 7.749-1.084 11.762.07 1.683.48 3.344 1.053 4.947 1.573 1.566.509 3.073 1.186 4.494 2.018 3.555 2.088 6.493 5.172 7.713 9.066.002.025.002.05 0 .075.776 2.44.824 5.057.754 7.625z"/>
    <path fill="#000" d="M437.483 248.756c0 .397-.027.793-.044 1.194-.079 1.933-.257 3.861-.533 5.776-.365 2.613-1.005 5.181-1.908 7.661-.598 1.63-1.36 3.196-2.273 4.674-.81 1.312-1.758 2.533-2.828 3.643-2.643 2.749-6.45 3.626-10.133 4.784-1.694.491-3.332 1.16-4.885 1.996-.278.154-.551.321-.815.498l-4.608 3.052c-1.436.948-2.903 1.93-3.89 3.335-.162.239-.309.488-.441.745-.623 1.293-1.079 2.661-1.356 4.07-2.397 9.983-4.798 19.974-6.441 30.107-.11.669-.216 1.343-.33 2.017l-.04.212c-.02-.05-.044-.099-.071-.146-11.788 7.128-24.013 13.56-36.608 18.71l-2.736-22.908c-.285-1.862-.379-3.749-.282-5.63.26-2.965 1.467-5.775 1.793-8.731.309-2.894-.238-5.815-1.573-8.401-.519-1.005-1.171-1.992-1.29-3.115-.119-1.123.528-2.15 1.656-2.264.881-.978.952-2.313.692-3.635-.138-.69-.345-1.364-.617-2.013-.749-1.841-1.696-3.846-1.053-5.727.17-.341.246-.721.22-1.101.005-.024.005-.048 0-.071-.149-.493-.735-.709-1.039-1.128-.573-.779 0-1.841.352-2.74.343-.965.542-1.976.591-3 .048-.568.083-1.141.145-1.705.086-.763.223-1.519.41-2.264 1.07-4.22 3.643-7.904 7.238-10.361 1.713-1.155 3.621-1.996 5.37-3.084 1.791-1.208 3.501-2.532 5.119-3.965 3.879-3.231 7.913-6.276 12.101-9.137 4.504-3.075 9.168-5.907 13.974-8.484 1.028-.555 2.056-1.096 3.084-1.622 1.119-.587 2.245-1.144 3.379-1.669 3.63-1.732 7.749-1.084 11.762.07 1.683.48 3.344 1.053 4.947 1.573 1.566.509 3.073 1.186 4.494 2.018 3.555 2.088 6.493 5.172 7.713 9.066.002.025.002.05 0 .075.776 2.44.824 5.057.754 7.625z" opacity=".1"/>
    <path fill="#3F3D56" d="M395.652 175.786c-.044-.102-.109-.194-.19-.271-.081-.076-.177-.136-.282-.175-.105-.038-.216-.055-.328-.05-.111.005-.22.033-.321.082-.1.049-.19.117-.263.202-.073.084-.129.182-.163.288-.034.106-.047.218-.037.329.01.112.042.22.095.318l-.44.216 13.136 26.925 2.375-1.158-13.137-26.943-.445.237z"/>
    <path fill="#FBBEBE" d="M412.075 147.584c15.571 0 28.194-12.623 28.194-28.194 0-15.572-12.623-28.195-28.194-28.195s-28.194 12.623-28.194 28.195c0 15.571 12.623 28.194 28.194 28.194z"/>
    <path fill="#464353" d="M449.289 101.933c-.132-2.242-.465-4.466-.996-6.648-1.656-7.123-4.682-14.137-9.894-19.251-.321-1.25-.705-2.484-1.15-3.696-.008-.03-.018-.06-.031-.088-1.554-4.27-3.802-8.255-6.652-11.794-1.652-2.053-3.793-4.079-6.427-4.158-.74-.027-1.524.101-2.203-.238-.499-.323-.919-.753-1.229-1.26-1.305-1.649-3.035-2.91-5.004-3.646-1.969-.737-4.102-.922-6.168-.535l-.273.057c-.154.031-.308.066-.441.106-.132.04-.37.106-.555.163.203.335.401.674.595 1.018.523.93 1.007 1.882 1.454 2.855.37.81.712 1.634 1.026 2.47-4.511.516-8.185 3.719-11.542 6.767l-7.903 7.172c-.014.013-.028.026-.04.04l-.229.22c-.057.058-.114.115-.167.177-.021.018-.041.039-.057.061-.066.07-.128.146-.19.22-.11.14-.208.287-.295.441-.043.066-.081.135-.115.207-.012.021-.022.043-.03.066-.029.06-.054.122-.075.185-.002.009-.002.018 0 .027-.013.036-.023.073-.031.11-.09.31-.063.642.075.934l5.211.057h.613c.026.696.048 1.397.075 2.093-.827.618-1.621 1.28-2.379 1.982-.827.765-1.602 1.583-2.322 2.45-4.7 5.678-7.154 13.013-7.401 20.396V103.589c0 .441.04.881.075 1.322.002.574.154 1.137.44 1.634.038.056.079.109.124.159.264.287.581.52.934.687l.379.185c.189.093.37.181.546.282 1.661.938 2.643 2.749 4.154 3.912.088.066.176.132.264.189l.199.133.123.079.167.097c.11.066.223.126.34.18l.211.106h.035c.177.079.353.154.533.22l.252.088.074.027c.071.022.146.048.221.066.149.044.296.084.44.119l.441.097c.172.031.348.062.524.084l.26.035.264.026c.42.038.843.06 1.269.066 1.336-.008 2.671-.101 3.996-.277l11.242-1.322c2.551-.295 5.154-.59 7.67-.07 2.132.44 4.097 1.453 6.167 2.172.467.163.934.312 1.406.44.171.049.348.101.524.145l.242.062.564.137c.203.048.405.097.608.136.286.062.568.115.855.168.193.039.392.07.59.105h.04l.563.088h.137l.419.058c.202.031.405.057.612.079.449.056.899.104 1.348.145.727.071 1.458.124 2.203.168l.731.044.731.035 2.203.097h.405c.916.064 1.836.017 2.74-.141.159-.031.313-.066.467-.11.154-.044.282-.088.441-.141 1.652-.634 2.859-2.093 3.696-3.652.176-.33.339-.661.489-1 .15-.339.286-.683.41-1.027.154-.44.286-.859.401-1.299.035-.119.066-.238.092-.361.026-.124.088-.366.123-.551.11-.507.194-1.018.256-1.533 0-.163.04-.331.057-.494.04-.44.071-.85.088-1.281v-.987c-.004-.357-.035-.828-.035-1.282zm-11.295-26.3c-.357-.335-.723-.657-1.093-.96.412.26.779.584 1.088.96h.005zM357.964 117.835c-3.318-.41-6.608-1.864-9.882-1.15-2.048.441-3.81 1.714-5.449 3.022-6.099 4.888-11.284 10.817-15.317 17.511-.684 1.001-1.165 2.127-1.415 3.313-.211 1.375.163 2.771.608 4.088 3.014 8.904 9.459 16.34 12.393 25.269 3.083 9.393 2.013 19.657-.26 29.278-2.818 11.878-7.397 23.267-13.586 33.79-.841 1.564-1.893 3.005-3.128 4.282-1.604 1.541-3.758 2.643-4.709 4.66-.441.882-.569 1.886-.882 2.829-.881 2.643-3.013 4.907-3.22 7.696-.154 2.128.855 4.141 1.467 6.167 1.033 3.482.923 7.203-.313 10.617-2.233 6.124-8.075 11.692-6.379 17.987 3.785-1.088 7.979-2.502 9.763-6.013.63-1.242.942-2.722 2.004-3.63 2.119-1.802 5.727-.172 7.978-1.828 1.701-1.26 1.762-3.842 1.005-5.824-.758-1.983-2.062-3.727-2.644-5.767-1.013-3.678.608-7.568.309-11.37-.141-1.762-.683-3.449-.723-5.203-.075-3.405 1.811-6.608 4.318-8.921 2.506-2.312 5.603-3.845 8.652-5.356l11.524-5.727c4.181-2.071 8.762-4.595 10.132-9.053.52-1.67.525-3.45.551-5.194.392-26.657 7.071-52.777 13.71-78.596 1.03-4 2.079-8.018 3.612-11.86 1.533-3.841 4.533-6.925 6.062-10.493-8.868-1.04-16.97 6.63-26.181 5.476z"/>
    <path fill="#F86D70" d="M421.494 285.068c1.017 6.167 1.638 12.467 2.123 18.736-7.93 6.572-16.467 12.29-25.141 17.595-.494.304-.991.603-1.489.881l-.04.211c-.02-.05-.043-.099-.07-.145-.673-1.454-1.85-2.616-3.313-3.269-3.251-6.828-6.5-13.657-9.745-20.485-1.762-3.687-3.524-7.41-4.405-11.388 0-.084-.04-.172-.053-.255-.67-3.084-.824-6.287-1.269-9.41-.225-1.789-.628-3.551-1.203-5.26-.528-1.52-1.255-2.996-1.898-4.48-.793-1.833-1.458-3.688-1.489-5.666 0-.63.039-1.321-.269-1.85-.33-.455-.737-.849-1.203-1.163-.581-.516-1.022-1.171-1.281-1.904-.259-.732-.327-1.519-.199-2.285-2.643.136-4.132 2.978-5.194 5.387-.965 2.357-2.233 4.578-3.771 6.608-1.121 1.45-2.547 2.637-4.176 3.476-.145.071-.291.141-.441.203-3.678 1.621-7.973 1.048-11.96.317-3.485-.639-7.088-1.432-9.89-3.599l-.3-.238c-.829-.689-1.569-1.48-2.202-2.353-2.348-3.207-3.388-7.431-3.965-11.454-.053-.378-.106-.757-.154-1.136-.401-2.842-.512-5.717-.331-8.582.053-.705.128-1.409.22-2.11.062-.44.128-.916.203-1.374-.002-.014-.002-.027 0-.04.115-.727.238-1.458.361-2.203.441-2.498.881-5.061 2.203-7.211.87-1.338 1.967-2.513 3.242-3.472.476-.374.965-.731 1.459-1.075.801-.555 1.625-1.083 2.462-1.581 2.106-1.261 4.317-2.337 6.608-3.216.546-.211 1.102-.41 1.657-.599 2.157-.768 4.479-.952 6.731-.533 1.995.289 4.011.406 6.027.352 5.167-.101 10.357-1.088 15.515-1.727 7.163-.881 14.859-.986 21.106 2.644.3.171.591.352.881.541 3.084 2.018 5.569 4.846 7.573 8.005.441.665.824 1.348 1.203 2.04.873 1.587 1.663 3.219 2.365 4.89.416.82.641 1.723.657 2.643-.01.175-.034.348-.071.52-.119.625-.356 1.233-.44 1.867-.278 2.401 1.762 4.406 2.524 6.692.494 1.489.441 3.084.718 4.652.401 2.203 1.48 4.185 2.45 6.168 1.531 3.191 2.841 6.484 3.92 9.855.767 2.348 1.423 4.731 2 7.136.188.773.366 1.547.533 2.322.481 2.132.873 4.22 1.221 6.322z"/>
    <path fill="#3F3D56" d="M468.464 219.831v3.084l-.568-.009-.635-.009-7.084-.088-17.454-.229-4.898-.062-1.269-.017-7.353-.093-10.361-.136-21.983-.287-38.146-.493-13.767-.176-5.524-.071-5.084-.066-3.167-.044-3-.04-22.243-.286-6.167-.079-1.344-.018-.872-2.251-6.34-16.348-1.158-2.987.881-3.524 3.965 2.643 2.44.304 40.182 4.995 7.542.939 15.991 1.991 15.666 1.947 6.141.762 36.339 4.52 10.155 1.265 8.405 1.044 29.886 3.718.824.101z"/>
    <path fill="#504F60" d="M290.928 195.602l7.929 20.705 169.607 3.524v-22.467l-177.536-1.762z"/>
    <path fill="#3F3D56" d="M299.738 218.508l1.322 126.434 6.167-.881-1.321-125.553h-6.168zM467.898 222.903h-.635c-1.027 7.882-2.726 15.663-5.079 23.256l-2.005-23.349-.083-.995 7.409-.855.247-.026.146 1.969z"/>
    <path fill="#fff" d="M443.794 207.937l-64.539 1.321-20.044-6.608 53.745-3.084 30.838 8.371z"/>
    <path fill="#FBBEBE" d="M362.836 182.245c-.684.263-1.29.695-1.762 1.256-.368.607-.593 1.292-.656 2l-1.084 6.462c-.165.591-.136 1.22.084 1.793.282.542 1.101.824 1.511.375-.053 1.264.057 2.612.793 3.643.736 1.031 2.277 1.573 3.317.855.163.265.382.492.641.665.26.173.554.287.862.335.308.047.623.028.922-.058.3-.086.577-.236.813-.44-.626.211-.67 1.167-.225 1.652.499.44 1.134.693 1.798.718 7.741 1.091 15.634.098 22.864-2.877.682-.282-1.115-8.7-1.296-9.564-.44-2.031-.66-4.511-2.374-5.877-4.097-3.268-11.375-3.912-16.366-3.524-3.41.258-6.745 1.134-9.842 2.586z"/>
    <path fill="#000" d="M428.503 183.221c-15.934.304-32.198.564-47.406-4.207 1.453 5.629 1.353 11.546-.29 17.123l74.503 6.168c3.159.26 16.256 1.74 19.335.995 3.08-.744-25.837-10.269-24.67-13.216 3.212-8.119 13.97-12.877 6.221-13.181-9.78-.387-17.838 6.133-27.693 6.318z" opacity=".1"/>
    <path fill="#464353" d="M428.945 184.1c-15.934.304-32.199.563-47.406-4.208 1.452 5.63 1.352 11.547-.291 17.124l74.503 6.168c3.159.259 16.256 1.762 19.336.995 3.079-.766 2.356-4.542 3.524-7.489 3.211-8.119-14.225-18.604-21.974-18.908-9.78-.387-17.837 6.133-27.692 6.318z"/>
    <path fill="#FBBEBE" d="M403.609 185.327c.685.262 1.291.694 1.762 1.256.368.608.594 1.292.661 2l1.084 6.462c.163.592.134 1.22-.084 1.793-.282.542-1.106.824-1.511.375.049 1.264-.057 2.612-.793 3.643-.736 1.031-2.277 1.573-3.322.855-.163.265-.381.492-.641.665-.259.173-.553.287-.861.335-.308.047-.623.028-.923-.058-.299-.086-.577-.236-.812-.44.625.211.674 1.167.229 1.652-.5.44-1.137.693-1.802.718-7.74 1.091-15.631.098-22.86-2.877-.682-.282 1.111-8.7 1.296-9.564.44-2.031.66-4.511 2.374-5.877 4.093-3.268 11.375-3.911 16.366-3.524 3.409.259 6.742 1.135 9.837 2.586z"/>
    <path fill="#464353" d="M298.32 171.295c-1.463 1.886-2.93 3.811-3.873 6.009-1.802 4.194-1.537 8.943-1.238 13.498.084 1.322.19 2.67.881 3.767.598.829 1.387 1.501 2.3 1.96 3.815 2.168 8.282 2.815 12.643 3.3 6.679.74 13.381 1.191 20.106 1.352 16.661.406 33.578-.956 49.807 2.82-2.008-3.053-2.004-7.093-.881-10.573 1.124-3.48 3.287-6.511 5.406-9.494-7.428-2.352-15.393 1.322-23.172.956-7.987-.374-15.38-4.991-23.375-4.987-1.718 0-3.467.216-5.137-.198-1.67-.414-3.286-1.674-3.441-3.387 2.133.48 4.155-1.344 5.036-3.344.881-2 1.039-4.26 1.894-6.273 2.128-5.009 7.877-7.331 11.454-11.454.564-.652 1.097-1.423 1.079-2.287-.084-.731-.391-1.419-.881-1.969-2.973-3.965-7.454-6.167-11.176-9.251-1.295-1.075-3.908-5.128-5.361-5.502-2.697-.692-4.983 3.202-6.736 5.101-8.852 9.618-17.297 19.604-25.335 29.956z"/>
    <path fill="#000" d="M386.902 170.176c1.117.828 2.109 1.811 2.948 2.921.417.557.715 1.194.873 1.872.159.678.175 1.381.047 2.066-.136-1.277.148-2.563.811-3.663.662-1.1 1.666-1.954 2.859-2.43l-7.538-.766z" opacity=".07"/>
    <g opacity=".1">
        <path fill="#000" d="M411.337 54.652c-.519-1.377-1.116-2.723-1.789-4.03-.435.083-.865.193-1.286.33.756 1.255 1.437 2.554 2.039 3.89.34-.089.683-.15 1.036-.19zM436.896 72.02c.119.096.234.207.348.308-.008-.029-.018-.057-.03-.084-.1-.073-.206-.148-.318-.225zM395.942 73.96c.229-.18.441-.37.687-.546l-.07-2.092-4.705-.049c-.762.7-1.573 1.705-1.124 2.644l5.212.044zM447.38 109.185c-.837 1.56-2.044 3.022-3.696 3.652-1.273.485-2.674.441-4.035.379-4.643-.189-9.366-.396-13.754-1.934-2.053-.722-4.017-1.731-6.167-2.176-2.516-.52-5.119-.225-7.67.075l-11.242 1.322c-3.318.387-7.014.678-9.661-1.357-1.516-1.163-2.494-2.974-4.155-3.908-.7-.396-1.533-.652-1.986-1.321-.287-.498-.439-1.061-.441-1.635-.035-.462-.057-.925-.075-1.387-.048 1.344-.023 2.689.075 4.03.002.574.154 1.138.441 1.635.44.665 1.286.921 1.986 1.321 1.661.934 2.644 2.745 4.155 3.908 2.643 2.035 6.343 1.762 9.661 1.357l11.242-1.322c2.551-.299 5.154-.595 7.67-.075 2.132.441 4.097 1.454 6.167 2.177 4.406 1.537 9.111 1.762 13.754 1.934 1.361.057 2.762.105 4.035-.379 1.652-.63 2.859-2.093 3.696-3.652 1.621-3.018 2.075-6.441 1.903-9.89-.094 2.526-.744 5-1.903 7.246z" opacity=".1"/>
    </g>
    <path fill="#000" d="M411.209 57.484l6.167 5.727s-5.286-2.202-6.167-5.727z" opacity=".1"/>
    <g filter="url(#prefix__filter0_d)">
        <rect width="342" height="78" x="30" y="304.004" fill="#fff" rx="4"/>
    </g>
    <path fill="#3E3E5F" d="M49.645 362.197c2.068 0 3.252-1.664 3.252-4.57 0-.932-.135-1.711-.41-2.356-.528-1.248-1.507-1.921-2.772-1.921-1.735 0-2.965 1.212-2.965 2.912 0 1.64 1.166 2.83 2.777 2.83 1.008 0 1.834-.481 2.25-1.301h.094c-.059 2.25-.838 3.469-2.215 3.469-.832 0-1.47-.481-1.699-1.272h-1.084c.27 1.36 1.336 2.209 2.772 2.209zm.07-4.019c-1.12 0-1.899-.797-1.899-1.951 0-1.108.827-1.952 1.91-1.952 1.084 0 1.91.856 1.91 1.987 0 1.119-.802 1.916-1.921 1.916zm7.722 4.025c1.899 0 2.989-1.605 2.989-4.412 0-2.801-1.108-4.441-2.989-4.441-1.892 0-3 1.634-3 4.423 0 2.813 1.096 4.43 3 4.43zm0-.92c-1.247 0-1.939-1.248-1.939-3.51 0-2.232.703-3.498 1.94-3.498 1.236 0 1.927 1.254 1.927 3.498 0 2.268-.68 3.51-1.928 3.51zm8.409.92c.545 0 1.06-.088 1.511-.258l.745 1.014h1.183l-1.072-1.488c.96-.692 1.5-2.01 1.5-3.692 0-2.724-1.488-4.429-3.867-4.429-2.39 0-3.885 1.699-3.885 4.429 0 2.742 1.477 4.424 3.885 4.424zm.006-.973c-1.735 0-2.807-1.318-2.807-3.451 0-2.127 1.078-3.457 2.8-3.457 1.712 0 2.784 1.336 2.784 3.457 0 1.289-.37 2.297-1.031 2.825l-.768-1.02h-1.195l1.119 1.518c-.293.087-.592.128-.902.128zM93.672 358.107h1.072c1.201 0 1.945.61 1.945 1.588 0 .926-.79 1.588-1.904 1.588-1.09 0-1.851-.58-1.945-1.482h-1.02c.077 1.447 1.26 2.402 2.977 2.402 1.67 0 2.976-1.084 2.976-2.478 0-1.155-.697-1.952-1.845-2.098v-.094c.925-.222 1.482-.961 1.482-1.969 0-1.23-1.178-2.214-2.654-2.214-1.612 0-2.66.902-2.766 2.367h1.026c.087-.908.726-1.447 1.699-1.447.972 0 1.623.574 1.623 1.435 0 .879-.68 1.5-1.64 1.5h-1.026v.902zm8.783 4.09c1.734 0 2.965-1.213 2.965-2.912 0-1.64-1.166-2.83-2.777-2.83-1.008 0-1.834.481-2.25 1.301h-.094c.058-2.25.838-3.469 2.215-3.469.832 0 1.47.481 1.699 1.272h1.084c-.27-1.36-1.336-2.209-2.772-2.209-2.068 0-3.252 1.664-3.252 4.57 0 .932.135 1.711.41 2.355.528 1.243 1.501 1.922 2.772 1.922zm-.012-.926c-1.084 0-1.91-.855-1.91-1.986 0-1.119.803-1.916 1.922-1.916 1.119 0 1.899.797 1.899 1.951 0 1.108-.827 1.951-1.911 1.951zm7.518.932c1.898 0 2.988-1.605 2.988-4.412 0-2.801-1.107-4.441-2.988-4.441-1.893 0-3 1.634-3 4.423 0 2.813 1.096 4.43 3 4.43zm0-.92c-1.248 0-1.94-1.248-1.94-3.51 0-2.232.704-3.498 1.94-3.498s1.928 1.254 1.928 3.498c0 2.268-.68 3.51-1.928 3.51zm13.184.721v-8.455h-1.225l-2.895 6.996h-.093l-2.895-6.996h-1.225v8.455h.985v-6.457h.07l2.666 6.398h.891l2.666-6.398h.07v6.457h.985zM147.965 362.004h1.055v-8.455h-1.049l-2.25 1.617v1.113l2.15-1.558h.094v7.283zm6.469.199c1.793 0 3.046-1.014 3.046-2.461 0-1.101-.697-1.957-1.757-2.156v-.094c.873-.24 1.412-.961 1.412-1.887 0-1.318-1.119-2.255-2.701-2.255s-2.702.937-2.702 2.255c0 .92.551 1.653 1.413 1.887v.094c-1.061.199-1.758 1.055-1.758 2.156 0 1.447 1.254 2.461 3.047 2.461zm0-.902c-1.172 0-1.981-.668-1.981-1.635s.809-1.635 1.981-1.635c1.171 0 1.98.668 1.98 1.635s-.809 1.635-1.98 1.635zm0-4.16c-.996 0-1.664-.575-1.664-1.436 0-.873.662-1.453 1.664-1.453 1.002 0 1.664.58 1.664 1.453 0 .861-.668 1.436-1.664 1.436zm7.617 5.062c1.898 0 2.988-1.605 2.988-4.412 0-2.801-1.107-4.441-2.988-4.441-1.893 0-3 1.634-3 4.423 0 2.813 1.095 4.43 3 4.43zm0-.92c-1.248 0-1.94-1.248-1.94-3.51 0-2.232.703-3.498 1.94-3.498 1.236 0 1.928 1.254 1.928 3.498 0 2.268-.68 3.51-1.928 3.51zm13.183.721v-8.455h-1.224l-2.895 6.996h-.094l-2.894-6.996h-1.225v8.455h.985v-6.457h.07l2.666 6.398h.891l2.666-6.398h.07v6.457h.984zm2.051 0h1.008v-6.316h-1.008v6.316zm.504-7.6c.387 0 .703-.316.703-.703 0-.387-.316-.703-.703-.703-.387 0-.703.316-.703.703 0 .387.316.703.703.703zm2.426 7.6h1.008v-3.738c0-1.108.65-1.782 1.658-1.782s1.488.539 1.488 1.676v3.844h1.008v-4.09c0-1.5-.791-2.338-2.209-2.338-.967 0-1.582.41-1.898 1.108h-.094v-.996h-.961v6.316zM55.206 337.004h2.299l-4.258-11.978h-2.408l-4.25 11.978h2.167l1.03-3.063h4.407l1.013 3.063zm-3.28-9.695h.142l1.627 4.939h-3.412l1.644-4.939zm9.78 9.695v-11.978h-2.143v11.978h2.142zm8.076 0v-10.127h3.694v-1.851h-9.521v1.851h3.685v10.127h2.142zm15.796-3.86v-1.934h-5.454v1.934h5.454zm10.036 3.86h2.141v-11.978h-2.133l-3.13 2.191v2.059l2.98-2.092h.142v9.82z"/>
    <circle cx="81" cy="358.004" r="2" fill="#3E3E5F" fill-opacity=".16"/>
    <circle cx="135" cy="358.004" r="2" fill="#3E3E5F" fill-opacity=".16"/>
    <rect width="104" height="36" x="252" y="325.004" fill="#4CECC9" rx="4"/>
    <rect width="104" height="36" x="252" y="325.004" fill="url(#prefix__pattern0)" rx="4"/>
    <path fill="#3E3E5F" d="M268.674 344.795c.111 1.459 1.347 2.408 3.14 2.408 1.934 0 3.159-.99 3.159-2.543 0-1.242-.703-1.922-2.455-2.361l-.885-.235c-1.166-.298-1.629-.679-1.629-1.341 0-.856.744-1.418 1.869-1.418 1.055 0 1.77.515 1.916 1.383h1.061c-.088-1.366-1.307-2.338-2.942-2.338-1.787 0-2.988.972-2.988 2.408 0 1.201.662 1.892 2.191 2.279l1.084.281c1.166.293 1.694.75 1.694 1.471 0 .838-.838 1.453-1.975 1.453-1.201 0-2.045-.562-2.174-1.447h-1.066zm11.308 2.209v-7.506h2.725v-.949h-6.504v.949h2.725v7.506h1.054zm8.854 0h1.107l-3.117-8.455h-1.043l-3.117 8.455h1.107l.85-2.42h3.363l.85 2.42zm-2.578-7.09h.094l1.324 3.774h-2.742l1.324-3.774zm6.222-.428h2.034c1.09 0 1.746.604 1.746 1.618 0 1.037-.615 1.617-1.699 1.617h-2.081v-3.235zm0 4.172h2.081l1.81 3.346h1.236l-1.957-3.51c1.061-.334 1.7-1.248 1.7-2.426 0-1.523-1.067-2.519-2.696-2.519h-3.228v8.455h1.054v-3.346zm10.038 3.346v-7.506h2.724v-.949h-6.504v.949h2.725v7.506h1.055zm10.992 0v-7.506h2.724v-.949h-6.504v.949h2.725v7.506h1.055zm9.592-.949h-4.184v-2.907h3.967v-.937h-3.967v-2.713h4.184v-.949h-5.239v8.455h5.239v-.949zm1.505-1.26c.112 1.459 1.348 2.408 3.141 2.408 1.934 0 3.158-.99 3.158-2.543 0-1.242-.703-1.922-2.455-2.361l-.885-.235c-1.166-.298-1.628-.679-1.628-1.341 0-.856.744-1.418 1.869-1.418 1.054 0 1.769.515 1.916 1.383h1.06c-.088-1.366-1.306-2.338-2.941-2.338-1.787 0-2.988.972-2.988 2.408 0 1.201.662 1.892 2.191 2.279l1.084.281c1.166.293 1.693.75 1.693 1.471 0 .838-.838 1.453-1.974 1.453-1.202 0-2.045-.562-2.174-1.447h-1.067zm11.309 2.209v-7.506h2.725v-.949h-6.504v.949h2.724v7.506h1.055z"/>
    <rect width="342" height="344" x="390" y="206" fill="#fff" rx="4"/>
    <rect width="341" height="343" x="390.5" y="206.5" stroke="#3E3E5F" stroke-opacity=".16" rx="3.5"/>
    <g filter="url(#prefix__filter1_d)">
        <rect width="358" height="64" x="382" y="410" fill="#fff" rx="4"/>
        <rect width="357" height="63" x="382.5" y="410.5" stroke="#4CECC9" rx="3.5"/>
    </g>
    <path fill="#3E3E5F" d="M464.201 256c2.548 0 4.059-1.253 4.059-3.362 0-1.585-1.038-2.706-2.673-2.913v-.133c1.154-.208 2.067-1.337 2.067-2.582 0-1.834-1.345-2.988-3.545-2.988h-4.582V256h4.674zm-3.18-10.658h2.773c1.486 0 2.349.705 2.349 1.926 0 1.27-.921 1.917-2.731 1.917h-2.391v-3.843zm0 9.338v-4.208h2.814c1.91 0 2.889.705 2.889 2.091 0 1.387-.946 2.117-2.747 2.117h-2.956zm9.58 1.32h1.427v-5.296c0-1.511.88-2.523 2.482-2.523 1.353 0 2.067.788 2.067 2.374V256h1.428v-5.794c0-2.1-1.195-3.312-3.088-3.312-1.37 0-2.308.581-2.756 1.569h-.133v-4.964h-1.427V256zm12.766-1.096c-1.037 0-1.809-.531-1.809-1.444 0-.897.597-1.37 1.959-1.461l2.407-.158v.822c0 1.278-1.088 2.241-2.557 2.241zm-.265 1.254c1.195 0 2.174-.523 2.755-1.478h.133V256h1.362v-6.126c0-1.859-1.221-2.98-3.404-2.98-1.909 0-3.32.946-3.511 2.382h1.444c.2-.705.947-1.112 2.017-1.112 1.337 0 2.026.606 2.026 1.71v.814l-2.582.157c-2.083.125-3.262 1.046-3.262 2.648 0 1.635 1.287 2.665 3.022 2.665zm6.889-.158h1.428v-5.545c0-1.262.988-2.175 2.349-2.175.282 0 .797.05.913.083v-1.427c-.182-.025-.481-.042-.714-.042-1.187 0-2.216.614-2.482 1.486h-.132v-1.328h-1.362V256zm9.231-1.096c-1.038 0-1.81-.531-1.81-1.444 0-.897.598-1.37 1.959-1.461l2.407-.158v.822c0 1.278-1.087 2.241-2.556 2.241zm-.266 1.254c1.195 0 2.175-.523 2.756-1.478h.133V256h1.361v-6.126c0-1.859-1.22-2.98-3.403-2.98-1.909 0-3.321.946-3.511 2.382h1.444c.199-.705.946-1.112 2.017-1.112 1.336 0 2.025.606 2.025 1.71v.814l-2.581.157c-2.084.125-3.262 1.046-3.262 2.648 0 1.635 1.286 2.665 3.021 2.665zm7.487-11.422v2.316h-1.444v1.195h1.444v5.429c0 1.71.739 2.39 2.582 2.39.282 0 .556-.033.838-.083v-1.203c-.265.025-.406.033-.664.033-.929 0-1.328-.448-1.328-1.502v-5.064h1.992v-1.195h-1.992v-2.316h-1.428zM512.104 256h1.428v-5.296c0-1.511.88-2.523 2.482-2.523 1.353 0 2.067.788 2.067 2.374V256h1.428v-5.794c0-2.1-1.196-3.312-3.088-3.312-1.37 0-2.308.581-2.756 1.569h-.133v-4.964h-1.428V256zm19.931 0l4.416-11.978h-1.569l-3.52 10.044h-.133l-3.519-10.044h-1.569L530.557 256h1.478zm9.072-7.844c1.42 0 2.366 1.046 2.399 2.631h-4.93c.108-1.585 1.104-2.631 2.531-2.631zm2.358 5.528c-.374.789-1.154 1.212-2.308 1.212-1.519 0-2.507-1.121-2.581-2.889v-.066h6.433v-.548c0-2.781-1.469-4.499-3.885-4.499-2.457 0-4.034 1.826-4.034 4.64 0 2.831 1.552 4.624 4.034 4.624 1.959 0 3.337-.938 3.769-2.474h-1.428zM547.25 256h1.428v-5.545c0-1.262.905-2.274 2.075-2.274 1.129 0 1.868.68 1.868 1.743V256h1.427v-5.752c0-1.138.83-2.067 2.076-2.067 1.261 0 1.884.647 1.884 1.967V256h1.428v-6.184c0-1.876-1.021-2.922-2.848-2.922-1.236 0-2.257.623-2.739 1.569h-.133c-.415-.93-1.261-1.569-2.473-1.569-1.196 0-2.092.573-2.499 1.569h-.133v-1.411h-1.361V256zm22.03-8.948h-1.427v5.296c0 1.569-.864 2.506-2.441 2.506-1.428 0-2.025-.747-2.025-2.357v-5.445h-1.428v5.794c0 2.116 1.046 3.312 3.055 3.312 1.369 0 2.324-.565 2.772-1.561h.133V256h1.361v-8.948zm2.773 8.948h1.427v-12.501h-1.427V256zm6.956-1.096c-1.038 0-1.81-.531-1.81-1.444 0-.897.598-1.37 1.959-1.461l2.407-.158v.822c0 1.278-1.087 2.241-2.556 2.241zm-.266 1.254c1.195 0 2.175-.523 2.756-1.478h.133V256h1.361v-6.126c0-1.859-1.22-2.98-3.403-2.98-1.909 0-3.32.946-3.511 2.382h1.444c.199-.705.946-1.112 2.017-1.112 1.336 0 2.025.606 2.025 1.71v.814l-2.581.157c-2.084.125-3.262 1.046-3.262 2.648 0 1.635 1.286 2.665 3.021 2.665zM461.021 309.35h2.881c1.544 0 2.473.855 2.473 2.291 0 1.469-.871 2.291-2.407 2.291h-2.947v-4.582zm0 5.91h2.947l2.565 4.74h1.752l-2.773-4.972c1.503-.473 2.407-1.768 2.407-3.437 0-2.158-1.51-3.569-3.818-3.569h-4.574V320h1.494v-4.74zm12.186 3.644c-1.038 0-1.81-.531-1.81-1.444 0-.897.598-1.37 1.959-1.461l2.408-.158v.822c0 1.278-1.088 2.241-2.557 2.241zm-.266 1.254c1.196 0 2.175-.523 2.756-1.478h.133V320h1.361v-6.126c0-1.859-1.22-2.98-3.403-2.98-1.909 0-3.32.946-3.511 2.382h1.444c.199-.705.946-1.112 2.017-1.112 1.337 0 2.026.606 2.026 1.71v.814l-2.582.157c-2.083.125-3.262 1.046-3.262 2.648 0 1.635 1.287 2.665 3.021 2.665zm6.973-.158h1.428v-5.296c0-1.511.88-2.523 2.482-2.523 1.353 0 2.067.788 2.067 2.374V320h1.427v-5.794c0-2.1-1.195-3.312-3.088-3.312-1.369 0-2.307.581-2.755 1.569h-.133v-4.964h-1.428V320zm17.249-8.948h-1.428v5.296c0 1.569-.863 2.506-2.44 2.506-1.428 0-2.025-.747-2.025-2.357v-5.445h-1.428v5.794c0 2.116 1.046 3.312 3.054 3.312 1.37 0 2.325-.565 2.773-1.561h.133V320h1.361v-8.948zm2.773 8.948h1.427v-12.501h-1.427V320zm10.674 0v-11.978h-1.494V320h1.494zm2.665-6.5c0 1.295.764 2.018 2.44 2.424l1.536.374c.955.232 1.419.647 1.419 1.262 0 .821-.863 1.394-2.066 1.394-1.146 0-1.86-.481-2.101-1.237h-1.469c.158 1.486 1.528 2.441 3.52 2.441 2.033 0 3.586-1.104 3.586-2.706 0-1.287-.814-2.017-2.499-2.424l-1.378-.332c-1.054-.258-1.552-.639-1.552-1.254 0-.796.83-1.336 1.893-1.336 1.079 0 1.776.473 1.967 1.187h1.411c-.191-1.469-1.494-2.399-3.37-2.399-1.901 0-3.337 1.121-3.337 2.606zm9.189 6.5h1.428v-12.501h-1.428V320zm6.956-1.096c-1.038 0-1.81-.531-1.81-1.444 0-.897.598-1.37 1.959-1.461l2.408-.158v.822c0 1.278-1.088 2.241-2.557 2.241zm-.266 1.254c1.196 0 2.175-.523 2.756-1.478h.133V320h1.361v-6.126c0-1.859-1.22-2.98-3.403-2.98-1.909 0-3.32.946-3.511 2.382h1.444c.199-.705.946-1.112 2.017-1.112 1.337 0 2.026.606 2.026 1.71v.814l-2.582.157c-2.083.125-3.262 1.046-3.262 2.648 0 1.635 1.286 2.665 3.021 2.665zm6.89-.158h1.428v-5.545c0-1.262.904-2.274 2.075-2.274 1.129 0 1.868.68 1.868 1.743V320h1.427v-5.752c0-1.138.83-2.067 2.075-2.067 1.262 0 1.885.647 1.885 1.967V320h1.427v-6.184c0-1.876-1.021-2.922-2.847-2.922-1.236 0-2.257.623-2.739 1.569h-.133c-.415-.93-1.261-1.569-2.473-1.569-1.196 0-2.092.573-2.499 1.569h-.133v-1.411h-1.361V320zM458.955 380.871c.157 2.067 1.909 3.411 4.449 3.411 2.739 0 4.474-1.403 4.474-3.602 0-1.76-.996-2.723-3.478-3.346l-1.254-.332c-1.651-.423-2.307-.962-2.307-1.9 0-1.212 1.054-2.009 2.648-2.009 1.494 0 2.507.73 2.714 1.959h1.503c-.125-1.934-1.851-3.312-4.167-3.312-2.532 0-4.234 1.378-4.234 3.411 0 1.702.938 2.682 3.105 3.229l1.535.399c1.652.415 2.399 1.062 2.399 2.083 0 1.187-1.187 2.059-2.797 2.059-1.702 0-2.897-.797-3.08-2.05h-1.51zM470.186 384h1.427v-5.545c0-1.262.988-2.175 2.349-2.175.283 0 .797.05.913.083v-1.427c-.182-.025-.481-.042-.713-.042-1.187 0-2.217.614-2.482 1.486h-.133v-1.328h-1.361V384zm13.712-8.948h-1.427v5.296c0 1.569-.864 2.506-2.441 2.506-1.427 0-2.025-.747-2.025-2.357v-5.445h-1.428v5.794c0 2.116 1.046 3.312 3.055 3.312 1.369 0 2.324-.565 2.772-1.561h.133V384h1.361v-8.948zm4.151 0h-1.428v9.413c0 .988-.332 1.386-1.345 1.386h-.215v1.22h.249c1.876 0 2.739-.788 2.739-2.631v-9.388zm-.714-1.818c.548 0 .996-.448.996-.996s-.448-.996-.996-.996-.996.448-.996.996.448.996.996.996zm6.192 9.67c-1.037 0-1.809-.531-1.809-1.444 0-.897.597-1.37 1.959-1.461l2.407-.158v.822c0 1.278-1.087 2.241-2.557 2.241zm-.265 1.254c1.195 0 2.175-.523 2.756-1.478h.132V384h1.362v-6.126c0-1.859-1.22-2.98-3.404-2.98-1.909 0-3.32.946-3.511 2.382h1.445c.199-.705.946-1.112 2.017-1.112 1.336 0 2.025.606 2.025 1.71v.814l-2.582.157c-2.083.125-3.262 1.046-3.262 2.648 0 1.635 1.287 2.665 3.022 2.665zm6.889-.158h1.428v-5.296c0-1.569.921-2.523 2.349-2.523 1.428 0 2.109.763 2.109 2.374V384h1.427v-5.794c0-2.125-1.12-3.312-3.129-3.312-1.37 0-2.241.581-2.689 1.569h-.133v-1.411h-1.362V384zm14.336-3.129c.158 2.067 1.909 3.411 4.449 3.411 2.739 0 4.474-1.403 4.474-3.602 0-1.76-.996-2.723-3.478-3.346l-1.253-.332c-1.652-.423-2.308-.962-2.308-1.9 0-1.212 1.054-2.009 2.648-2.009 1.494 0 2.507.73 2.714 1.959h1.503c-.125-1.934-1.851-3.312-4.167-3.312-2.532 0-4.234 1.378-4.234 3.411 0 1.702.938 2.682 3.105 3.229l1.536.399c1.651.415 2.399 1.062 2.399 2.083 0 1.187-1.187 2.059-2.798 2.059-1.702 0-2.897-.797-3.079-2.05h-1.511zm13.987 2.033c-1.038 0-1.81-.531-1.81-1.444 0-.897.598-1.37 1.959-1.461l2.407-.158v.822c0 1.278-1.087 2.241-2.556 2.241zm-.266 1.254c1.195 0 2.175-.523 2.756-1.478h.133V384h1.361v-6.126c0-1.859-1.22-2.98-3.403-2.98-1.909 0-3.321.946-3.512 2.382h1.445c.199-.705.946-1.112 2.017-1.112 1.336 0 2.025.606 2.025 1.71v.814l-2.581.157c-2.084.125-3.262 1.046-3.262 2.648 0 1.635 1.286 2.665 3.021 2.665zm10.509-1.553c-1.66 0-2.59-1.261-2.59-3.212 0-1.951.93-3.212 2.59-3.212 1.652 0 2.656 1.261 2.656 3.212 0 1.951-.996 3.212-2.656 3.212zm.066 4.832c2.441 0 3.985-1.279 3.985-3.279v-9.106h-1.362v1.419h-.133c-.514-.963-1.618-1.577-2.872-1.577-2.299 0-3.752 1.818-3.752 4.499 0 2.681 1.436 4.474 3.752 4.474 1.229 0 2.242-.556 2.806-1.544h.133v1.76c0 1.32-.955 2.108-2.557 2.108-1.286 0-2.083-.473-2.241-1.203h-1.511c.216 1.477 1.594 2.449 3.752 2.449zm9.43-4.533c-1.038 0-1.81-.531-1.81-1.444 0-.897.598-1.37 1.959-1.461l2.408-.158v.822c0 1.278-1.088 2.241-2.557 2.241zm-.266 1.254c1.196 0 2.175-.523 2.756-1.478h.133V384h1.361v-6.126c0-1.859-1.22-2.98-3.403-2.98-1.909 0-3.32.946-3.511 2.382h1.444c.199-.705.946-1.112 2.017-1.112 1.337 0 2.026.606 2.026 1.71v.814l-2.582.157c-2.084.125-3.262 1.046-3.262 2.648 0 1.635 1.286 2.665 3.021 2.665zm6.89-.158h1.428v-5.545c0-1.262.987-2.175 2.349-2.175.282 0 .797.05.913.083v-1.427c-.183-.025-.482-.042-.714-.042-1.187 0-2.216.614-2.482 1.486h-.133v-1.328h-1.361V384zM458.714 445.203c0 1.834 1.411 3.079 3.42 3.079 2.166 0 3.486-1.336 3.486-3.619v-8.641h-1.494v8.633c0 1.469-.722 2.249-2.001 2.249-1.128 0-1.892-.697-1.925-1.701h-1.486zm12.534 1.701c-1.038 0-1.81-.531-1.81-1.444 0-.897.598-1.37 1.959-1.461l2.408-.158v.822c0 1.278-1.088 2.241-2.557 2.241zm-.266 1.254c1.196 0 2.175-.523 2.756-1.478h.133V448h1.361v-6.126c0-1.859-1.22-2.98-3.403-2.98-1.909 0-3.32.946-3.511 2.382h1.444c.199-.705.946-1.112 2.017-1.112 1.337 0 2.026.606 2.026 1.71v.814l-2.582.157c-2.083.125-3.262 1.046-3.262 2.648 0 1.635 1.287 2.665 3.021 2.665zm6.89-.158h1.428v-5.296c0-1.569.921-2.523 2.349-2.523 1.428 0 2.108.763 2.108 2.374V448h1.428v-5.794c0-2.125-1.121-3.312-3.129-3.312-1.37 0-2.242.581-2.69 1.569h-.133v-1.411h-1.361V448zm9.72-6.5c0 1.295.764 2.018 2.441 2.424l1.535.374c.955.232 1.42.647 1.42 1.262 0 .821-.863 1.394-2.067 1.394-1.146 0-1.859-.481-2.1-1.237h-1.469c.157 1.486 1.527 2.441 3.519 2.441 2.034 0 3.586-1.104 3.586-2.706 0-1.287-.813-2.017-2.499-2.424l-1.377-.332c-1.055-.258-1.553-.639-1.553-1.254 0-.796.83-1.336 1.893-1.336 1.079 0 1.776.473 1.967 1.187h1.411c-.191-1.469-1.494-2.399-3.37-2.399-1.901 0-3.337 1.121-3.337 2.606zm23.649 6.5v-11.978h-1.494v5.18h-6.574v-5.18h-1.494V448h1.494v-5.454h6.574V448h1.494zm2.482-3.129c.158 2.067 1.909 3.411 4.449 3.411 2.74 0 4.474-1.403 4.474-3.602 0-1.76-.996-2.723-3.478-3.346l-1.253-.332c-1.652-.423-2.308-.962-2.308-1.9 0-1.212 1.055-2.009 2.648-2.009 1.495 0 2.507.73 2.715 1.959h1.502c-.124-1.934-1.851-3.312-4.167-3.312-2.532 0-4.233 1.378-4.233 3.411 0 1.702.938 2.682 3.104 3.229l1.536.399c1.652.415 2.399 1.062 2.399 2.083 0 1.187-1.187 2.059-2.798 2.059-1.701 0-2.896-.797-3.079-2.05h-1.511zM469.09 512v-11.978h-1.494v5.18h-6.575v-5.18h-1.494V512h1.494v-5.454h6.575V512h1.494zm5.628-1.096c-1.038 0-1.81-.531-1.81-1.444 0-.897.598-1.37 1.959-1.461l2.407-.158v.822c0 1.278-1.087 2.241-2.556 2.241zm-.266 1.254c1.195 0 2.175-.523 2.756-1.478h.133V512h1.361v-6.126c0-1.859-1.22-2.98-3.403-2.98-1.909 0-3.32.946-3.511 2.382h1.444c.199-.705.946-1.112 2.017-1.112 1.336 0 2.025.606 2.025 1.71v.814l-2.581.157c-2.084.125-3.262 1.046-3.262 2.648 0 1.635 1.286 2.665 3.021 2.665zm6.89-.158h1.428v-5.545c0-1.262.987-2.175 2.349-2.175.282 0 .797.05.913.083v-1.427c-.183-.025-.482-.042-.714-.042-1.187 0-2.216.614-2.482 1.486h-.133v-1.328h-1.361V512zm6.508 0h1.427v-8.948h-1.427V512zm.713-10.766c.548 0 .997-.448.997-.996s-.449-.996-.997-.996c-.547 0-.996.448-.996.996s.449.996.996.996zM498.475 512v-4.184l1.436-1.585 4.324 5.769h1.934l-5.229-6.807 4.789-5.171h-1.875l-5.247 5.819h-.132v-5.819h-1.495V512h1.495zm9.529 0h1.428v-5.545c0-1.262.987-2.175 2.349-2.175.282 0 .797.05.913.083v-1.427c-.183-.025-.482-.042-.714-.042-1.187 0-2.216.614-2.482 1.486h-.133v-1.328h-1.361V512zm6.508 0h1.427v-8.948h-1.427V512zm.714-10.766c.547 0 .996-.448.996-.996s-.449-.996-.996-.996c-.548 0-.997.448-.997.996s.449.996.997.996zm3.229 4.266c0 1.295.763 2.018 2.44 2.424l1.536.374c.954.232 1.419.647 1.419 1.262 0 .821-.863 1.394-2.067 1.394-1.145 0-1.859-.481-2.1-1.237h-1.469c.158 1.486 1.527 2.441 3.519 2.441 2.034 0 3.586-1.104 3.586-2.706 0-1.287-.813-2.017-2.498-2.424l-1.378-.332c-1.054-.258-1.552-.639-1.552-1.254 0-.796.83-1.336 1.892-1.336 1.079 0 1.777.473 1.967 1.187h1.412c-.191-1.469-1.495-2.399-3.37-2.399-1.901 0-3.337 1.121-3.337 2.606zm9.189 6.5h1.427v-5.296c0-1.511.88-2.523 2.482-2.523 1.353 0 2.067.788 2.067 2.374V512h1.428v-5.794c0-2.1-1.195-3.312-3.088-3.312-1.37 0-2.308.581-2.756 1.569h-.133v-4.964h-1.427V512zm10.01 0h1.428v-5.296c0-1.569.921-2.523 2.349-2.523 1.428 0 2.109.763 2.109 2.374V512h1.427v-5.794c0-2.125-1.12-3.312-3.129-3.312-1.37 0-2.241.581-2.69 1.569h-.132v-1.411h-1.362V512zm12.684-1.096c-1.038 0-1.81-.531-1.81-1.444 0-.897.598-1.37 1.959-1.461l2.408-.158v.822c0 1.278-1.088 2.241-2.557 2.241zm-.266 1.254c1.196 0 2.175-.523 2.756-1.478h.133V512h1.361v-6.126c0-1.859-1.22-2.98-3.403-2.98-1.909 0-3.32.946-3.511 2.382h1.444c.199-.705.946-1.112 2.017-1.112 1.337 0 2.026.606 2.026 1.71v.814l-2.582.157c-2.084.125-3.262 1.046-3.262 2.648 0 1.635 1.286 2.665 3.021 2.665zM609.262 247.392v.008h1.444v-.008c0-1.411.946-2.349 2.349-2.349 1.32 0 2.341.921 2.341 2.117 0 .963-.374 1.61-1.917 3.287l-4.143 4.524V256h7.753v-1.345h-5.611v-.133l2.88-3.096c1.968-2.108 2.532-3.079 2.532-4.324 0-1.901-1.643-3.362-3.793-3.362-2.225 0-3.835 1.527-3.835 3.652zm14.302 8.89c2.482 0 4.184-1.66 4.184-4.092 0-2.357-1.594-4.009-3.869-4.009-1.104 0-1.95.34-2.531 1.021h-.133l.34-3.844h5.512v-1.336h-6.682l-.656 6.79h1.403c.49-.855 1.386-1.345 2.473-1.345 1.569 0 2.648 1.121 2.648 2.764 0 1.644-1.07 2.74-2.672 2.74-1.412 0-2.441-.864-2.574-2.159h-1.469c.133 2.067 1.76 3.47 4.026 3.47zm10.666 0c2.541 0 4.317-1.436 4.317-3.486 0-1.561-.988-2.773-2.49-3.055v-.133c1.236-.34 2-1.361 2-2.672 0-1.868-1.585-3.196-3.827-3.196-2.241 0-3.826 1.328-3.826 3.196 0 1.303.78 2.34 2 2.672v.133c-1.502.282-2.49 1.494-2.49 3.055 0 2.05 1.776 3.486 4.316 3.486zm0-1.278c-1.66 0-2.805-.946-2.805-2.316 0-1.37 1.145-2.316 2.805-2.316 1.661 0 2.806.946 2.806 2.316 0 1.37-1.145 2.316-2.806 2.316zm0-5.894c-1.411 0-2.357-.813-2.357-2.033 0-1.237.938-2.059 2.357-2.059 1.42 0 2.358.822 2.358 2.059 0 1.22-.946 2.033-2.358 2.033zm18.76 6.89v-11.978h-1.735l-4.1 9.911h-.133l-4.101-9.911h-1.734V256h1.394v-9.147h.1l3.777 9.064h1.261l3.777-9.064h.1V256h1.394zM609.262 311.392v.008h1.444v-.008c0-1.411.946-2.349 2.349-2.349 1.32 0 2.341.921 2.341 2.117 0 .963-.374 1.61-1.917 3.287l-4.143 4.524V320h7.753v-1.345h-5.611v-.133l2.88-3.096c1.968-2.108 2.532-3.079 2.532-4.324 0-1.901-1.643-3.362-3.793-3.362-2.225 0-3.835 1.527-3.835 3.652zm14.302 8.89c2.482 0 4.184-1.66 4.184-4.092 0-2.357-1.594-4.009-3.869-4.009-1.104 0-1.95.34-2.531 1.021h-.133l.34-3.844h5.512v-1.336h-6.682l-.656 6.79h1.403c.49-.855 1.386-1.345 2.473-1.345 1.569 0 2.648 1.121 2.648 2.764 0 1.644-1.07 2.74-2.672 2.74-1.412 0-2.441-.864-2.574-2.159h-1.469c.133 2.067 1.76 3.47 4.026 3.47zm10.525 0c2.482 0 4.184-1.66 4.184-4.092 0-2.357-1.594-4.009-3.868-4.009-1.104 0-1.951.34-2.532 1.021h-.133l.341-3.844h5.511v-1.336h-6.682l-.656 6.79h1.403c.49-.855 1.386-1.345 2.474-1.345 1.569 0 2.648 1.121 2.648 2.764 0 1.644-1.071 2.74-2.673 2.74-1.411 0-2.44-.864-2.573-2.159h-1.47c.133 2.067 1.76 3.47 4.026 3.47zm18.569-.282v-11.978h-1.735l-4.1 9.911h-.133l-4.101-9.911h-1.735V320h1.395v-9.147h.1l3.776 9.064h1.262l3.777-9.064h.1V320h1.394zM609.262 375.392v.008h1.444v-.008c0-1.411.946-2.349 2.349-2.349 1.32 0 2.341.921 2.341 2.117 0 .963-.374 1.61-1.917 3.287l-4.143 4.524V384h7.753v-1.345h-5.611v-.133l2.88-3.096c1.968-2.108 2.532-3.079 2.532-4.324 0-1.901-1.643-3.362-3.793-3.362-2.225 0-3.835 1.527-3.835 3.652zm14.302 8.89c2.482 0 4.184-1.66 4.184-4.092 0-2.357-1.594-4.009-3.869-4.009-1.104 0-1.95.34-2.531 1.021h-.133l.34-3.844h5.512v-1.336h-6.682l-.656 6.79h1.403c.49-.855 1.386-1.345 2.473-1.345 1.569 0 2.648 1.121 2.648 2.764 0 1.644-1.07 2.74-2.672 2.74-1.412 0-2.441-.864-2.574-2.159h-1.469c.133 2.067 1.76 3.47 4.026 3.47zm9.438-.282h1.494v-11.978h-1.486l-3.187 2.291v1.577l3.046-2.208h.133V384zm17.066 0v-11.978h-1.735l-4.1 9.911h-.133l-4.1-9.911h-1.735V384h1.394v-9.147h.1l3.777 9.064h1.261l3.777-9.064h.1V384h1.394zM609.262 439.392v.008h1.444v-.008c0-1.411.946-2.349 2.349-2.349 1.32 0 2.341.921 2.341 2.117 0 .963-.374 1.61-1.917 3.287l-4.143 4.524V448h7.753v-1.345h-5.611v-.133l2.88-3.096c1.968-2.108 2.532-3.079 2.532-4.324 0-1.901-1.643-3.362-3.793-3.362-2.225 0-3.835 1.527-3.835 3.652zM624.834 448h1.461v-2.482h1.702v-1.336h-1.702v-8.16h-2.167c-2.158 3.229-4.059 6.234-5.129 8.135v1.361h5.835V448zm-4.308-3.91c1.428-2.423 2.988-4.897 4.217-6.682h.099v6.782h-4.316v-.1zm13.605 4.184c2.93 0 4.607-2.357 4.607-6.475 0-1.32-.191-2.424-.581-3.337-.747-1.768-2.134-2.722-3.927-2.722-2.457 0-4.2 1.718-4.2 4.125 0 2.324 1.652 4.01 3.935 4.01 1.428 0 2.598-.681 3.187-1.843h.133c-.083 3.187-1.187 4.914-3.138 4.914-1.178 0-2.083-.681-2.407-1.801h-1.535c.381 1.925 1.892 3.129 3.926 3.129zm.099-5.694c-1.585 0-2.689-1.129-2.689-2.765 0-1.568 1.17-2.764 2.706-2.764s2.706 1.212 2.706 2.814c0 1.586-1.137 2.715-2.723 2.715zm18.91 5.42v-11.978h-1.735l-4.101 9.911h-.133l-4.1-9.911h-1.735V448h1.394v-9.147h.1l3.777 9.064h1.262l3.777-9.064h.099V448h1.395zM609.262 503.392v.008h1.444v-.008c0-1.411.946-2.349 2.349-2.349 1.32 0 2.341.921 2.341 2.117 0 .963-.374 1.61-1.917 3.287l-4.143 4.524V512h7.753v-1.345h-5.611v-.133l2.88-3.096c1.968-2.108 2.532-3.079 2.532-4.324 0-1.901-1.643-3.362-3.793-3.362-2.225 0-3.835 1.527-3.835 3.652zM624.834 512h1.461v-2.482h1.702v-1.336h-1.702v-8.16h-2.167c-2.158 3.229-4.059 6.234-5.129 8.135v1.361h5.835V512zm-4.308-3.91c1.428-2.423 2.988-4.897 4.217-6.682h.099v6.782h-4.316v-.1zm13.729 4.192c2.482 0 4.184-1.66 4.184-4.092 0-2.357-1.594-4.009-3.868-4.009-1.104 0-1.951.34-2.532 1.021h-.133l.341-3.844h5.511v-1.336h-6.682l-.656 6.79h1.403c.49-.855 1.386-1.345 2.474-1.345 1.569 0 2.648 1.121 2.648 2.764 0 1.644-1.071 2.74-2.673 2.74-1.411 0-2.44-.864-2.573-2.159h-1.47c.133 2.067 1.76 3.47 4.026 3.47zm18.569-.282v-11.978h-1.735l-4.1 9.911h-.133l-4.101-9.911h-1.734V512h1.394v-9.147h.1l3.777 9.064h1.261l3.777-9.064h.1V512h1.394zM692.834 256h1.569l5.329-10.592v-1.386h-7.927v1.336h6.408v.117L692.834 256zm12.062 0h1.494v-11.978h-1.486l-3.188 2.291v1.577l3.047-2.208h.133V256zm10.542 0h1.46v-2.482h1.702v-1.336h-1.702v-8.16h-2.166c-2.158 3.229-4.059 6.234-5.13 8.135v1.361h5.836V256zm-4.309-3.91c1.428-2.423 2.989-4.897 4.217-6.682h.1v6.782h-4.317v-.1zM692.834 320h1.569l5.329-10.592v-1.386h-7.927v1.336h6.408v.117L692.834 320zm12.062 0h1.494v-11.978h-1.486l-3.188 2.291v1.577l3.047-2.208h.133V320zm9.022.282c2.482 0 4.184-1.66 4.184-4.092 0-2.357-1.594-4.009-3.868-4.009-1.104 0-1.951.34-2.532 1.021h-.133l.341-3.844h5.511v-1.336h-6.682l-.656 6.79h1.403c.49-.855 1.387-1.345 2.474-1.345 1.569 0 2.648 1.121 2.648 2.764 0 1.644-1.071 2.74-2.673 2.74-1.411 0-2.44-.864-2.573-2.159h-1.469c.132 2.067 1.759 3.47 4.025 3.47zM692.834 384h1.569l5.329-10.592v-1.386h-7.927v1.336h6.408v.117L692.834 384zm12.062 0h1.494v-11.978h-1.486l-3.188 2.291v1.577l3.047-2.208h.133V384zm9.305.274c2.457 0 4.2-1.718 4.2-4.126 0-2.324-1.652-4.009-3.935-4.009-1.427 0-2.598.681-3.187 1.843h-.133c.083-3.188 1.187-4.914 3.138-4.914 1.178 0 2.083.681 2.407 1.801h1.536c-.382-1.926-1.893-3.129-3.927-3.129-2.93 0-4.607 2.357-4.607 6.474 0 1.32.191 2.424.581 3.337.747 1.76 2.125 2.723 3.927 2.723zm-.017-1.312c-1.536 0-2.706-1.212-2.706-2.814 0-1.585 1.137-2.714 2.723-2.714 1.585 0 2.689 1.129 2.689 2.764 0 1.569-1.17 2.764-2.706 2.764zM692.834 448h1.569l5.329-10.592v-1.386h-7.927v1.336h6.408v.117L692.834 448zm12.062 0h1.494v-11.978h-1.486l-3.188 2.291v1.577l3.047-2.208h.133V448zm5.569 0h1.569l5.329-10.592v-1.386h-7.927v1.336h6.408v.117L710.465 448zM692.834 512h1.569l5.329-10.592v-1.386h-7.927v1.336h6.408v.117L692.834 512zm12.062 0h1.494v-11.978h-1.486l-3.188 2.291v1.577l3.047-2.208h.133V512zm9.164.282c2.54 0 4.316-1.436 4.316-3.486 0-1.561-.988-2.773-2.49-3.055v-.133c1.237-.34 2-1.361 2-2.672 0-1.868-1.585-3.196-3.826-3.196-2.242 0-3.827 1.328-3.827 3.196 0 1.303.78 2.34 2 2.672v.133c-1.502.282-2.49 1.494-2.49 3.055 0 2.05 1.777 3.486 4.317 3.486zm0-1.278c-1.661 0-2.806-.946-2.806-2.316 0-1.37 1.145-2.316 2.806-2.316 1.66 0 2.805.946 2.805 2.316 0 1.37-1.145 2.316-2.805 2.316zm0-5.894c-1.412 0-2.358-.813-2.358-2.033 0-1.237.938-2.059 2.358-2.059 1.419 0 2.357.822 2.357 2.059 0 1.22-.946 2.033-2.357 2.033z"/>
    <circle cx="426" cy="250" r="20" fill="url(#prefix__pattern1)"/>
    <circle cx="426" cy="314" r="20" fill="url(#prefix__pattern2)"/>
    <circle cx="426" cy="378" r="20" fill="url(#prefix__pattern3)"/>
    <circle cx="426" cy="442" r="20" fill="url(#prefix__pattern4)"/>
    <circle cx="426" cy="506" r="20" fill="url(#prefix__pattern5)"/>
    <path fill="#4CECC9" d="M689 410h46c2.209 0 4 1.791 4 4v13h-50v-17z"/>
    <path fill="#3E3E5F" d="M705.465 423v-3.639l3-4.816h-1.201l-2.28 3.756h-.093l-2.28-3.756h-1.201l3 4.816V423h1.055zm7.635-8.654c-2.391 0-3.885 1.705-3.885 4.424 0 2.707 1.459 4.429 3.885 4.429 2.414 0 3.867-1.728 3.867-4.429 0-2.713-1.465-4.424-3.867-4.424zm0 .972c1.728 0 2.783 1.336 2.783 3.452 0 2.097-1.049 3.457-2.783 3.457-1.758 0-2.801-1.36-2.801-3.457 0-2.116 1.078-3.452 2.801-3.452zm6.785-.773h-1.055v5.549c0 1.804 1.26 3.105 3.358 3.105 2.097 0 3.357-1.301 3.357-3.105v-5.549h-1.055v5.478c0 1.278-.838 2.204-2.302 2.204-1.465 0-2.303-.926-2.303-2.204v-5.478z"/>
    <path fill="#3E3E5F" fill-opacity=".5" d="M634.922 175.418h-6.797v-12.51h-1.758V177h8.555v-1.582zm5.449-7.275c1.602 0 2.666 1.211 2.705 2.91h-5.517c.107-1.69 1.22-2.91 2.812-2.91zm2.666 5.947c-.283.957-1.23 1.611-2.519 1.611-1.827 0-2.969-1.279-2.969-3.222v-.098h7.285v-.645c0-3.076-1.689-5.068-4.434-5.068-2.802 0-4.599 2.139-4.599 5.293 0 3.193 1.767 5.215 4.678 5.215 2.216 0 3.935-1.309 4.228-3.086h-1.67zm6.865 1.64c-1.22 0-2.031-.634-2.031-1.601 0-.957.781-1.563 2.149-1.65l2.714-.167v.831c0 1.464-1.23 2.587-2.832 2.587zm-.381 1.446c1.368 0 2.657-.762 3.262-1.924h.039V177h1.612v-7.021c0-2.022-1.504-3.311-3.887-3.311-2.402 0-3.906 1.348-4.024 3.105h1.641c.215-.996 1.035-1.611 2.344-1.611 1.406 0 2.226.742 2.226 1.983v.849l-2.91.166c-2.344.137-3.681 1.231-3.681 2.969 0 1.826 1.357 3.047 3.378 3.047zm10.918 0c1.465 0 2.627-.723 3.282-1.895h.029V177h1.621v-14.092h-1.699v5.586h-.039c-.606-1.113-1.778-1.826-3.233-1.826-2.558 0-4.306 2.07-4.306 5.254 0 3.183 1.758 5.254 4.345 5.254zm.323-9.014c1.748 0 2.92 1.494 2.92 3.76 0 2.275-1.172 3.76-2.92 3.76-1.797 0-2.93-1.455-2.93-3.76 0-2.295 1.133-3.76 2.93-3.76zm10.976-.019c1.602 0 2.666 1.211 2.705 2.91h-5.517c.107-1.69 1.22-2.91 2.812-2.91zm2.666 5.947c-.283.957-1.23 1.611-2.519 1.611-1.826 0-2.969-1.279-2.969-3.222v-.098h7.285v-.645c0-3.076-1.689-5.068-4.433-5.068-2.803 0-4.6 2.139-4.6 5.293 0 3.193 1.768 5.215 4.678 5.215 2.216 0 3.935-1.309 4.228-3.086h-1.67zm3.516 2.91h1.699v-6.328c0-1.436.86-2.383 2.178-2.383.41 0 .771.049.908.098v-1.651c-.137-.019-.391-.068-.684-.068-1.191 0-2.128.713-2.46 1.836h-.04v-1.66h-1.601V177zm11.221.176c2.597 0 4.316-2.061 4.316-5.254 0-3.184-1.728-5.254-4.287-5.254-1.436 0-2.617.713-3.252 1.875h-.039v-5.635h-1.699V177h1.621v-1.719h.039c.654 1.172 1.816 1.895 3.301 1.895zm-.332-9.014c1.796 0 2.91 1.455 2.91 3.76 0 2.324-1.114 3.76-2.91 3.76-1.719 0-2.94-1.494-2.94-3.76 0-2.256 1.221-3.76 2.94-3.76zm10.586 9.014c2.802 0 4.697-2.022 4.697-5.254 0-3.242-1.895-5.254-4.697-5.254-2.813 0-4.707 2.012-4.707 5.254 0 3.232 1.894 5.254 4.707 5.254zm0-1.494c-1.797 0-2.979-1.368-2.979-3.76 0-2.393 1.182-3.76 2.979-3.76 1.796 0 2.968 1.367 2.968 3.76 0 2.392-1.172 3.76-2.968 3.76zm9.765.048c-1.221 0-2.031-.634-2.031-1.601 0-.957.781-1.563 2.148-1.65l2.715-.167v.831c0 1.464-1.23 2.587-2.832 2.587zm-.381 1.446c1.367 0 2.657-.762 3.262-1.924h.039V177h1.611v-7.021c0-2.022-1.503-3.311-3.886-3.311-2.403 0-3.907 1.348-4.024 3.105h1.641c.215-.996 1.035-1.611 2.344-1.611 1.406 0 2.226.742 2.226 1.983v.849l-2.91.166c-2.344.137-3.682 1.231-3.682 2.969 0 1.826 1.358 3.047 3.379 3.047zm7.071-.176h1.699v-6.328c0-1.436.859-2.383 2.178-2.383.41 0 .771.049.908.098v-1.651c-.137-.019-.391-.068-.684-.068-1.191 0-2.129.713-2.461 1.836h-.039v-1.66h-1.601V177zm9.531.176c1.465 0 2.627-.723 3.281-1.895h.029V177h1.621v-14.092h-1.699v5.586h-.039c-.605-1.113-1.777-1.826-3.232-1.826-2.559 0-4.307 2.07-4.307 5.254 0 3.183 1.758 5.254 4.346 5.254zm.322-9.014c1.748 0 2.92 1.494 2.92 3.76 0 2.275-1.172 3.76-2.92 3.76-1.797 0-2.93-1.455-2.93-3.76 0-2.295 1.133-3.76 2.93-3.76z"/>
    <defs>
        <pattern id="prefix__pattern0" width=".769" height="2.222" patternContentUnits="objectBoundingBox">
            <use transform="scale(.00962 .02778)" xlink:href="#prefix__image0"/>
        </pattern>
        <pattern id="prefix__pattern1" width="1" height="1" patternContentUnits="objectBoundingBox">
            <use transform="scale(.005)" xlink:href="#prefix__image1"/>
        </pattern>
        <pattern id="prefix__pattern2" width="1" height="1" patternContentUnits="objectBoundingBox">
            <use transform="scale(.005)" xlink:href="#prefix__image2"/>
        </pattern>
        <pattern id="prefix__pattern3" width="1" height="1" patternContentUnits="objectBoundingBox">
            <use transform="scale(.005)" xlink:href="#prefix__image3"/>
        </pattern>
        <pattern id="prefix__pattern4" width="1" height="1" patternContentUnits="objectBoundingBox">
            <use transform="scale(.005)" xlink:href="#prefix__image4"/>
        </pattern>
        <pattern id="prefix__pattern5" width="1" height="1" patternContentUnits="objectBoundingBox">
            <use transform="scale(.005)" xlink:href="#prefix__image5"/>
        </pattern>
        <filter id="prefix__filter0_d" width="406" height="142" x="0" y="288.004" color-interpolation-filters="sRGB" filterUnits="userSpaceOnUse">
            <feFlood flood-opacity="0" result="BackgroundImageFix"/>
            <feColorMatrix in="SourceAlpha" values="0 0 0 0 0 0 0 0 0 0 0 0 0 0 0 0 0 0 127 0"/>
            <feOffset dx="2" dy="16"/>
            <feGaussianBlur stdDeviation="16"/>
            <feColorMatrix values="0 0 0 0 0 0 0 0 0 0 0 0 0 0 0 0 0 0 0.12 0"/>
            <feBlend in2="BackgroundImageFix" result="effect1_dropShadow"/>
            <feBlend in="SourceGraphic" in2="effect1_dropShadow" result="shape"/>
        </filter>
        <filter id="prefix__filter1_d" width="422" height="128" x="352" y="394" color-interpolation-filters="sRGB" filterUnits="userSpaceOnUse">
            <feFlood flood-opacity="0" result="BackgroundImageFix"/>
            <feColorMatrix in="SourceAlpha" values="0 0 0 0 0 0 0 0 0 0 0 0 0 0 0 0 0 0 127 0"/>
            <feOffset dx="2" dy="16"/>
            <feGaussianBlur stdDeviation="16"/>
            <feColorMatrix values="0 0 0 0 0 0 0 0 0 0 0 0 0 0 0 0 0 0 0.12 0"/>
            <feBlend in2="BackgroundImageFix" result="effect1_dropShadow"/>
            <feBlend in="SourceGraphic" in2="effect1_dropShadow" result="shape"/>
        </filter>
    </defs>
</svg>
