<svg width="21" height="20" viewBox="0 0 21 20" fill="none" xmlns="http://www.w3.org/2000/svg">
<g clip-path="url(#clip0)">
<path d="M12.3134 16.6667L11.4095 15.7267L16.2685 10.6667H2.05696V9.33334H16.2685L11.4095 4.27334L12.3134 3.33334L18.7236 10L12.3134 16.6667Z" fill="#C349CC"/>
</g>
<defs>
<clipPath id="clip0">
<path d="M0.390137 0H20.3901V20H0.390137V0Z" fill="white"/>
</clipPath>
</defs>
</svg>
