<svg width="48" height="48" viewBox="0 0 48 48" fill="none" xmlns="http://www.w3.org/2000/svg">
<circle cx="24" cy="24" r="24" fill="#00CC00"/>
<path d="M13.9626 12C14.4038 12 14.8132 12.23 15.0178 12.6138H15.0161L15.6288 13.7558L16.0377 13.8135L16.9568 12.8952C17.2977 12.5544 17.8583 12.4453 18.3421 12.6942C18.3499 12.6976 18.3555 12.7006 18.3607 12.7035L18.3589 12.7027L19.1044 13.1387C19.1113 13.1433 19.1169 13.1467 19.1221 13.1509L19.1212 13.15C19.5422 13.4306 19.7275 13.9487 19.5758 14.4252L19.1819 15.6544L19.4276 15.9788L20.7521 15.9657C20.7525 15.9657 20.753 15.9657 20.7538 15.9657C20.7547 15.9657 20.7551 15.9657 20.7556 15.9657C21.2554 15.9657 21.7018 16.2741 21.8664 16.7358C21.8668 16.7371 21.934 16.9207 22.0043 17.1933C22.0749 17.4667 22.1051 17.6605 22.1051 17.6605C22.1831 18.1483 21.9349 18.6289 21.4889 18.8568L20.3208 19.4559L20.2618 19.854L21.2011 20.7559C21.5665 21.1059 21.6484 21.6574 21.4066 22.1102C21.4032 22.1178 21.4002 22.1233 21.3972 22.1283L21.398 22.1267L20.952 22.8542C20.9473 22.8609 20.9439 22.8664 20.9395 22.8714L20.9404 22.8706C20.6526 23.2843 20.1247 23.4637 19.6361 23.315L19.6378 23.3167L18.3671 22.9367L18.0491 23.1672L18.0625 24.4604C18.0664 24.9512 17.7514 25.3931 17.2748 25.5549C17.2722 25.5557 17.0839 25.6227 16.8052 25.6914C16.5242 25.7609 16.3239 25.7899 16.3239 25.7899C16.323 25.7899 16.3217 25.7899 16.3204 25.7899C16.3191 25.7899 16.3178 25.7899 16.317 25.7899C16.2691 25.7958 16.264 25.803 16.1571 25.803C15.7146 25.803 15.3061 25.5705 15.1019 25.1875H15.1036L14.4909 24.0455L14.0837 23.9878L13.1629 24.9044C12.8212 25.2465 12.2584 25.3548 11.7758 25.1054C11.7689 25.102 11.7642 25.0991 11.759 25.0961L11.7607 25.097L11.0166 24.661C11.0097 24.6563 11.0041 24.653 10.9989 24.6487L10.9998 24.6496C10.5788 24.369 10.3935 23.8509 10.5452 23.3744L10.9373 22.1435L10.6947 21.8225L9.36672 21.8356C9.36629 21.8356 9.36586 21.8356 9.36499 21.8356C9.36413 21.8356 9.3637 21.8356 9.36327 21.8356C8.86344 21.8356 8.41833 21.5264 8.25416 21.0655C8.2533 21.063 8.18479 20.881 8.11455 20.608C8.04389 20.3342 8.01373 20.1392 8.01373 20.1392C7.93573 19.6513 8.18393 19.1707 8.6299 18.9428L9.79804 18.3437L9.85707 17.9486L8.91773 17.0467C8.55234 16.6966 8.47047 16.1452 8.7122 15.6923C8.71564 15.6848 8.71866 15.6793 8.72168 15.6742L8.72081 15.6759L9.16679 14.9471C9.17153 14.9404 9.17497 14.9349 9.17928 14.9299L9.17842 14.9307C9.46582 14.5191 9.99237 14.3367 10.481 14.4846H10.4827L11.75 14.8663L12.0697 14.6341L12.0563 13.3409C12.0525 12.8488 12.3696 12.4082 12.8457 12.2464C12.8483 12.2456 13.0357 12.1803 13.3137 12.1116C13.5942 12.0421 13.795 12.0114 13.795 12.0114C13.7958 12.0114 13.7971 12.0114 13.7984 12.0114C13.7997 12.0114 13.801 12.0114 13.8019 12.0114C13.8687 12.0029 13.8743 12 13.9617 12H13.9626ZM13.8346 13.4331C13.7816 13.4445 13.7325 13.4555 13.6614 13.4727C13.5912 13.4896 13.5446 13.5026 13.4929 13.517L13.5045 14.6771C13.5084 15.1161 13.2913 15.5209 12.9254 15.7551L12.6139 15.9805C12.2709 16.2644 11.8038 16.3588 11.3716 16.2257V16.2273L10.2625 15.8899L10.0755 16.1945L10.9071 16.9911C10.9076 16.9911 10.9076 16.9911 10.908 16.9911C10.9084 16.9911 10.9084 16.9911 10.9089 16.9911C11.2282 17.2994 11.3686 17.7354 11.276 18.1546L11.2812 18.1331L11.2187 18.551L11.2204 18.5312C11.1816 18.9685 10.9166 19.356 10.5185 19.5595L9.46798 20.0991C9.47918 20.151 9.48909 20.199 9.50676 20.2685C9.52442 20.3376 9.53907 20.3826 9.55372 20.4332L10.7456 20.4201C10.746 20.4201 10.7464 20.4201 10.7473 20.4201C10.7481 20.4201 10.7486 20.4201 10.749 20.4201C11.1941 20.4201 11.6039 20.6312 11.8413 20.9863L12.0852 21.3107L12.0701 21.2926C12.3605 21.6279 12.4571 22.085 12.3226 22.5054L11.974 23.5914L12.2856 23.7742L13.1034 22.9612C13.3546 22.7118 13.7041 22.5795 14.0677 22.5795C14.1505 22.5795 14.2108 22.5808 14.3017 22.6027L14.2715 22.5959L14.699 22.657L14.6787 22.6553C15.1256 22.6933 15.522 22.9515 15.7305 23.3399L16.2808 24.3682C16.3338 24.3572 16.3838 24.348 16.4557 24.3303C16.5255 24.3134 16.5716 24.2987 16.6225 24.2843L16.6108 23.1242C16.607 22.6852 16.8241 22.2804 17.1899 22.0462L17.1731 22.0559L17.52 21.8057L17.5015 21.8204C17.7423 21.6203 18.0547 21.5209 18.3766 21.5209C18.5042 21.5209 18.627 21.5386 18.7437 21.5735C18.7442 21.5735 18.7442 21.5735 18.7446 21.5735C18.745 21.5735 18.745 21.5735 18.7455 21.5735L19.8563 21.911L20.0416 21.6081L19.21 20.8098C19.2095 20.8098 19.2095 20.8098 19.2091 20.8098C19.2087 20.8098 19.2087 20.8098 19.2082 20.8098C18.8898 20.5019 18.7485 20.0667 18.8411 19.648L18.8359 19.6695L18.8984 19.2516L18.8967 19.2714C18.9355 18.8341 19.2005 18.4465 19.5986 18.2431L20.6491 17.7034C20.6379 17.6516 20.628 17.6036 20.6103 17.5341C20.5927 17.465 20.578 17.4199 20.5634 17.3694L19.3715 17.3824C19.3711 17.3824 19.3702 17.3824 19.3698 17.3824C19.3694 17.3824 19.3685 17.3824 19.3681 17.3824C18.923 17.3824 18.5132 17.1714 18.2758 16.8163L18.0302 16.4906L18.0453 16.5087C17.7544 16.173 17.6605 15.7151 17.7945 15.2959L18.1413 14.2099L17.8298 14.0288L17.0133 14.8401C17.0133 14.8406 17.0133 14.8406 17.0133 14.841C17.0133 14.8414 17.0133 14.8414 17.0133 14.8418C16.7612 15.092 16.4109 15.2235 16.0472 15.2235C15.9645 15.2235 15.9029 15.2214 15.815 15.2003L15.8451 15.207L15.416 15.1447L15.4362 15.1464C14.9894 15.1085 14.5943 14.8494 14.3857 14.4618L13.8346 13.4331ZM19.1669 15.7058C19.1738 15.7037 19.1552 15.7256 19.1669 15.7058V15.7058ZM15.0601 16.3769C16.4803 16.3769 17.6402 17.513 17.6402 18.9011C17.6402 20.2891 16.4798 21.4236 15.0601 21.4236C13.6407 21.4236 12.4782 20.2895 12.4782 18.9011C12.4782 17.5126 13.6398 16.3769 15.0601 16.3769ZM29.9675 16.3786C30.3691 16.3786 30.613 16.4017 30.6139 16.4017C30.6246 16.4017 30.6354 16.4026 30.6458 16.4034H30.6445C31.23 16.4548 31.7247 16.8748 31.863 17.4317L32.3292 19.3274C32.3292 19.3278 32.3292 19.3278 32.3292 19.3282C32.3292 19.3287 32.3292 19.3287 32.3292 19.3291C32.3219 19.2987 32.34 19.3472 32.3732 19.3817C32.4064 19.4163 32.4542 19.4428 32.449 19.4411C32.4572 19.4441 32.4628 19.4462 32.468 19.4487L32.4658 19.4479L33.0954 19.7027C33.104 19.7061 33.11 19.709 33.1161 19.712L33.1139 19.7112C33.0687 19.6897 33.1341 19.712 33.188 19.7095C33.2406 19.7069 33.2962 19.6821 33.2587 19.7044H33.2604L34.9603 18.6875C34.9607 18.6875 34.9607 18.6875 34.9611 18.6875C34.9616 18.6875 34.9615 18.6875 34.962 18.6875C35.4601 18.3909 36.1288 18.4415 36.5877 18.8438C36.5929 18.848 36.5972 18.8518 36.6015 18.8556L37.4831 19.7179C37.4874 19.7225 37.4917 19.7272 37.496 19.7322L37.4965 19.7326C37.8912 20.1661 37.9511 20.8119 37.6413 21.3073L36.5994 22.9725C36.6136 22.9502 36.5925 22.9936 36.5907 23.0399C36.589 23.0876 36.6045 23.1389 36.6024 23.1356C36.6041 23.1389 36.6063 23.144 36.6084 23.1499L36.6093 23.1524L36.8687 23.7662C36.8704 23.77 36.8725 23.7759 36.8747 23.7818L36.8756 23.7843C36.8657 23.7561 36.8906 23.8054 36.926 23.837C36.9613 23.8686 37.013 23.8871 36.9816 23.8799C36.982 23.8799 36.982 23.8799 36.9824 23.8799C36.9829 23.8799 36.9829 23.8799 36.9833 23.8799L38.924 24.3374C39.4941 24.4718 39.9224 24.9537 39.9758 25.5254C39.9767 25.5313 39.9771 25.5384 39.9775 25.546V25.5469V25.5486C39.9775 25.5502 39.9775 25.5523 39.9775 25.5544C39.9775 25.5566 39.9775 25.5587 39.9775 25.5603C39.9775 25.5612 39.9775 25.5603 39.9775 25.5616C39.9775 25.562 39.9775 25.5629 39.9775 25.5633C39.978 25.5692 39.9788 25.5717 39.9793 25.5797C39.9814 25.6101 39.9849 25.6556 39.9879 25.7128C39.9939 25.8278 39.9995 25.9921 39.9995 26.1884C39.9995 26.5811 39.9758 26.8212 39.9758 26.822C39.9758 26.8326 39.9749 26.8431 39.9741 26.8532V26.8519C39.9215 27.4244 39.4919 27.908 38.9223 28.0432L36.9833 28.4991C36.9841 28.4991 36.9824 28.4995 36.9807 28.4999L36.9781 28.5007C36.9971 28.4969 36.9604 28.51 36.9277 28.5403C36.8924 28.5728 36.8652 28.6195 36.8669 28.6145C36.8639 28.6225 36.8618 28.628 36.8592 28.633L36.8601 28.6309L36.5989 29.2464C36.5955 29.2548 36.5925 29.2607 36.5895 29.2666L36.5903 29.2645C36.6037 29.2375 36.5847 29.2898 36.5869 29.3369C36.589 29.3841 36.6136 29.4342 36.5968 29.4077L37.6387 31.0696C37.9489 31.5658 37.8826 32.2196 37.4771 32.6624C37.4728 32.667 37.4685 32.6712 37.4637 32.6754L36.5834 33.5361C36.5787 33.5403 36.5739 33.5445 36.5688 33.5487L36.5683 33.5491C36.1258 33.9341 35.4648 33.9919 34.9577 33.6907C34.9572 33.6907 34.9572 33.6907 34.9568 33.6907C34.9564 33.6907 34.9564 33.6907 34.9559 33.6907L33.2544 32.6737C33.2776 32.6876 33.2337 32.6662 33.1889 32.664C33.1441 32.6619 33.0967 32.6708 33.0863 32.6754C33.0833 32.6767 33.0786 32.6792 33.0734 32.6813L33.0712 32.6822L32.4417 32.937C32.4378 32.9387 32.4318 32.9408 32.4258 32.9429L32.4232 32.9438C32.4525 32.9337 32.4029 32.9589 32.371 32.993C32.3392 33.0272 32.3202 33.0769 32.3271 33.0474C32.3271 33.0478 32.3271 33.0478 32.3271 33.0482C32.3271 33.0487 32.3271 33.0487 32.3271 33.0491L31.8591 34.9464C31.7217 35.5046 31.227 35.92 30.644 35.9735C30.644 35.9735 30.367 36 29.9641 36C29.5612 36 29.3186 35.9751 29.3178 35.9751C29.307 35.9751 29.2962 35.9743 29.2859 35.9735H29.2872C28.7024 35.9221 28.2078 35.5042 28.0703 34.9464L27.6024 33.0491C27.6024 33.0487 27.6024 33.0487 27.6024 33.0482C27.6024 33.0478 27.6024 33.0478 27.6024 33.0474C27.6101 33.0786 27.5916 33.0297 27.5584 32.9947C27.5253 32.9598 27.4766 32.9337 27.4826 32.9353C27.4744 32.9324 27.4688 32.9303 27.4636 32.9278L27.4658 32.9286L26.8363 32.6737C26.8272 32.6704 26.8203 32.6674 26.8139 32.6645L26.816 32.6653C26.8626 32.6876 26.7975 32.6628 26.7436 32.6653C26.6898 32.6678 26.6286 32.6986 26.673 32.6721L24.9714 33.6907C24.7641 33.8141 24.5215 33.8764 24.2729 33.8764C23.9347 33.8764 23.602 33.7585 23.3439 33.5339C23.3383 33.5293 23.3336 33.5251 23.3284 33.5205L22.4481 32.6598C22.4438 32.6552 22.4395 32.6506 22.4352 32.6455L22.4347 32.6451C22.04 32.2112 21.9801 31.5646 22.29 31.0687L23.3318 29.4069V29.4052C23.3176 29.4275 23.3387 29.3841 23.3405 29.3378C23.3422 29.2902 23.3267 29.2384 23.3288 29.2422C23.3271 29.2388 23.3249 29.2337 23.3228 29.2278L23.3219 29.2257L23.0625 28.6119C23.0608 28.6082 23.0587 28.6023 23.0565 28.5964L23.0556 28.5938C23.066 28.6233 23.041 28.5728 23.0052 28.5412C22.9695 28.5096 22.9165 28.491 22.9479 28.4982C22.9475 28.4982 22.9475 28.4982 22.9471 28.4982C22.9466 28.4982 22.9466 28.4982 22.9462 28.4982L21.0055 28.0407C20.4345 27.9063 20.0097 27.4227 19.955 26.8528V26.8511C19.955 26.8498 19.9278 26.5806 19.9278 26.188C19.9278 25.7941 19.9532 25.557 19.9532 25.5561C19.9532 25.5456 19.9541 25.5351 19.955 25.525V25.5262C20.0075 24.9546 20.435 24.4705 21.0055 24.3349L22.9462 23.8791C22.9466 23.8791 22.9466 23.8791 22.9471 23.8791C22.9475 23.8791 22.9475 23.8791 22.9479 23.8791C22.9169 23.8863 22.9664 23.8686 23.0018 23.8361C23.0371 23.8037 23.0643 23.7569 23.0625 23.762C23.0656 23.754 23.0677 23.7485 23.0703 23.7435L23.0694 23.7456L23.3301 23.1301C23.3336 23.1217 23.3366 23.1158 23.3396 23.1099L23.3387 23.112C23.3254 23.1389 23.3443 23.0863 23.3422 23.0395C23.34 22.9936 23.3176 22.9477 23.3323 22.9704V22.9688L22.2921 21.3069C21.9823 20.8111 22.0461 20.1573 22.452 19.7141C22.4563 19.7095 22.4606 19.7053 22.4653 19.701L23.3474 18.8404C23.3521 18.8362 23.3568 18.832 23.362 18.8278L23.3624 18.8274C23.805 18.4432 24.4668 18.3842 24.9731 18.6862L26.6747 19.7048C26.6553 19.693 26.6962 19.7124 26.7402 19.7145C26.7854 19.7171 26.8324 19.7057 26.841 19.7015C26.8445 19.6998 26.8496 19.6977 26.8557 19.6956L26.8578 19.6947L27.4873 19.4411C27.4912 19.4394 27.4973 19.4373 27.5033 19.4352L27.5059 19.4344C27.4753 19.4449 27.5261 19.4196 27.558 19.3851C27.5899 19.3506 27.6089 19.3 27.602 19.3291C27.602 19.3287 27.602 19.3287 27.602 19.3282C27.602 19.3278 27.602 19.3278 27.602 19.3274L28.0699 17.43C28.2078 16.8714 28.7029 16.4557 29.2867 16.403C29.2915 16.4026 29.2979 16.4017 29.3044 16.4013H29.3053C29.3087 16.4009 29.3169 16.4017 29.3221 16.4013C29.3285 16.4009 29.3337 16.4005 29.3423 16.3996C29.3742 16.3975 29.4212 16.3946 29.4802 16.3912C29.5983 16.3853 29.7655 16.3782 29.9667 16.3782L29.9675 16.3786ZM29.9658 17.7805C29.8021 17.7805 29.6663 17.7856 29.5703 17.7902C29.5224 17.7927 29.4832 17.7948 29.4574 17.797H29.4556L28.9993 19.6547C28.8748 20.1619 28.4883 20.5853 27.9945 20.7491L27.449 20.9695C26.9685 21.2003 26.38 21.1691 25.9275 20.8987L24.2781 19.9129L23.5494 20.624L24.5594 22.2383C24.8374 22.6827 24.8693 23.2481 24.6405 23.7043L24.4134 24.2405C24.2402 24.7338 23.8041 25.1184 23.2857 25.241L21.3872 25.6871C21.3834 25.7402 21.3687 25.9037 21.3687 26.1859C21.3687 26.346 21.3739 26.4787 21.3786 26.5726C21.3812 26.6194 21.3834 26.6577 21.3855 26.683C21.3855 26.6843 21.3855 26.6834 21.3855 26.6847L23.2875 27.1325C23.8058 27.2542 24.2384 27.6321 24.4069 28.1132L24.631 28.6482C24.8645 29.1162 24.8378 29.6908 24.5603 30.1356L23.552 31.7465L24.2794 32.4589L25.9288 31.4731C26.1615 31.3346 26.4274 31.2794 26.688 31.2676C26.9487 31.2558 27.2025 31.2853 27.4305 31.3961L27.9777 31.6147C27.979 31.6151 27.9798 31.616 27.9811 31.6164C28.4844 31.787 28.8752 32.2125 28.9993 32.7171L29.4574 34.5749C29.5117 34.5782 29.6776 34.5913 29.9675 34.5913C30.1317 34.5913 30.2683 34.5875 30.3648 34.5829C30.4131 34.5808 30.4519 34.5783 30.4777 34.5761L30.9357 32.7167C31.0603 32.2099 31.4468 31.787 31.9389 31.6223L32.4844 31.402C32.4852 31.4015 32.487 31.4024 32.4878 31.402C32.6964 31.3017 32.9299 31.257 33.1695 31.257C33.4715 31.257 33.7632 31.3265 34.0076 31.4727L35.6553 32.4602L36.3839 31.7478L35.3756 30.1352C35.0977 29.6904 35.0654 29.1242 35.2946 28.6676L35.52 28.1326L35.5217 28.1292C35.6958 27.638 36.1297 27.253 36.6476 27.1304L38.5478 26.6843C38.5513 26.6312 38.5646 26.469 38.5646 26.1855C38.5646 26.0258 38.5608 25.8927 38.556 25.7988C38.5539 25.752 38.5509 25.7137 38.5491 25.6884L36.6472 25.2406C36.1288 25.1189 35.6962 24.741 35.5277 24.2599L35.3024 23.7249C35.0688 23.2565 35.0964 22.6823 35.3748 22.2374L36.3831 20.6249L35.6557 19.9125L34.0063 20.9C33.7732 21.0394 33.5064 21.0937 33.2453 21.1055C32.9842 21.1173 32.7308 21.0878 32.5029 20.977L32.5231 20.9867L31.9574 20.7563C31.4532 20.587 31.0581 20.1615 30.9323 19.6539L30.476 17.7978C30.4217 17.794 30.2545 17.7797 29.9658 17.7797V17.7805ZM15.0601 17.7805C14.4249 17.7805 13.9139 18.2801 13.9139 18.9011C13.9139 19.522 14.4249 20.0216 15.0601 20.0216C15.6952 20.0216 16.2062 19.522 16.2062 18.9011C16.2062 18.2801 15.6952 17.7805 15.0601 17.7805ZM29.9658 21.8419C32.4133 21.8419 34.4091 23.7953 34.4091 26.1876C34.4091 28.5799 32.4128 30.532 29.9654 30.532C27.5179 30.532 25.5203 28.5804 25.5203 26.1876C25.5203 23.7948 27.5184 21.8419 29.9658 21.8419ZM10.9563 22.0854C10.9558 22.0858 10.9533 22.0913 10.9528 22.0938L10.9563 22.0854ZM29.9658 23.2455C28.3034 23.2455 26.9565 24.5624 26.9565 26.1876C26.9565 27.8128 28.3034 29.1297 29.9658 29.1297C31.6282 29.1297 32.9751 27.8128 32.9751 26.1876C32.9751 24.5624 31.6282 23.2455 29.9658 23.2455Z" fill="white"/>
</svg>
