<?xml version="1.0" encoding="utf-8"?>
<!-- Generator: Adobe Illustrator 17.0.0, SVG Export Plug-In . SVG Version: 6.00 Build 0)  -->
<!DOCTYPE svg PUBLIC "-//W3C//DTD SVG 1.1//EN" "http://www.w3.org/Graphics/SVG/1.1/DTD/svg11.dtd">
<svg version="1.1" xmlns="http://www.w3.org/2000/svg" xmlns:xlink="http://www.w3.org/1999/xlink" x="0px" y="0px"
	 width="930.29px" height="802.11px" viewBox="0 0 930.29 802.11" enable-background="new 0 0 930.29 802.11" xml:space="preserve">
<g id="_x31_8f216cc-8d22-4f63-b3b0-6d2860aae10e">
	<path opacity="0.1" enable-background="new    " d="M425.509,714.873c64.23-35.55,137.6-46.9,209.3-31.65
		c101.61,21.6,229.3,13.13,254-153.51c42.24-284.61-134.78-359.73-134.78-359.73s-117.72-9.86-187.33-47.4
		c-98.88-53.32-211.9-60.13-311.28-15c-63.55,28.83-115.88,69-124.83,124.11c-25,154.18,16.06,239.12-60.75,289.45
		s-11.17,188.51,47.74,183.73s191.95-57.26,243.8,3.52C379.809,729.923,403.109,727.273,425.509,714.873z"/>
</g>
<g id="Layer_3">
	<g id="Landing_1_">
		<g id="Group-44">
			<g id="Group-4-Copy">
				<path id="Rectangle-3_1_" fill="none" stroke="#3E3E5F" stroke-width="2" d="M164.393,229.401c-0.875,0-1.585,0.71-1.585,1.585
					v412.029c0,0.875,0.71,1.585,1.585,1.585h183.669c0.039,0,0.039,0,0.078-0.002c0.874-0.043,1.548-0.786,1.505-1.66
					l-20.183-412.029c-0.041-0.844-0.738-1.507-1.583-1.507H164.393z"/>
				<path id="Rectangle-3-Copy-9" fill="#CCF6F6" d="M166.393,530.768l169.348-77.935c1.59-0.732,3.472-0.036,4.204,1.554
					c0.173,0.375,0.27,0.781,0.288,1.194l7.628,184.108c0.072,1.749-1.287,3.225-3.036,3.298c-0.044,0.002-0.087,0.003-0.131,0.003
					H167.718c-1.75,0-3.169-1.419-3.169-3.169V533.648C164.549,532.41,165.269,531.286,166.393,530.768z"/>
				<path id="Rectangle-3-Copy_1_" fill="#8B8BDF" stroke="#3E3E5F" stroke-width="2" d="M361.381,229.401
					c-0.032,0-0.063,0.001-0.095,0.003c-0.874,0.052-1.539,0.803-1.487,1.677l24.69,412.029c0.05,0.837,0.743,1.49,1.582,1.49
					h399.536c0.875,0,1.585-0.71,1.585-1.585V230.985c0-0.875-0.71-1.585-1.585-1.585H361.381z"/>
				<path id="Rectangle-3-Copy-10" fill="#CCF6F6" d="M533.67,293.365c76.873,0,60.168-126.602,239.185-19.79
					c4.007,2.391,8.301,8.987,12.883,19.79v346.039c0,1.75-1.419,3.169-3.169,3.169c-0.517,0-1.026-0.126-1.483-0.368
					c-60.378-31.968-98.604-60.626-114.679-85.975c-35.302-55.669,11.723,5.527-92.525-45.267
					c-38.999-19.002-108.223,42.657-141.477,22.2C394.637,509.928,342.403,293.365,533.67,293.365z"/>
				<path id="Rectangle-3-Copy-13" fill="#8B8BDF" d="M786.079,400.555l-0.308,145.042c-0.002,0.875-0.713,1.583-1.588,1.581
					c-0.116,0-0.232-0.013-0.346-0.039c-22.264-5.031-37.117-20.675-44.56-46.933c-11.484-40.514,15.851-16.292,19.827-42.439
					c1.954-12.854-22.197-32.89-15.359-42.149c4.423-5.989,17.89-11.526,40.4-16.612v0c0.854-0.193,1.702,0.343,1.895,1.197
					C786.066,400.318,786.079,400.436,786.079,400.555z"/>
			</g>
			<g id="Group-28" transform="translate(54.000000, 88.000000)">
				<path id="Combined-Shape_4_" fill="#DCDCFA" stroke="#3E3E5F" stroke-width="2" d="M193.611,421.105V302.726l105.829,0.424
					v117.955c0,11.815-23.691,21.394-52.914,21.394S193.611,432.921,193.611,421.105z"/>
				<ellipse id="Oval-8" fill="#F7F7FF" stroke="#3E3E5F" stroke-width="2" cx="246.525" cy="301.3" rx="52.914" ry="21.394"/>
				<path id="Path-8" fill="#3E3E5F" d="M243.392,283.798c12.791,0.022,24.097,1.428,33.918,4.219
					c10.012,2.845,15.767,6.866,17.265,12.064h0c0.121,0.421-0.121,0.86-0.542,0.981c-0.247,0.071-0.512,0.018-0.713-0.142
					c-5.352-4.264-10.689-7.419-16.01-9.466c-5.275-2.029-16.618-4.274-34.029-6.735l0.092-0.65
					c-0.074-0.01-0.126-0.079-0.116-0.154C243.266,283.848,243.324,283.798,243.392,283.798z"/>
			</g>
			<g id="Group-42" transform="translate(156.000000, 134.000000)">
				<g id="Group-23" transform="translate(15.000000, 16.000000)">
					<path id="Path-96" fill="none" stroke="#979797" d="M292.861,349.396c2.36,2.297,3.54,4.893,3.54,7.788
						s-0.88,5.491-2.639,7.788"/>
					<path id="Path-93" fill="#F9BFAC" stroke="#3E3E5F" stroke-width="2" stroke-linecap="round" d="M262.844,404.853
						c-0.453-23.871-0.453-42.559,0-56.064c0.617-18.383,14.304-31.99,29.451-31.99c15.173,0,29.578,13.467,30.722,31.99
						c0.825,13.354,0.825,32.042,0,56.064"/>
					<path id="Path-94" fill="none" stroke="#3E3E5F" stroke-width="2" stroke-linecap="round" d="M294.751,375.36
						c-5.484-0.888-9.168-2.148-11.052-3.783c-7.38-6.401-10.487-20.038-2.911-29.264c7.495-9.128,18.136-9.483,24.132,0.79
						c1.238,2.122,2.467,6.419,3.687,12.891"/>
					<path id="Path-95" fill="none" stroke="#3E3E5F" stroke-width="2" stroke-linecap="round" d="M276.622,383.787
						c5.668,5.662,12.072,7.279,19.212,4.851s11.585-7.303,13.335-14.627"/>
					<path id="Path-10" fill="#F3796E" d="M304.068,323.887c1.256-1.227,4.496,1.362,7.911,4.893s7.239,8.539,4.204,9.536
						c-1.98,0.651-3.796-3.99-6.475-6.734C306.376,328.17,303.407,324.534,304.068,323.887z"/>
					<path id="Path-15" fill="none" stroke="#3E3E5F" stroke-width="2" d="M323.161,404.695c-1.994,4.592-6.293,8.031-12.896,10.319
						c-6.603,2.287-13.51,2.782-20.721,1.484"/>
					<ellipse id="Oval-14" fill="#F9BFAC" cx="292.907" cy="404.27" rx="28.525" ry="12.678"/>
				</g>
				<g id="Group-37-Copy">
					<path id="Path-133-Copy-2" fill="none" stroke="#3E3E5F" stroke-width="2" stroke-linecap="round" d="M350.695,352.127
						l12.743-4.375"/>
					<path id="Path-133-Copy-3" fill="none" stroke="#3E3E5F" stroke-width="2" stroke-linecap="round" d="M253.267,346.777
						l11.74,3.765"/>
					<path id="Path-134" fill="none" stroke="#3E3E5F" stroke-width="2" stroke-linecap="round" d="M307.441,322.494v-15.633"/>
					<path id="Path-133" fill="none" stroke="#3E3E5F" stroke-width="2" stroke-linecap="round" d="M279.045,332.114l-12.133-12.694
						"/>
					<path id="Path-133-Copy-4" fill="none" stroke="#3E3E5F" stroke-width="2" stroke-linecap="round" d="M338.225,332.114
						l12.133-12.694"/>
					<path id="Path-133-Copy-8" fill="none" stroke="#FFB400" stroke-width="2" stroke-linecap="round" d="M359.658,348.992
						l3.78-1.24"/>
					<path id="Path-133-Copy-7" fill="none" stroke="#FFB400" stroke-width="2" stroke-linecap="round" d="M253.267,346.777
						l2.935,0.941"/>
					<path id="Path-134-Copy" fill="none" stroke="#FFB400" stroke-width="2" stroke-linecap="round" d="M307.441,310.902v-4.041"/>
					<path id="Path-133-Copy-6" fill="none" stroke="#FFB400" stroke-width="2" stroke-linecap="round" d="M270.093,322.741
						l-3.181-3.321"/>
					<path id="Path-133-Copy-5" fill="none" stroke="#FFB400" stroke-width="2" stroke-linecap="round" d="M347.308,322.605
						l3.05-3.185"/>
				</g>
			</g>
			<g id="Group-39" transform="translate(162.000000, 42.000000)">
				<g id="Group-37-Copy_1_">
					<path id="Path-133-Copy-2_1_" fill="none" stroke="#3E3E5F" stroke-width="2" stroke-linecap="round" d="M366.881,298.332
						l12.743-4.375"/>
					<path id="Path-133-Copy-3_1_" fill="none" stroke="#3E3E5F" stroke-width="2" stroke-linecap="round" d="M256.775,292.982
						l11.74,3.765"/>
					<path id="Path-134_1_" fill="none" stroke="#3E3E5F" stroke-width="2" stroke-linecap="round" d="M317.288,268.699v-15.633"/>
					<path id="Path-133_1_" fill="none" stroke="#3E3E5F" stroke-width="2" stroke-linecap="round" d="M288.892,278.319
						l-12.133-12.694"/>
					<path id="Path-133-Copy-4_1_" fill="none" stroke="#3E3E5F" stroke-width="2" stroke-linecap="round" d="M348.072,278.319
						l12.133-12.694"/>
					<path id="Path-133-Copy-8_1_" fill="none" stroke="#EC4C6F" stroke-width="2" stroke-linecap="round" d="M375.844,295.197
						l3.78-1.241"/>
					<path id="Path-133-Copy-7_1_" fill="none" stroke="#EC4C6F" stroke-width="2" stroke-linecap="round" d="M256.775,292.982
						l2.935,0.941"/>
					<path id="Path-134-Copy_1_" fill="none" stroke="#EC4C6F" stroke-width="2" stroke-linecap="round" d="M317.288,257.107v-4.041
						"/>
					<path id="Path-133-Copy-6_1_" fill="none" stroke="#EC4C6F" stroke-width="2" stroke-linecap="round" d="M279.94,268.946
						l-3.181-3.321"/>
					<path id="Path-133-Copy-5_1_" fill="none" stroke="#EC4C6F" stroke-width="2" stroke-linecap="round" d="M357.155,268.81
						l3.05-3.185"/>
				</g>
				<g id="Group-24" transform="translate(8.000000, 19.000000)">
					<path id="Path-92" fill="#FFFFFF" stroke="#3E3E5F" stroke-width="2" d="M261.218,294.442
						c12.276-19.957,27.939-29.935,46.989-29.935s34.713,9.978,46.989,29.935c-15.663,20.75-31.326,31.125-46.989,31.125
						C292.543,325.566,276.881,315.191,261.218,294.442z"/>
					<path id="Path-18" fill="#DCDCFA" d="M324.231,315.216c1.77-2.121,6.424-5.221,11.311-9.153
						c5.786-4.657,11.86-10.078,13.323-10.702c2.698-1.151-5.146,8.702-11.279,13.517
						C331.452,313.693,320.366,319.848,324.231,315.216z"/>
					<circle id="Oval-5" fill="#3E3E5F" stroke="#3E3E5F" stroke-width="2" cx="308.169" cy="293.594" r="17.432"/>
					<path id="Path-9" fill="#F3796E" d="M315.607,279.891c0.513,0.686,1.027,1.271,1.544,1.755
						c0.693,0.649,2.074,1.672,4.144,3.071l0,0c0.363,0.245,0.855,0.15,1.1-0.213c0.164-0.242,0.181-0.555,0.044-0.814
						c-0.615-1.164-1.332-2.129-2.151-2.897c-0.957-0.896-2.223-1.605-3.797-2.128l0,0c-0.415-0.138-0.864,0.087-1.002,0.502
						C315.408,279.413,315.451,279.683,315.607,279.891z"/>
				</g>
			</g>
			<g id="Group-41" transform="translate(237.000000, 66.000000)">
				<g id="Group-22" transform="translate(12.000000, 0.000000)">
					<path id="Path-98" fill="#FEF234" stroke="#3E3E5F" stroke-width="2" stroke-linecap="round" d="M344.802,267.293
						l29.895,94.741c1.844,5.843-1.398,12.073-7.241,13.917c-1.08,0.341-2.206,0.514-3.338,0.514h-40.932
						c-6.127,0-11.093-4.967-11.093-11.093c0-1.187,0.19-2.366,0.564-3.493l14.436-43.519"/>
					<path id="Path-11" fill="#F3796E" d="M342.963,375.15c5.278,0,21.357,4.407,28.5-3.881c7.143-8.288-6.15-10.56-6.15-14.89
						c0-2.038-0.718-4.079-2.154-6.122l0,0c-0.503-0.716-1.492-0.889-2.208-0.386c-0.326,0.229-0.554,0.573-0.638,0.962
						l-1.086,5.025c-0.074,0.341-0.258,0.649-0.525,0.875c-4.92,4.166-9.676,6.249-14.268,6.249c-4.594,0-9.542-2.084-14.845-6.252
						l0,0c-0.284-0.223-0.483-0.537-0.565-0.889l-1.401-6.056c-0.197-0.853-1.048-1.384-1.901-1.187
						c-0.242,0.056-0.468,0.168-0.659,0.327c-1.604,1.339-2.405,3.282-2.405,5.83c0,5.217-13.147,9.195-7.119,16.515
						C321.568,378.589,337.685,375.15,342.963,375.15z"/>
					<path id="Path-99" fill="#3E3E5F" stroke="#3E3E5F" stroke-width="2" stroke-linecap="round" d="M327.536,368.761v7.481h9.537
						l-6.711-8.465c-0.544-0.686-1.54-0.801-2.226-0.257C327.757,367.82,327.536,368.278,327.536,368.761z"/>
					<path id="Path-99-Copy-2" fill="#3E3E5F" stroke="#3E3E5F" stroke-width="2" stroke-linecap="round" d="M359.26,368.761v7.481
						h-9.537l6.711-8.465c0.544-0.686,1.54-0.801,2.226-0.257C359.039,367.82,359.26,368.278,359.26,368.761z"/>
				</g>
				
					<g id="Group-37-Copy-2" transform="translate(35.000000, 74.000000) scale(1, -1) translate(-35.000000, -74.000000) translate(0.000000, 56.000000)">
					<path id="Path-133-Copy" fill="none" stroke="#3E3E5F" stroke-width="2" stroke-linecap="round" d="M385.38-294.564
						l13.416-9.791"/>
					<path id="Path-133-Copy-2_2_" fill="none" stroke="#3E3E5F" stroke-width="2" stroke-linecap="round" d="M394.888-266.039
						h15.735"/>
					<path id="Path-133-Copy-3_2_" fill="none" stroke="#3E3E5F" stroke-width="2" stroke-linecap="round" d="M299.804-266.039
						h15.735"/>
					<path id="Path-134_2_" fill="none" stroke="#3E3E5F" stroke-width="2" stroke-linecap="round" d="M356.388-303.878v-15.633"/>
					<path id="Path-133_2_" fill="none" stroke="#3E3E5F" stroke-width="2" stroke-linecap="round" d="M324.823-294.259
						l-13.416-9.791"/>
				</g>
			</g>
			<g id="Group-43" transform="translate(320.000000, 24.000000)">
				<g id="Group-73" transform="translate(0.000000, 14.000000)">
					<path id="Path-100" fill="#F9BFAC" stroke="#3E3E5F" stroke-width="2" stroke-linecap="round" d="M351.273,272.234
						c11.302-20.338,26.171-26.36,44.606-18.067c27.653,12.439,7.557,49.628,6.095,56.954c-1.462,7.326,2.099,30.074-13.531,38.923
						c-10.42,5.9-22.81,1.045-37.17-14.565"/>
					<path id="Path-12" fill="#F3796E" d="M363.75,260.791c0.855-0.556,9.652-7.229,19.125-6.876
						c9.586,0.358,19.859,7.776,22.328,13.097c4.91,10.579,0,23.674,0,17.578s0.823-10.812-2.797-16.216
						c-4.196-6.263-11.914-9.728-19.531-9.851c-8.92-0.145-18.602,6.599-20.981,7.575
						C358.869,267.339,362.031,261.909,363.75,260.791z"/>
					<path id="Path-131" fill="#F3796E" d="M372.138,283.925c0.471-0.76,6.725-2.213,9.139,1.067s0.928,8.726-0.632,9.348
						c-1.56,0.622,0.217-2.91-1.782-6.209S371.667,284.685,372.138,283.925z"/>
					<path id="Path-101" fill="none" stroke="#3E3E5F" stroke-width="2" stroke-linecap="round" d="M362.445,291.046
						c6.53-14.969,13.927-19.384,22.193-13.245c12.398,9.209-5.963,22.28-8.306,27.41c-2.343,5.13,8.521,11.945,4.507,19.878
						c-2.676,5.289-7.998,5.289-15.965,0"/>
					<path id="Path-13" fill="#F9BFAC" d="M351.495,273.604c-1.685,0.696-2.527,4.383-2.527,11.061
						c0,10.016,2.23,9.788,2.527,20.822c0.296,11.034-2.57,19.85-1.305,24.685c0.844,3.223,3.255,5.622,7.234,7.198L351.495,273.604
						z"/>
					<path id="Path-16" fill="none" stroke="#3E3E5F" stroke-width="2" stroke-linecap="round" d="M351.547,271.811
						c-1.455,3.151-2.182,7.288-2.182,12.411c0,5.124,0.727,8.897,2.182,11.319"/>
				</g>
				<path id="Path-17" fill="none" stroke="#3E3E5F" stroke-width="2" stroke-linecap="round" d="M403.024,262.83l10.201-11.449"/>
				<path id="Path-17-Copy" fill="none" stroke="#3E3E5F" stroke-width="2" stroke-linecap="round" d="M387.357,258.324l2.23-15.084
					"/>
				<path id="Path-17-Copy-2" fill="none" stroke="#3E3E5F" stroke-width="2" stroke-linecap="round" d="M415.055,274.564h11.158"/>
			</g>
			<g id="Group-40" transform="translate(282.000000, 170.000000)">
				<g id="Group-20" transform="translate(0.000000, 5.000000)">
					<g id="Group-21">
						<path id="Path-97-Copy" fill="#EB452B" stroke="#3E3E5F" stroke-width="2" d="M327.983,353.458
							c14.236,15.284,31.548,22.926,51.936,22.926c20.409,0,37.188-7.658,50.336-22.974h0c0.57-0.664,0.494-1.665-0.17-2.235
							c-0.287-0.247-0.654-0.382-1.032-0.382l-99.911,0c-0.875,0-1.585,0.71-1.585,1.585
							C327.558,352.779,327.71,353.165,327.983,353.458z"/>
						<path id="Path-97" fill="#F3796E" stroke="#3E3E5F" stroke-width="2" d="M328.671,352.15l101.386,0
							c0.875,0,1.585-0.71,1.585-1.585c0-0.401-0.152-0.786-0.424-1.079c-11.651-12.524-22.311-18.785-31.981-18.785
							c-15.5,0-15.95,19.016-19.927,19.016s-5.79-19.415-20.334-19.016c-9.056,0.248-19.536,6.502-31.44,18.761l0,0
							c-0.61,0.628-0.595,1.631,0.033,2.241C327.863,351.99,328.259,352.15,328.671,352.15z"/>
						<path id="Path-14" fill="#EC4C6F" d="M362.403,335.606c-0.466,1.345-9.251,3.198-10.133,2.079
							C349.229,333.832,363.486,332.48,362.403,335.606z"/>
						<path id="Path-14_1_" fill="#EC4C6F" d="M396.417,335.606c0.466,1.345,9.068,2.312,13.691,4.259
							c7.253,3.055,12.565,7.046,13.825,7.481c2.211,0.765-6.251-7.685-12.614-10.231
							C404.955,334.569,395.334,332.48,396.417,335.606z"/>
					</g>
				</g>
				<path id="Path-135" fill="none" stroke="#3E3E5F" stroke-width="2" stroke-linecap="round" d="M394.909,388.468
					c5.934-1.358,11.922-3.402,17.963-6.132c6.042-2.73,12.029-7.503,17.963-14.321"/>
				<path id="Path-135-Copy" fill="none" stroke="#3E3E5F" stroke-width="2" stroke-linecap="round" d="M384.021,333.998
					c6.191-4.397,12.617-6.085,19.278-5.065c6.661,1.02,13.621,3.503,20.881,7.449"/>
			</g>
		</g>
	</g>
</g>
</svg>
