{
  "client": [
    "/assets/vendors.chunk.js",
    "/assets/client.js"
  ],
  "GetRanks": [
    "/assets/2.chunk.js",
    "/assets/0.chunk.js",
    "/assets/1.chunk.js",
    "/assets/GetRanks.chunk.js"
  ],
  "null": [
    "/assets/2.chunk.js",
    "/assets/3.chunk.js",
    "/assets/0.chunk.js",
    "/assets/1.chunk.js",
    "/assets/4.chunk.js"
  ],
  "Careers": [
    "/assets/0.chunk.js",
    "/assets/Careers.chunk.js"
  ],
  "Customers": [
    "/assets/0.chunk.js",
    "/assets/1.chunk.js",
    "/assets/Customers.chunk.js"
  ],
  "Pricing": [
    "/assets/2.chunk.js",
    "/assets/0.chunk.js",
    "/assets/1.chunk.js",
    "/assets/Pricing.chunk.js"
  ],
  "PricingDetails": [
    "/assets/0.chunk.js",
    "/assets/PricingDetails.chunk.js"
  ],
  "Aboutus": [
    "/assets/2.chunk.js",
    "/assets/0.chunk.js",
    "/assets/1.chunk.js",
    "/assets/Aboutus.chunk.js"
  ],
  "Culture": [
    "/assets/0.chunk.js",
    "/assets/Culture.chunk.js"
  ],
  "Press": [
    "/assets/2.chunk.js",
    "/assets/0.chunk.js",
    "/assets/1.chunk.js",
    "/assets/Press.chunk.js"
  ],
  "HowWorks": [
    "/assets/0.chunk.js",
    "/assets/1.chunk.js",
    "/assets/HowWorks.chunk.js"
  ],
  "Tests": [
    "/assets/2.chunk.js",
    "/assets/0.chunk.js",
    "/assets/1.chunk.js",
    "/assets/Tests.chunk.js"
  ],
  "Live Classes": [
    "/assets/0.chunk.js",
    "/assets/1.chunk.js",
    "/assets/Live%20Classes.chunk.js"
  ],
  "Doubts": [
    "/assets/0.chunk.js",
    "/assets/1.chunk.js",
    "/assets/Doubts.chunk.js"
  ],
  "Assignments": [
    "/assets/0.chunk.js",
    "/assets/1.chunk.js",
    "/assets/Assignments.chunk.js"
  ],
  "Connect": [
    "/assets/0.chunk.js",
    "/assets/1.chunk.js",
    "/assets/Connect.chunk.js"
  ],
  "Team": [
    "/assets/3.chunk.js",
    "/assets/0.chunk.js",
    "/assets/Acads~Jeet~Otp~Team.chunk.js",
    "/assets/Team.chunk.js"
  ],
  "Jeet": [
    "/assets/3.chunk.js",
    "/assets/0.chunk.js",
    "/assets/Acads~Jeet~Otp~Team.chunk.js",
    "/assets/Acads~Jeet~Otp.chunk.js",
    "/assets/Jeet.chunk.js"
  ],
  "Acads": [
    "/assets/3.chunk.js",
    "/assets/0.chunk.js",
    "/assets/Acads~Jeet~Otp~Team.chunk.js",
    "/assets/Acads~Jeet~Otp.chunk.js",
    "/assets/Acads.chunk.js"
  ],
  "Otp": [
    "/assets/3.chunk.js",
    "/assets/0.chunk.js",
    "/assets/Acads~Jeet~Otp~Team.chunk.js",
    "/assets/Acads~Jeet~Otp.chunk.js",
    "/assets/Otp.chunk.js"
  ],
  "qms": [
    "/assets/0.chunk.js",
    "/assets/qms.chunk.js"
  ],
  "PrivacyAndTerms": [
    "/assets/0.chunk.js",
    "/assets/PrivacyAndTerms.chunk.js"
  ],
  "TermsAndConditions": [
    "/assets/0.chunk.js",
    "/assets/TermsAndConditions.chunk.js"
  ],
  "CancellationAndReturn": [
    "/assets/0.chunk.js",
    "/assets/CancellationAndReturn.chunk.js"
  ],
  "Score": [
    "/assets/Score.chunk.js"
  ],
  "LaunchingSoon": [
    "/assets/0.chunk.js",
    "/assets/LaunchingSoon.chunk.js"
  ]
}