<svg xmlns="http://www.w3.org/2000/svg" width="48" height="48" fill="none" viewBox="0 0 48 48">
    <circle cx="24" cy="24" r="24" fill="#0C0"/>
    <path fill="#fff" d="M13.963 12c.441 0 .85.23 1.055.614h-.001l.612 1.142.41.057.918-.918c.341-.34.902-.45 1.386-.2l.018.008h-.002l.746.436.017.012v-.001c.42.28.606.799.454 1.275l-.394 1.23.246.324 1.325-.013h.003c.5 0 .946.308 1.11.77.001.001.069.185.139.457.07.274.1.467.1.467.079.488-.17.969-.616 1.197l-1.168.599-.059.398.94.902c.365.35.447.901.205 1.354-.003.008-.006.013-.01.018l.002-.001-.447.727-.012.017c-.287.413-.815.593-1.303.444l.001.002-1.27-.38-.318.23.013 1.293c.004.491-.311.933-.788 1.095-.002 0-.19.068-.47.136-.28.07-.48.099-.48.099h-.008c-.047.006-.052.013-.16.013-.442 0-.85-.233-1.055-.616h.002l-.613-1.142-.407-.057-.92.916c-.342.343-.905.45-1.388.201l-.017-.009.002.001-.744-.436-.018-.012H11c-.42-.28-.606-.798-.454-1.275l.392-1.23-.243-.321-1.328.013h-.002-.001c-.5 0-.945-.31-1.11-.77 0-.003-.069-.185-.139-.458-.07-.274-.1-.469-.1-.469-.079-.488.17-.968.615-1.196l1.169-.6.059-.394-.94-.902c-.365-.35-.447-.902-.205-1.355.003-.007.006-.013.01-.018l-.002.002.446-.729.013-.017h-.001c.287-.41.814-.593 1.303-.445h.001l1.268.381.32-.232-.014-1.293c-.004-.492.313-.933.79-1.095.002 0 .19-.066.467-.134.28-.07.482-.1.482-.1h.006c.067-.01.073-.012.16-.012h.001zm-.128 1.433c-.053.011-.102.023-.173.04-.07.017-.117.03-.169.044l.012 1.16c.004.44-.213.844-.58 1.078l-.31.225c-.344.284-.81.379-1.243.246v.001l-1.109-.337-.187.305.832.796h.001c.32.308.46.744.367 1.164l.006-.022-.063.418.002-.02c-.039.438-.304.825-.702 1.029l-1.05.54c.01.051.02.099.038.168.018.07.033.115.047.165l1.192-.013h.004c.445 0 .854.211 1.092.566l.244.325-.015-.018c.29.335.386.792.252 1.212l-.348 1.086.311.183.818-.813c.251-.25.6-.381.964-.381.083 0 .143 0 .234.023l-.03-.007.428.061-.02-.002c.446.038.843.296 1.051.685l.55 1.028c.053-.01.103-.02.175-.038.07-.017.116-.031.167-.046l-.012-1.16c-.004-.439.214-.844.58-1.078l-.017.01.346-.25-.018.014c.24-.2.553-.3.875-.3.128 0 .25.019.367.053h.001l1.112.338.185-.303-.832-.798h-.001c-.319-.308-.46-.743-.367-1.162l-.006.021.063-.417-.002.02c.039-.438.304-.825.702-1.029l1.05-.54c-.01-.051-.02-.1-.038-.169s-.033-.114-.047-.165l-1.192.013h-.002-.001c-.445 0-.855-.21-1.093-.566l-.245-.325.015.018c-.291-.336-.385-.794-.251-1.213l.347-1.086-.312-.181-.816.811v.001c-.252.251-.603.383-.966.383-.083 0-.145-.003-.232-.024l.03.007-.43-.062.02.001c-.446-.038-.841-.297-1.05-.684l-.55-1.029zm5.332 2.273c.007-.002-.011.02 0 0zm-4.107.67c1.42 0 2.58 1.137 2.58 2.525s-1.16 2.523-2.58 2.523c-1.419 0-2.581-1.134-2.581-2.523 0-1.388 1.161-2.524 2.582-2.524zm14.908.003c.402 0 .645.023.646.023l.032.001h-.001c.585.052 1.08.472 1.218 1.029l.467 1.895v.002c-.008-.03.01.018.044.053.033.034.08.06.075.06.009.002.014.004.02.007l-.003-.001.63.255.02.009h-.002c-.045-.022.02 0 .075-.003.052-.002.108-.027.07-.005h.002l1.7-1.017h.002c.498-.296 1.166-.245 1.625.157l.014.012.882.862.012.014h.001c.395.434.455 1.08.145 1.575L36.6 22.973c.014-.023-.007.02-.009.067-.002.048.014.099.012.096l.006.014v.002l.26.614.006.016.001.002c-.01-.028.015.021.05.053.036.032.087.05.056.043h.002l1.94.457c.57.135.999.617 1.052 1.188l.002.021v.017l.002.017.008.133c.006.115.012.28.012.475 0 .393-.024.633-.024.634l-.001.031v-.001c-.053.572-.483 1.056-1.052 1.191l-1.94.456h-.002l-.002.002c.019-.004-.018.009-.05.04-.036.032-.063.078-.062.073l-.007.019v-.002l-.26.615-.01.02v-.001c.014-.027-.005.025-.003.072.002.047.027.097.01.07l1.042 1.663c.31.496.244 1.15-.161 1.592-.005.005-.009.01-.014.013l-.88.861-.015.013c-.443.385-1.104.443-1.61.142h-.002l-1.702-1.017c.023.014-.02-.008-.066-.01-.044-.002-.092.007-.102.011l-.013.006-.002.001-.63.255-.016.006h-.002c.029-.01-.02.016-.053.05-.031.034-.05.084-.043.054v.002l-.468 1.897c-.138.559-.633.974-1.215 1.028 0 0-.277.026-.68.026s-.646-.025-.647-.025c-.01 0-.021 0-.032-.002h.002c-.585-.05-1.08-.469-1.217-1.027l-.468-1.897v-.002c.008.032-.01-.017-.044-.052-.033-.035-.082-.061-.076-.06l-.019-.007h.002l-.63-.254-.022-.01.003.001c.046.023-.019-.002-.073 0-.054.003-.115.034-.07.007l-1.702 1.019c-.207.123-.45.185-.699.185-.338 0-.67-.117-.929-.342l-.015-.014-.88-.86-.013-.014c-.395-.435-.455-1.081-.146-1.577l1.042-1.662v-.002c-.014.022.007-.02.009-.067.002-.048-.014-.1-.012-.096l-.006-.014v-.002l-.26-.614-.006-.016v-.002c.01.03-.015-.021-.051-.053-.036-.031-.089-.05-.058-.043h-.001l-1.941-.457c-.571-.135-.996-.618-1.05-1.188v-.002c0-.001-.028-.27-.028-.663 0-.394.026-.631.026-.632 0-.01 0-.02.002-.031v.001c.052-.571.48-1.055 1.05-1.191l1.94-.456h.002c-.03.007.019-.01.054-.043.036-.032.063-.08.061-.074.003-.008.005-.014.008-.018l-.001.002.26-.616.01-.02v.002c-.014.027.005-.026.003-.072-.003-.046-.025-.092-.01-.07v-.001l-1.04-1.662c-.31-.496-.246-1.15.16-1.593l.013-.013.882-.86.015-.013c.442-.385 1.104-.444 1.61-.142l1.702 1.019c-.02-.012.022.007.066.01.045.002.092-.01.1-.014l.015-.005.002-.001.63-.254.016-.006h.002c-.03.01.02-.015.052-.05.032-.034.051-.085.044-.056v-.002l.468-1.897c.138-.559.633-.974 1.217-1.027l.018-.002h.018l.02-.001.138-.009c.118-.006.285-.013.486-.013h.001zm-.002 1.401c-.163 0-.3.006-.395.01l-.113.007h-.002L29 19.655c-.125.507-.511.93-1.005 1.094l-.546.22c-.48.231-1.069.2-1.521-.07l-1.65-.986-.728.711 1.01 1.614c.278.445.31 1.01.08 1.466l-.226.537c-.173.493-.61.877-1.128 1l-1.898.446c-.004.053-.019.217-.019.499 0 .16.005.293.01.387l.007.11v.002l1.902.448c.518.121.95.5 1.12.98l.223.535c.234.468.207 1.043-.07 1.488l-1.009 1.61.728.713 1.65-.986c.232-.138.498-.194.759-.205.26-.012.514.017.742.128l.547.219.004.001c.503.171.894.596 1.018 1.101l.458 1.858c.054.003.22.016.51.016.164 0 .3-.004.397-.008.049-.002.087-.005.113-.007l.458-1.86c.125-.506.511-.929 1.003-1.094l.546-.22h.003c.209-.1.442-.145.682-.145.302 0 .594.07.838.216l1.648.987.728-.712-1.008-1.613c-.278-.445-.31-1.01-.08-1.467l.224-.535.002-.004c.174-.491.608-.876 1.126-.999l1.9-.446c.004-.053.017-.215.017-.498 0-.16-.004-.293-.008-.387l-.007-.11-1.902-.448c-.519-.122-.951-.5-1.12-.981l-.225-.535c-.234-.469-.206-1.043.072-1.488l1.008-1.612-.727-.712-1.65.987c-.232.14-.5.194-.76.206-.261.011-.515-.018-.743-.129l.02.01-.565-.23c-.504-.17-.9-.596-1.025-1.103l-.456-1.856c-.055-.004-.222-.018-.51-.018zm-14.906 0c-.635 0-1.146.5-1.146 1.121s.511 1.12 1.146 1.12c.636 0 1.147-.499 1.147-1.12 0-.62-.511-1.12-1.147-1.12zm14.906 4.062c2.448 0 4.444 1.953 4.444 4.346 0 2.392-1.997 4.344-4.444 4.344-2.448 0-4.445-1.952-4.445-4.344 0-2.393 1.998-4.346 4.445-4.346zm-19.01.243l-.003.009.004-.009zm19.01 1.16c-1.662 0-3.009 1.317-3.009 2.943 0 1.625 1.347 2.942 3.01 2.942 1.662 0 3.009-1.317 3.009-2.942 0-1.626-1.347-2.942-3.01-2.942z"/>
</svg>
