<svg xmlns="http://www.w3.org/2000/svg" width="24" height="36" fill="none" viewBox="0 0 24 36">
    <g opacity=".2">
        <rect width="22" height="34" x="1" y="1" stroke="#25282B" stroke-width="2" rx="11"/>
        <rect width="3.692" height="7.385" x="10.154" y="6" fill="#25282B" rx="1.846"/>
    </g>
</svg>
