<svg width="24" height="24" viewBox="0 0 24 24" fill="none" xmlns="http://www.w3.org/2000/svg">
<path d="M19.5428 5.14294H18.1713V3.0858C18.1713 2.90394 18.0991 2.72952 17.9705 2.60093C17.8419 2.47233 17.6675 2.40009 17.4856 2.40009C17.3038 2.40009 17.1293 2.47233 17.0007 2.60093C16.8721 2.72952 16.7999 2.90394 16.7999 3.0858V5.14294H7.1999V3.0858C7.1999 2.90394 7.12766 2.72952 6.99906 2.60093C6.87046 2.47233 6.69605 2.40009 6.51419 2.40009C6.33233 2.40009 6.15791 2.47233 6.02931 2.60093C5.90072 2.72952 5.82847 2.90394 5.82847 3.0858V5.14294H4.45705C3.91146 5.14294 3.38821 5.35968 3.00243 5.74547C2.61664 6.13125 2.3999 6.6545 2.3999 7.20009V19.5429C2.3999 20.0885 2.61664 20.6118 3.00243 20.9976C3.38821 21.3834 3.91146 21.6001 4.45705 21.6001H19.5428C20.0883 21.6001 20.6116 21.3834 20.9974 20.9976C21.3832 20.6118 21.5999 20.0885 21.5999 19.5429V7.20009C21.5999 6.6545 21.3832 6.13125 20.9974 5.74547C20.6116 5.35968 20.0883 5.14294 19.5428 5.14294ZM20.2285 19.5429C20.2285 19.7248 20.1562 19.8992 20.0276 20.0278C19.899 20.1564 19.7246 20.2287 19.5428 20.2287H4.45705C4.27518 20.2287 4.10077 20.1564 3.97217 20.0278C3.84358 19.8992 3.77133 19.7248 3.77133 19.5429V9.94294H20.2285V19.5429ZM20.2285 8.57151H3.77133V7.20009C3.77133 7.01822 3.84358 6.84381 3.97217 6.71521C4.10077 6.58662 4.27518 6.51437 4.45705 6.51437H5.82847V7.20009C5.82847 7.38195 5.90072 7.55636 6.02931 7.68496C6.15791 7.81355 6.33233 7.8858 6.51419 7.8858C6.69605 7.8858 6.87046 7.81355 6.99906 7.68496C7.12766 7.55636 7.1999 7.38195 7.1999 7.20009V6.51437H16.7999V7.20009C16.7999 7.38195 16.8721 7.55636 17.0007 7.68496C17.1293 7.81355 17.3038 7.8858 17.4856 7.8858C17.6675 7.8858 17.8419 7.81355 17.9705 7.68496C18.0991 7.55636 18.1713 7.38195 18.1713 7.20009V6.51437H19.5428C19.7246 6.51437 19.899 6.58662 20.0276 6.71521C20.1562 6.84381 20.2285 7.01822 20.2285 7.20009V8.57151Z" fill="#25282B"/>
<rect x="5.83398" y="12.4828" width="2.97231" height="1.48615" rx="0.743077" fill="#00CC00"/>
<rect x="5.83398" y="15.4551" width="2.97231" height="1.48615" rx="0.743077" fill="#00CC00"/>
<rect x="10.2925" y="12.4828" width="7.43077" height="1.48615" rx="0.743077" fill="#00CC00"/>
<rect x="10.2925" y="15.4551" width="7.43077" height="1.48615" rx="0.743077" fill="#00CC00"/>
</svg>
