<svg xmlns="http://www.w3.org/2000/svg" width="32" height="41" fill="none" viewBox="0 0 32 41">
    <path fill="#25282B" d="M28.758 0H3.24C1.45 0 0 1.423 0 3.175v34.65C0 39.578 1.45 41 3.24 41h25.518C30.548 41 32 39.578 32 37.825V3.175C32 1.423 30.548 0 28.758 0zM13.215 2.45h5.572c.156 0 .282.127.282.28 0 .154-.126.28-.282.28h-5.572c-.156 0-.285-.126-.285-.28 0-.154.129-.28.285-.28zM16 38.66c-1.037 0-1.876-.823-1.876-1.837 0-1.016.84-1.84 1.876-1.84 1.035 0 1.875.823 1.875 1.84 0 1.014-.84 1.838-1.875 1.838zm14.578-5.681H1.42V6.24h29.158V32.98z"/>
</svg>
