<svg xmlns="http://www.w3.org/2000/svg" width="126" height="56" fill="none" viewBox="0 0 126 56">
    <circle cx="51" cy="-19" r="75" fill="#fff" opacity=".1"/>
    <circle cx="51" cy="-29" r="75" fill="#fff" opacity=".1"/>
</svg>
