<svg xmlns="http://www.w3.org/2000/svg" width="20" height="20" fill="none" viewBox="0 0 20 20">
    <path fill="#0C0" d="M10.461 2.862v-.939h.308c.123 0 .24-.049.327-.135.086-.087.135-.204.135-.326 0-.123-.049-.24-.135-.327-.087-.086-.204-.135-.327-.135H9.231c-.123 0-.24.049-.327.135-.086.087-.135.204-.135.327 0 .122.049.24.135.326.087.086.204.135.327.135h.307v.939c-2.078.12-4.027 1.045-5.434 2.58-1.407 1.534-2.16 3.556-2.1 5.637.06 2.081.928 4.056 2.421 5.507 1.493 1.45 3.493 2.262 5.575 2.262 2.082 0 4.082-.811 5.575-2.262 1.493-1.45 2.362-3.426 2.422-5.507.06-2.08-.694-4.103-2.1-5.638-1.408-1.534-3.357-2.46-5.436-2.58zM10 17.923c-1.4 0-2.768-.415-3.932-1.193-1.164-.777-2.07-1.883-2.606-3.176-.536-1.293-.676-2.716-.403-4.088.273-1.373.947-2.634 1.937-3.624.99-.99 2.25-1.664 3.623-1.937 1.373-.273 2.796-.133 4.09.403 1.292.536 2.398 1.443 3.175 2.606.778 1.164 1.193 2.532 1.193 3.932 0 .93-.183 1.85-.539 2.708-.355.859-.877 1.64-1.534 2.296-.657.657-1.437 1.179-2.296 1.534-.858.356-1.779.54-2.708.54z"/>
    <path fill="#0C0" d="M10 6.078c-.944 0-1.866.28-2.65.804-.784.524-1.396 1.269-1.756 2.14-.361.871-.456 1.83-.272 2.755.184.926.638 1.776 1.305 2.443.667.666 1.517 1.12 2.442 1.305.925.184 1.884.09 2.756-.272.871-.36 1.616-.972 2.14-1.756s.804-1.707.804-2.65c0-1.265-.504-2.477-1.398-3.371-.894-.895-2.107-1.397-3.371-1.398zm0 8.615c-.761 0-1.505-.225-2.137-.648-.633-.423-1.126-1.023-1.417-1.726-.29-.703-.367-1.476-.219-2.222.149-.746.515-1.432 1.053-1.97.538-.537 1.223-.904 1.97-1.052.745-.149 1.519-.072 2.222.219.702.29 1.303.784 1.726 1.416.422.633.648 1.376.648 2.137-.002 1.02-.408 1.997-1.129 2.718-.72.72-1.698 1.127-2.717 1.128z"/>
    <path fill="#0C0" d="M11.873 9.114l-2.84 2.487-.877-.884c-.087-.085-.204-.133-.326-.133-.122 0-.24.048-.327.133-.043.043-.077.094-.1.15-.024.056-.036.116-.036.177 0 .06.012.12.036.176.023.056.057.107.1.15l1.188 1.188c.043.043.094.077.15.1.056.023.116.035.176.035.114.002.223-.039.308-.114l3.166-2.77c.092-.08.148-.196.156-.319.007-.123-.034-.243-.116-.336-.082-.092-.196-.148-.32-.155-.122-.008-.243.034-.335.115h-.003z"/>
</svg>
