<svg xmlns="http://www.w3.org/2000/svg" width="88" height="82" fill="none" viewBox="0 0 88 82">
    <g opacity=".8">
        <circle cx="49.355" cy="42.725" r="38.305" fill="#F7F7F7"/>
        <circle cx="38.305" cy="38.305" r="37.555" stroke="#25282B" stroke-width="1.5" opacity=".2"/>
    </g>
</svg>
