<svg xmlns="http://www.w3.org/2000/svg" width="24" height="24" fill="none" viewBox="0 0 24 24">
    <path fill="#25282B" d="M22 19.2H2V21h20v-1.8zM22 8.4H2v1.8h20V8.4zM22 13.8H2v1.8h20v-1.8zM22 3H2v1.8h20V3z"/>
</svg>
