<svg xmlns="http://www.w3.org/2000/svg" width="48" height="48" fill="none" viewBox="0 0 48 48">
    <circle cx="24" cy="24" r="24" fill="#FF6400"/>
    <path fill="#fff" d="M23.988 23.924c1.795 0 3.25-1.455 3.25-3.25 0-1.794-1.455-3.25-3.25-3.25s-3.25 1.456-3.25 3.25c0 1.795 1.455 3.25 3.25 3.25zM30.73 30.215v-2.588c0-.21-.09-.421-.271-.572-.181-.12-.392-.18-.632-.12l-.572.18c-.331-1.324-1.444-2.317-2.799-2.587-.692.451-1.564.722-2.467.722s-1.745-.271-2.468-.722c-1.354.27-2.467 1.263-2.798 2.587l-.572-.18c-.21-.06-.451-.03-.632.12-.18.12-.27.331-.27.572v2.588c-.602.09-1.054.602-1.054 1.233v.572c0 .632.452 1.144 1.053 1.234v2.347c0 .301.211.572.482.662l6.048 1.836c.06.03.12.03.21.03.061 0 .151 0 .212-.03l6.048-1.836c.3-.09.481-.361.481-.662v-2.347c.602-.09 1.053-.602 1.053-1.234v-.572c0-.631-.45-1.143-1.053-1.233zm-7.433 6.289l-4.664-1.414v-6.53l4.664 1.414v6.53zm6.048-1.414l-4.664 1.414v-6.53l4.664-1.414v6.53z"/>
    <path fill="#fff" d="M38.012 18.658l-4.093-2.708v-4.724c0-.332-.27-.633-.631-.633H31.18c-.33 0-.632.271-.632.633v2.527l-5.717-3.791c-.512-.331-1.144-.331-1.655 0l-13.18 8.726c-.301.18-.361.572-.18.873l.902 1.354c.18.3.572.36.873.18l12.397-8.214 12.428 8.214c.3.18.692.12.873-.18l.902-1.384c.18-.271.09-.662-.18-.873z"/>
</svg>
