<svg xmlns="http://www.w3.org/2000/svg" width="20" height="20" fill="none" viewBox="0 0 20 20">
    <g fill="#25282B" clip-path="url(#clip0)">
        <path d="M15.019 5.945c-.073 0-.146-.018-.213-.058-.128-.075-.205-.211-.205-.36V4.227c-1.283-.669-2.719-1.02-4.167-1.02s-2.884.351-4.167 1.02v1.302c0 .148-.077.284-.204.359-.128.075-.285.077-.414.006L2.753 4.301c-.138-.075-.222-.222-.218-.38.004-.157.099-.3.24-.366L10.258.038c.112-.052.242-.052.355 0l7.48 3.517c.143.067.235.209.241.366.004.156-.08.303-.217.38L15.22 5.893c-.063.036-.132.052-.201.052zM10.434 2.37c1.672 0 3.327.428 4.788 1.241.131.073.215.213.215.366v.844l1.559-.856L10.434.88l-6.56 3.085 1.56.856v-.844c0-.152.081-.293.215-.366 1.46-.813 3.116-1.24 4.785-1.24z"/>
        <path d="M5.85 7.982c-.055 0-.11-.01-.16-.03-.156-.066-.256-.218-.256-.387v-3.59c0-.153.081-.293.215-.366 1.46-.813 3.115-1.241 4.787-1.241 1.672 0 3.327.428 4.788 1.24.131.074.215.214.215.367v3.59c0 .167-.1.32-.255.384-.155.065-.334.031-.454-.086l-.002-.002c-1.157-1.116-2.68-1.73-4.29-1.73-1.609 0-3.132.614-4.29 1.73-.083.08-.19.121-.299.121zm4.584-2.685c1.515 0 2.965.48 4.167 1.369v-2.44c-1.283-.67-2.719-1.02-4.167-1.02s-2.881.35-4.167 1.02v2.44c1.202-.888 2.652-1.369 4.167-1.369zM3.81 8.712H2.083c-.14 0-.27-.07-.346-.186-.078-.115-.092-.264-.04-.393L2.56 6.04c.065-.157.217-.259.386-.259.17 0 .322.102.387.26l.863 2.09c.052.13.038.277-.04.394-.077.117-.206.186-.346.186zm-1.102-.836h.479l-.24-.579-.239.579z"/>
        <path d="M2.947 6.62c-.23 0-.418-.187-.418-.417V3.936c0-.23.188-.418.418-.418.23 0 .418.188.418.418v2.267c0 .232-.188.418-.418.418zM10.433 19.34c-1.826 0-3.558-.698-4.873-1.966-.361-.35-.687-.738-.965-1.154-.773-1.155-1.183-2.505-1.183-3.901s.41-2.746 1.183-3.902c.278-.415.602-.802.961-1.149l.004-.004c1.315-1.268 3.047-1.966 4.873-1.966 1.827 0 3.559.698 4.873 1.966l.005.004c.359.347.683.734.96 1.15.774 1.155 1.184 2.505 1.184 3.9 0 1.397-.41 2.747-1.183 3.902-.278.416-.604.805-.966 1.154-1.314 1.266-3.044 1.966-4.873 1.966zM6.143 7.862l-.004.004c-.318.307-.604.648-.85 1.015-.682 1.018-1.041 2.205-1.041 3.436 0 1.23.36 2.418 1.04 3.435.247.368.533.708.851 1.018 1.158 1.118 2.683 1.732 4.292 1.732 1.61 0 3.135-.614 4.292-1.732.32-.307.606-.65.85-1.018.682-1.018 1.041-2.207 1.041-3.435 0-1.231-.359-2.418-1.04-3.436-.247-.367-.533-.708-.85-1.015l-.003-.002-.002-.002c-1.157-1.116-2.68-1.73-4.29-1.73-1.605.001-3.128.616-4.286 1.73z"/>
        <path d="M10.434 19.34c-.893 0-1.7-.78-2.27-2.196-.522-1.296-.81-3.01-.81-4.825 0-1.816.288-3.53.81-4.825.57-1.417 1.377-2.196 2.27-2.196.892 0 1.699.78 2.269 2.196.522 1.295.81 3.009.81 4.825 0 1.816-.288 3.53-.81 4.825-.57 1.415-1.375 2.196-2.27 2.196zm0-13.207c-.514 0-1.072.625-1.494 1.672-.483 1.2-.75 2.802-.75 4.514 0 1.711.265 3.314.75 4.513.422 1.047.982 1.672 1.494 1.672s1.072-.625 1.494-1.672c.482-1.199.75-2.802.75-4.513 0-1.712-.265-3.314-.75-4.514-.42-1.047-.98-1.672-1.494-1.672z"/>
        <path d="M17.037 12.737H3.83c-.23 0-.418-.188-.418-.418 0-.23.188-.418.418-.418h13.207c.23 0 .418.188.418.418 0 .23-.186.418-.418.418zM10.434 9.832c-.842 0-1.665-.148-2.449-.439-.909-.338-1.724-.852-2.424-1.527-.081-.08-.127-.188-.127-.301 0-.113.046-.222.127-.301 1.314-1.268 3.047-1.966 4.873-1.966 1.827 0 3.559.698 4.873 1.966.082.08.128.188.128.3 0 .114-.046.222-.128.302-.7.675-1.517 1.189-2.424 1.527-.781.29-1.607.44-2.449.44zM6.476 7.565c.537.45 1.141.8 1.802 1.045.69.257 1.414.386 2.156.386.742 0 1.47-.13 2.157-.386.66-.245 1.264-.596 1.8-1.045-1.109-.926-2.498-1.432-3.957-1.432-1.458 0-2.848.504-3.958 1.432zM10.434 19.34c-1.826 0-3.559-.697-4.873-1.966-.081-.08-.127-.188-.127-.3 0-.114.046-.222.127-.302.7-.674 1.517-1.188 2.424-1.527.782-.29 1.607-.439 2.45-.439.841 0 1.665.149 2.448.439.91.339 1.724.853 2.424 1.528.082.079.128.188.128.3 0 .113-.046.222-.128.301-1.314 1.267-3.044 1.967-4.873 1.967zm-3.958-2.269c1.11.926 2.5 1.432 3.958 1.432 1.459 0 2.848-.506 3.958-1.432-.537-.449-1.141-.8-1.801-1.045-.69-.257-1.415-.386-2.157-.386s-1.469.13-2.156.386c-.66.247-1.265.598-1.802 1.045z"/>
    </g>
    <defs>
        <clipPath id="clip0">
            <path fill="#fff" d="M0 0H20V20H0z"/>
        </clipPath>
    </defs>
</svg>
