<svg xmlns="http://www.w3.org/2000/svg" width="20" height="20" fill="none" viewBox="0 0 20 20">
    <path fill="#25282B" d="M15.255 12.242v-1.583c0-.271-.108-.53-.3-.722-.19-.192-.45-.3-.721-.3h-3.575V8.056c.62-.127 1.171-.48 1.546-.989.375-.51.547-1.14.484-1.77-.064-.629-.359-1.212-.828-1.637C11.39 3.235 10.78 3 10.149 3c-.633 0-1.243.235-1.713.66-.469.424-.764 1.007-.827 1.636-.064.63.108 1.26.483 1.77s.926.862 1.546.989v1.583H6.064c-.271 0-.53.107-.722.299-.192.191-.3.45-.3.722v1.583c-.62.126-1.17.478-1.545.988s-.548 1.14-.484 1.77c.064.63.359 1.213.828 1.637.47.424 1.08.66 1.712.66.633 0 1.243-.236 1.712-.66.47-.424.765-1.008.828-1.637.064-.63-.109-1.26-.484-1.77s-.925-.862-1.545-.988v-1.583h8.17v1.583c-.62.126-1.171.478-1.546.988s-.548 1.14-.484 1.77c.064.63.359 1.213.828 1.637.47.424 1.08.66 1.712.66.633 0 1.243-.236 1.712-.66.47-.424.765-1.008.828-1.637.064-.63-.108-1.26-.483-1.77s-.926-.862-1.546-.988zm-6.638-6.69c0-.302.09-.599.258-.85.168-.252.408-.449.687-.565.28-.116.588-.146.886-.087.297.06.57.205.784.42.214.214.36.487.42.784.058.297.028.605-.088.885-.116.28-.312.519-.564.687-.252.169-.548.258-.851.258-.407 0-.796-.161-1.084-.448-.287-.288-.448-.677-.448-1.083zm-1.532 9.192c0 .303-.09.599-.258.85-.169.253-.408.449-.688.565-.28.116-.588.146-.885.087-.297-.059-.57-.205-.784-.42-.214-.213-.36-.486-.42-.783-.058-.298-.028-.606.088-.885.116-.28.312-.52.564-.688.252-.168.548-.258.851-.258.406 0 .796.161 1.083.449.288.287.449.676.449 1.083zm7.66 1.532c-.304 0-.6-.09-.852-.259-.252-.168-.448-.407-.564-.687-.116-.28-.146-.588-.087-.885.059-.297.205-.57.42-.784.213-.215.486-.36.783-.42.297-.059.606-.028.886.088.28.115.519.312.687.564.168.252.258.548.258.85 0 .407-.161.797-.449 1.084-.287.287-.677.449-1.083.449z"/>
    <circle cx="10.113" cy="5.51" r=".837" fill="#25282B"/>
    <circle cx="5.51" cy="14.716" r=".837" fill="#25282B"/>
    <circle cx="14.716" cy="14.716" r=".837" fill="#25282B"/>
</svg>
