<?xml version="1.0" encoding="UTF-8"?>
<svg width="214px" height="180px" viewBox="0 0 214 180" version="1.1" xmlns="http://www.w3.org/2000/svg" xmlns:xlink="http://www.w3.org/1999/xlink">
    <!-- Generator: Sketch 52.2 (67145) - http://www.bohemiancoding.com/sketch -->
    <title>undraw_connected_8wvi</title>
    <desc>Created with Sketch.</desc>
    <defs>
        <linearGradient x1="49.6122131%" y1="99.8757264%" x2="49.7008946%" y2="-0.115521949%" id="linearGradient-1">
            <stop stop-color="#808080" stop-opacity="0.25" offset="0%"></stop>
            <stop stop-color="#808080" stop-opacity="0.12" offset="54%"></stop>
            <stop stop-color="#808080" stop-opacity="0.1" offset="100%"></stop>
        </linearGradient>
        <linearGradient x1="-0.523741434%" y1="50.0020309%" x2="99.9338477%" y2="50.0020309%" id="linearGradient-2">
            <stop stop-color="#000000" stop-opacity="0.09" offset="0%"></stop>
            <stop stop-color="#000000" stop-opacity="0.07" offset="55%"></stop>
            <stop stop-color="#000000" stop-opacity="0.02" offset="100%"></stop>
        </linearGradient>
        <linearGradient x1="50.0025204%" y1="99.9951603%" x2="50.0025204%" y2="0.00439256359%" id="linearGradient-3">
            <stop stop-color="#808080" stop-opacity="0.25" offset="0%"></stop>
            <stop stop-color="#808080" stop-opacity="0.12" offset="54%"></stop>
            <stop stop-color="#808080" stop-opacity="0.1" offset="100%"></stop>
        </linearGradient>
        <linearGradient x1="50.00252%" y1="99.9951605%" x2="50.00252%" y2="0.00284973732%" id="linearGradient-4">
            <stop stop-color="#808080" stop-opacity="0.25" offset="0%"></stop>
            <stop stop-color="#808080" stop-opacity="0.12" offset="54%"></stop>
            <stop stop-color="#808080" stop-opacity="0.1" offset="100%"></stop>
        </linearGradient>
        <linearGradient x1="49.99748%" y1="99.9951605%" x2="49.99748%" y2="0.00284973732%" id="linearGradient-5">
            <stop stop-color="#808080" stop-opacity="0.25" offset="0%"></stop>
            <stop stop-color="#808080" stop-opacity="0.12" offset="54%"></stop>
            <stop stop-color="#808080" stop-opacity="0.1" offset="100%"></stop>
        </linearGradient>
        <linearGradient x1="50%" y1="100%" x2="50%" y2="0.0136911281%" id="linearGradient-6">
            <stop stop-color="#808080" stop-opacity="0.25" offset="0%"></stop>
            <stop stop-color="#808080" stop-opacity="0.12" offset="54%"></stop>
            <stop stop-color="#808080" stop-opacity="0.1" offset="100%"></stop>
        </linearGradient>
    </defs>
    <g id="Landing" stroke="none" stroke-width="1" fill="none" fill-rule="evenodd">
        <g id="2_Home-Copy-3" transform="translate(-926.000000, -1226.000000)">
            <g id="undraw_connected_8wvi" transform="translate(926.000000, 1226.000000)">
                <g id="Group" opacity="0.5" transform="translate(0.000000, 29.000000)" fill="url(#linearGradient-1)">
                    <path d="M0.180982857,134.873997 L0,5.32879581 C0,2.63002216 2.18996717,0.442233857 4.89142857,0.442233857 L208.719703,0.171029668 C211.421164,0.171029668 213.611131,2.35881798 213.611131,5.05759162 L213.789669,134.602792 C213.789669,135.898789 213.274323,137.141705 212.357002,138.058113 C211.439682,138.974522 210.195528,139.489354 208.89824,139.489354 L5.06996571,139.760558 C2.36945947,139.75921 0.18098252,137.571816 0.180982857,134.873997 Z" id="Path"></path>
                </g>
                <polygon id="Rectangle" fill="url(#linearGradient-2)" transform="translate(106.528011, 99.265432) rotate(-0.080000) translate(-106.528011, -99.265432) " points="15.8752769 38.9717236 197.180969 38.9713856 197.180744 159.55914 15.8750524 159.559478"></polygon>
                <path d="M16.8910601,33.4453401 L197.744198,33.4453401 C204.747168,33.4453401 210.424198,39.1223694 210.424198,46.1253401 L210.424198,151.90618 C210.424198,158.90915 204.747168,164.58618 197.744198,164.58618 L16.8910601,164.58618 C9.88808944,164.58618 4.21106007,158.90915 4.21106007,151.90618 L4.21106007,46.1253401 C4.21106007,39.1223694 9.88808944,33.4453401 16.8910601,33.4453401 Z" id="Rectangle" fill="#FFFFFF" transform="translate(107.317629, 99.015760) rotate(-0.080000) translate(-107.317629, -99.015760) "></path>
                <polygon id="Rectangle" fill="#EC4C6F" opacity="0.2" transform="translate(107.500000, 99.500000) rotate(90.000000) translate(-107.500000, -99.500000) " points="51 13 164 13 164 186 51 186"></polygon>
                <ellipse id="Oval" fill="#DBDBDB" cx="13" cy="99.5" rx="5" ry="4.5"></ellipse>
                <ellipse id="Oval" fill="#DBDBDB" cx="202" cy="79.5" rx="2" ry="1.5"></ellipse>
                <path d="M192.957141,96.6216626 L211.660816,96.6217023 C212.080551,96.6217031 212.420813,96.9619652 212.420815,97.3817002 L212.420822,97.4538616 C212.420823,97.873598 212.08056,98.2138625 211.660824,98.2138637 C211.660823,98.2138637 211.660822,98.2138637 211.66082,98.2138637 L192.957146,98.2138204 C192.537411,98.2138196 192.197148,97.8735576 192.197147,97.4538225 L192.19714,97.3816611 C192.197139,96.9619247 192.537401,96.6216602 192.957138,96.621659 C192.957139,96.621659 192.95714,96.621659 192.957141,96.621659 Z" id="Rectangle" fill="#DBDBDB" transform="translate(202.308981, 97.417761) rotate(89.920000) translate(-202.308981, -97.417761) "></path>
                <g id="Group" opacity="0.5" transform="translate(139.000000, 0.000000)" fill="url(#linearGradient-3)">
                    <path d="M51.8828169,25.9538318 C51.8815195,13.6961795 43.1874419,3.14362871 31.1109846,0.741747564 C19.0345273,-1.66013358 6.93368675,4.75652537 2.19973686,16.0723864 C-2.53421303,27.3882474 1.41505643,40.4568066 11.6353052,47.2957009 L11.6523944,47.4099065 C12.4960262,48.215388 13.4917537,48.8463722 14.5819718,49.2663551 L14.6161502,49.1521495 C15.8368075,50.1848598 20.9171831,51.8371963 26.7714554,51.8250467 L26.8984038,51.8250467 C30.6043192,51.8250467 34.6276056,51.1738318 38.1675117,49.268785 C38.1675117,49.268785 38.1992488,49.2007477 38.2480751,49.0743925 C39.1463803,48.6557357 39.970785,48.0952984 40.6893897,47.4147664 C40.7040376,47.3159502 40.7178717,47.2187539 40.730892,47.1231776 C47.7216607,42.32324 51.8919521,34.4069078 51.8828169,25.9538318 Z" id="Path"></path>
                </g>
                <circle id="Oval" fill="#F5F5F5" cx="165" cy="26" r="25"></circle>
                <path d="M155.323666,36 C155.323666,36 149.782704,36.5188067 151.246098,48.077821 C152.00543,48.9118559 152.901658,49.5651827 153.882926,50 L157,37.922179 L155.323666,36 Z" id="Path" fill="#FDA57D"></path>
                <path d="M175.676334,36 C175.676334,36 181.217296,36.5188067 179.753902,48.077821 C178.99457,48.9118559 178.098342,49.5651827 177.117074,50 L174,37.922179 L175.676334,36 Z" id="Path" fill="#FDA57D"></path>
                <path d="M155.36969,19 C155.36969,19 152.543957,27.1205698 151,26.3603157 C151,26.3603157 165.87151,39.0496054 179,26.3603157 C179,26.3603157 176.68892,22.3000307 173.348535,19 L155.36969,19 Z" id="Path" fill="#333333"></path>
                <ellipse id="Oval" fill="#333333" cx="165" cy="17.5" rx="11" ry="11.5"></ellipse>
                <path d="M174.530021,37 L155.216647,37 L153.40267,44.4251124 C153.40267,44.4251124 152.343502,47.8596357 153.660766,49.3689569 C154.97803,50.878278 167.296027,54.3128014 176.334258,49.6166164 C177.122782,47.6392956 177.21345,45.4683387 176.592354,43.4368108 C175.562405,39.9765869 176.334258,43.1891513 176.334258,43.1891513 L174.530021,37 Z" id="Path" fill="#000000" opacity="0.1"></path>
                <path d="M174.530021,37 L155.202037,37 L153.40267,44.4251124 C153.40267,44.4251124 152.343502,47.8596357 153.660766,49.3689569 C154.97803,50.878278 167.296027,54.3128014 176.334258,49.6166164 C177.122782,47.6392956 177.21345,45.4683387 176.592354,43.4368108 C175.562405,39.9765869 176.334258,43.1891513 176.334258,43.1891513 L174.530021,37 Z" id="Path" fill="#000000" opacity="0.1"></path>
                <path d="M174.53489,37 L155.211777,37 L153.40267,44.4251124 C153.40267,44.4251124 152.343502,47.8596357 153.660766,49.3689569 C154.97803,50.878278 167.296027,54.3128014 176.334258,49.6166164 C177.122782,47.6392956 177.21345,45.4683387 176.592354,43.4368108 C175.562405,39.9765869 176.334258,43.1891513 176.334258,43.1891513 L174.53489,37 Z" id="Path" fill="#EC4C6F"></path>
                <path d="M161,31 L169,31 L169,37.2953995 C169,38.2779207 168.593837,39.2202003 167.870862,39.9149476 C167.147887,40.609695 166.167323,41 165.144882,41 L164.855118,41 C162.725995,41 161,39.3413939 161,37.2953995 L161,31 Z" id="Path" fill="#000000" opacity="0.1"></path>
                <path d="M161,30 L169,30 L169,36.2953995 C169,38.3413939 167.274005,40 165.144882,40 L164.855118,40 C162.725995,40 161,38.3413939 161,36.2953995 L161,30 Z" id="Path" fill="#FDA57D"></path>
                <path d="M161,31.1370157 C163.578215,32.2783476 166.416363,32.2878762 169,31.1638744 L169,30 L161,30 L161,31.1370157 Z" id="Path" fill="#000000" opacity="0.1"></path>
                <ellipse id="Oval" fill="#FDA57D" cx="165" cy="20.5" rx="11" ry="11.5"></ellipse>
                <path d="M154,16 L176,16 C176,16 174.120807,7.48924082 165.802651,8.02420282 C157.484496,8.55916483 154,16 154,16 Z" id="Path" fill="#333333"></path>
                <ellipse id="Oval" fill="#FDA57D" cx="155" cy="20" rx="1" ry="2"></ellipse>
                <ellipse id="Oval" fill="#FDA57D" cx="176" cy="20" rx="1" ry="2"></ellipse>
                <path d="M154,16 L176,16 C176,16 174.120807,7.48924082 165.802651,8.02420282 C157.484496,8.55916483 154,16 154,16 Z" id="Path" fill="#000000" opacity="0.1"></path>
                <g id="Group" opacity="0.5" transform="translate(9.000000, 36.000000)" fill="url(#linearGradient-4)">
                    <path d="M51.8339906,25.9096714 C51.8334755,13.5938971 43.1392794,2.99092482 31.0622695,0.577601643 C18.9852596,-1.83572154 6.88391518,4.6117221 2.15036689,15.9814986 C-2.58318139,27.351275 1.36741246,40.4815787 11.5889202,47.3517371 L11.6060094,47.4664789 C12.4496412,48.275742 13.4453687,48.9096885 14.5355869,49.3316432 L14.5697653,49.2169014 C15.7904225,50.2544601 20.8707981,51.914554 26.7250704,51.9023474 L26.8520188,51.9023474 C30.5579343,51.9023474 34.5812207,51.2480751 38.1211268,49.3340845 C38.1211268,49.3340845 38.1528638,49.2657277 38.2016901,49.1387793 C39.0999953,48.718157 39.9244001,48.1550886 40.6430047,47.4713615 C40.6576526,47.3720814 40.6714867,47.2744288 40.684507,47.1784038 C47.674349,42.3553856 51.8436792,34.4019797 51.8339906,25.9096714 Z" id="Path"></path>
                </g>
                <circle id="Oval" fill="#F5F5F5" cx="35" cy="62" r="25"></circle>
                <path d="M24.3236664,72 C24.3236664,72 18.7827042,72.5188067 20.2460982,84.077821 C21.00543,84.9118559 21.9016577,85.5651827 22.8829256,86 L26,73.922179 L24.3236664,72 Z" id="Path" fill="#EC4C6F"></path>
                <path d="M43.6779654,72 C43.6779654,72 49.2168363,72.5188067 47.7539947,84.077821 C46.9949495,84.9118559 46.09906,85.5651827 45.1181624,86 L42,73.919585 L43.6779654,72 Z" id="Path" fill="#EC4C6F"></path>
                <circle id="Oval" fill="#333333" cx="34" cy="54" r="11"></circle>
                <path d="M43.5331808,72 L24.2069815,72 L22.4026835,79.4215711 C22.4026835,79.4215711 21.3434802,82.8577001 22.6607882,84.3677269 C23.9780962,85.8777536 36.296509,89.3138826 45.3350439,84.6155022 C46.1225038,82.6386633 46.2131682,80.4685105 45.5931486,78.4374825 C44.5631647,74.975641 45.3350439,78.1897072 45.3350439,78.1897072 L43.5331808,72 Z" id="Path" fill="#4D8AF0"></path>
                <path d="M43.5331808,72 L24.2069815,72 L22.4026835,79.4215711 C22.4026835,79.4215711 21.3434802,82.8577001 22.6607882,84.3677269 C23.9780962,85.8777536 36.296509,89.3138826 45.3350439,84.6155022 C46.1225038,82.6386633 46.2131682,80.4685105 45.5931486,78.4374825 C44.5631647,74.975641 45.3350439,78.1897072 45.3350439,78.1897072 L43.5331808,72 Z" id="Path" fill="#4D8AF0"></path>
                <path d="M43.5379613,72 L24.2064735,72 L22.4025908,79.4215711 C22.4025908,79.4215711 21.3436313,82.8577001 22.6606361,84.3677269 C23.9776408,85.8777536 36.2932178,89.3138826 45.329672,84.6155022 C46.1201546,82.6396948 46.2142193,80.4695276 45.5974549,78.4374825 C44.5677081,74.975641 45.3394096,78.1897072 45.3394096,78.1897072 L43.5379613,72 Z" id="Path" fill="#EC4C6F"></path>
                <path d="M30,66 L38,66 L38,72.2953995 C38,74.3413939 36.2740048,76 34.1448819,76 L33.8551181,76 C31.7259952,76 30,74.3413939 30,72.2953995 L30,66 Z" id="Path" fill="#000000" opacity="0.1"></path>
                <path d="M30,66 L38,66 L38,72.2953995 C38,74.3413939 36.2740048,76 34.1448819,76 L33.8551181,76 C31.7259952,76 30,74.3413939 30,72.2953995 L30,66 Z" id="Path" fill="#FDB797"></path>
                <path d="M30,67.1370157 C32.5782155,68.2783476 35.4163628,68.2878762 38,67.1638744 L38,66 L30,66 L30,67.1370157 Z" id="Path" fill="#000000" opacity="0.1"></path>
                <ellipse id="Oval" fill="#FDB797" cx="34" cy="56.5" rx="11" ry="11.5"></ellipse>
                <path d="M23,52 L45,52 C45,52 43.1212401,43.4892408 34.8050017,44.0242028 C26.4887634,44.5591648 23,52 23,52 Z" id="Path" fill="#000000" opacity="0.1"></path>
                <path d="M23,51 L45,51 C45,51 43.1212401,42.4892408 34.8050017,43.0242028 C26.4887634,43.5591648 23,51 23,51 Z" id="Path" fill="#333333"></path>
                <ellipse id="Oval" fill="#FDB797" cx="23" cy="56" rx="1" ry="2"></ellipse>
                <ellipse id="Oval" fill="#FDB797" cx="45" cy="56" rx="1" ry="2"></ellipse>
                <path d="M24.3394894,46.1403092 C24.5760013,45.3003185 25.0978181,44.5596599 25.8226054,44.0351975 C26.3854288,43.6612791 27.0572677,43.4816041 27.7012188,43.2630804 C28.6556889,42.9396878 29.5717784,42.5205439 30.4342085,42.0126392 C31.4128115,41.4347653 32.3305687,40.7403455 33.4080461,40.3591431 C35.2613071,39.7035719 37.3249932,40.058066 39.2391001,40.529106 C39.7164319,40.6251364 40.1761413,40.7888059 40.6030597,41.0147142 C41.0675461,41.3227305 41.4760821,41.7016883 41.8123696,42.1364693 L44.8546586,45.6449888 C45.1471751,45.9557479 45.4023001,46.2970058 45.6152309,46.6623381 C45.7979835,47.0234253 45.9146103,47.4118955 45.9600236,47.8108016 C46.0685714,48.4559407 45.9546501,49.1173855 45.6355128,49.6949616 C45.1284646,50.5350639 44.0636635,50.9575431 43.0495671,50.9963917 C42.0354708,51.0352404 41.0391211,50.7535876 40.0630534,50.4792189 C36.9193547,49.59784 33.7249512,48.7795901 30.4747724,48.4105278 C28.8568982,48.2196567 27.2243177,48.169272 25.5969689,48.2599892 C25.0899207,48.2915538 24.4104762,48.5173616 24.1011768,48.0171851 C23.8197651,47.5825657 24.2000512,46.5725006 24.3394894,46.1403092 Z" id="Path" fill="#333333"></path>
                <g id="Group" opacity="0.5" transform="translate(77.000000, 114.000000)" fill="url(#linearGradient-5)">
                    <path d="M0.19286385,25.8979439 C0.193378939,13.63972 8.88757508,3.08629433 20.9645849,0.684248364 C33.0415948,-1.71779761 45.1429393,4.69951779 49.8764876,16.0161645 C54.6100359,27.3328111 50.659442,40.4017583 40.4379343,47.2398131 L40.4208451,47.3540187 C39.5772133,48.1595002 38.5814857,48.7904843 37.4912676,49.2104673 L37.4570892,49.0962617 C36.2364319,50.128972 31.1560563,51.7813084 25.301784,51.7691589 L25.1748357,51.7691589 C21.4689202,51.7691589 17.4456338,51.1179439 13.9057277,49.2128972 C13.9057277,49.2128972 13.8739906,49.1448598 13.8251643,49.0185047 C12.9268591,48.5998479 12.1024544,48.0394106 11.3838498,47.3588785 C11.3692019,47.2600623 11.3553678,47.162866 11.3423474,47.0672897 C4.35250543,42.266809 0.183175229,34.3505686 0.19286385,25.8979439 Z" id="Path"></path>
                </g>
                <circle id="Oval" fill="#F5F5F5" cx="103" cy="140" r="25"></circle>
                <path d="M93.3236664,149 C93.3236664,149 87.7827042,149.518807 89.2460982,161.077821 C90.00543,161.911856 90.9016577,162.565183 91.8829256,163 L95,150.922179 L93.3236664,149 Z" id="Path" fill="#BE7C5E"></path>
                <path d="M113.679596,149 C113.679596,149 119.216377,149.518807 117.754088,161.077821 C116.993994,161.912433 116.096861,162.565791 115.114722,163 L112,150.922179 L113.679596,149 Z" id="Path" fill="#BE7C5E"></path>
                <path d="M94.58094,131.002512 C94.58094,131.002512 94.1346712,132.379151 93.5008745,133.971832 C92.1193402,137.456136 93.6955237,150.835662 97.0021856,152.260032 C100.712388,153.860249 105.590486,154.885192 110.658486,152.928254 C115.064203,151.227552 116.422,135.999109 113.307613,132.288715 C112.942053,131.854119 112.559876,131.422035 112.161082,131 L94.58094,131.002512 Z" id="Path" fill="#333333"></path>
                <ellipse id="Oval" fill="#333333" cx="103" cy="130.5" rx="11" ry="11.5"></ellipse>
                <path d="M112.530021,150 L93.2069072,150 L91.4026699,157.421571 C91.4026699,157.421571 90.3435023,160.8577 91.6607659,162.367727 C92.9780296,163.877754 105.296027,167.313883 114.334258,162.615502 C115.122782,160.637257 115.21345,158.465285 114.592354,156.432807 C113.562405,152.970966 114.334258,156.185032 114.334258,156.185032 L112.530021,150 Z" id="Path" fill="#000000" opacity="0.1"></path>
                <path d="M113.530021,150 L94.2069072,150 L92.4026699,157.421571 C92.4026699,157.421571 91.3435023,160.8577 92.6607659,162.367727 C93.9780296,163.877754 106.296027,167.313883 115.334258,162.615502 C116.122782,160.637257 116.21345,158.465285 115.592354,156.432807 C114.562405,152.970966 115.334258,156.185032 115.334258,156.185032 L113.530021,150 Z" id="Path" fill="#000000" opacity="0.1"></path>
                <path d="M112.530021,150 L93.2069072,150 L91.4026699,157.421571 C91.4026699,157.421571 90.3435023,160.8577 91.6607659,162.367727 C92.9780296,163.877754 105.296027,167.313883 114.334258,162.615502 C115.122782,160.637257 115.21345,158.465285 114.592354,156.432807 C113.562405,152.970966 114.334258,156.185032 114.334258,156.185032 L112.530021,150 Z" id="Path" fill="#EC4C6F"></path>
                <path d="M99,143 L107,143 L107,149.2954 C107,151.341394 105.274005,153 103.144882,153 L102.857638,153 C100.728515,153 99.0025197,151.341394 99.0025197,149.2954 L99.0025197,143 L99,143 Z" id="Path" fill="#000000" opacity="0.1"></path>
                <path d="M99,143 L107,143 L107,149.2954 C107,151.341394 105.274005,153 103.144882,153 L102.857638,153 C100.728515,153 99.0025197,151.341394 99.0025197,149.2954 L99.0025197,143 L99,143 Z" id="Path" fill="#BE7C5E"></path>
                <path d="M99,144.137016 C101.578215,145.278348 104.416363,145.287876 107,144.163874 L107,143 L99,143 L99,144.137016 Z" id="Path" fill="#000000" opacity="0.1"></path>
                <ellipse id="Oval" fill="#BE7C5E" cx="103" cy="133.5" rx="11" ry="11.5"></ellipse>
                <path d="M92,129 L114,129 C114,129 112.12124,120.489241 103.805002,121.024203 C95.4887634,121.559165 92,129 92,129 Z" id="Path" fill="#333333"></path>
                <ellipse id="Oval" fill="#BE7C5E" cx="93" cy="133" rx="1" ry="2"></ellipse>
                <ellipse id="Oval" fill="#BE7C5E" cx="114" cy="133" rx="1" ry="2"></ellipse>
                <path d="M92,130 L114,130 C114,130 112.12124,121.489241 103.805002,122.024203 C95.4887634,122.559165 92,130 92,130 Z" id="Path" fill="#000000" opacity="0.1"></path>
                <path d="M164,59 L164,153 L139,153" id="Path" stroke="#EC4C6F" stroke-width="2" stroke-dasharray="12"></path>
                <path d="M34,94 L34,153 L71,153" id="Path" stroke="#EC4C6F" stroke-width="2" stroke-dasharray="12"></path>
                <g id="Group" opacity="0.5" transform="translate(24.000000, 85.000000)" fill="url(#linearGradient-6)">
                    <circle id="Oval" cx="9.0827027" cy="8.9172973" r="8.88324324"></circle>
                </g>
                <circle id="Oval" fill="#69F0AE" cx="33.5" cy="93.5" r="8.5"></circle>
                <polygon id="Path" fill="#FFFFFF" points="30.375 91.6009577 33.6755121 94.4285714 38.3484637 88 40 89.2857143 33.6755121 97 29 92.1157223"></polygon>
                <g id="Group" opacity="0.5" transform="translate(156.000000, 46.000000)" fill="url(#linearGradient-6)">
                    <circle id="Oval" cx="8.95864865" cy="9.00243243" r="8.88324324"></circle>
                </g>
                <circle id="Oval" fill="#69F0AE" cx="165.5" cy="54.5" r="8.5"></circle>
                <polygon id="Path" fill="#FFFFFF" points="162.375 53.6009577 165.675512 56.4285714 170.351024 50 172 51.2857143 165.675512 59 161 54.113328"></polygon>
                <g id="Group" opacity="0.5" transform="translate(95.000000, 162.000000)" fill="url(#linearGradient-6)">
                    <circle id="Oval" cx="8.93675676" cy="9.02675676" r="8.88324324"></circle>
                </g>
                <circle id="Oval" fill="#69F0AE" cx="103.5" cy="170.5" r="8.5"></circle>
                <polygon id="Path" fill="#FFFFFF" points="100.375 170.600958 103.675512 173.428571 108.351024 167 110 168.285714 103.675512 176 99 171.115722"></polygon>
            </g>
        </g>
    </g>
</svg>