<svg xmlns="http://www.w3.org/2000/svg" width="11" height="10" fill="none" viewBox="0 0 11 10">
    <path fill="#C349CC" d="M.332.002C.242.01.156.052.095.118.033.184 0 .27 0 .358v7.857c0 .07.021.137.06.196.04.058.096.103.162.131L3.62 9.959l.004.004.019.007.011.008.023.007.012.004c.02.005.04.009.06.01h.05c.02 0 .039-.003.058-.007.024-.003.049-.01.072-.018l.004-.004 3.277-1.369 3.277 1.37c.056.023.117.032.177.027.06-.005.119-.025.17-.057.05-.033.092-.077.12-.129.03-.052.045-.11.045-.17V1.788c0-.07-.02-.139-.06-.198-.039-.059-.095-.105-.162-.133L7.38.04C7.361.03 7.342.023 7.322.017L7.31.013 7.287.009 7.276.006 7.249.002H7.165l-.034.007c-.022.005-.044.01-.065.019l-.03.015-3.247 1.354L.512.027C.455.006.393-.003.332.003zm.401.896l2.69 1.124V9.1L.732 7.977V.898zm6.111 0V7.976L4.156 9.1V2.022L6.844.898zm.734 0l2.689 1.124V9.1l-2.69-1.123V.898z"/>
</svg>
