<svg xmlns="http://www.w3.org/2000/svg" width="40" height="40" fill="none" viewBox="0 0 40 40">
    <path fill="#3D83D9" d="M40 20C40 8.941 31.058 0 20 0 8.941 0 0 8.941 0 20c0 11.058 8.941 20 20 20 11.058 0 20-8.942 20-20z"/>
    <path fill="#fff" d="M15.098 15.125h-4.625v13.231h4.624V15.125zM12.786 8.496c-1.449 0-2.591 1.337-2.257 2.84.195.864.892 1.56 1.783 1.756 1.504.306 2.786-.836 2.786-2.257 0-1.28-1.031-2.34-2.313-2.34zM30.334 19.192c-.306-2.507-1.56-4.067-4.93-4.067-2.396 0-3.343.362-3.9 1.42v-1.42h-3.76v13.231h3.844V21.42c0-1.727.334-3.036 2.479-3.036 2.117 0 2.284 1.616 2.284 3.148v6.824h3.983s.056-8.58 0-9.164z"/>
</svg>
