<svg width="68" height="68" viewBox="0 0 68 68" fill="none" xmlns="http://www.w3.org/2000/svg">
    <g opacity=".2" fill="#25282B">
        <path d="M35.148 54.414H13.943a1.064 1.064 0 0 1-1.064-1.064V32.157a1.064 1.064 0 0 1 1.816-.752l21.11 21.11a1.062 1.062 0 0 1-.657 1.9zm-20.14-2.127H32.57L15.007 34.725v17.562z"/>
        <path d="M66.9 65.395 1.817.316A1.064 1.064 0 0 0 0 1.065v65.166c0 .584.479 1.063 1.063 1.063H66.24a1.064 1.064 0 0 0 .66-1.898zm-64.773-.228V3.634L6.59 8.096 5.308 9.372a1.06 1.06 0 0 0 0 1.5 1.058 1.058 0 0 0 1.505 0L8.09 9.596l3.479 3.478-3.016 3.016a1.065 1.065 0 0 0 0 1.505c.207.207.479.309.75.309.277 0 .548-.101.755-.309l3.016-3.015 3.738 3.738-1.281 1.276a1.06 1.06 0 0 0 0 1.5c.213.213.484.314.755.314.272 0 .543-.1.75-.308l1.276-1.282 3.479 3.478-3.016 3.016a1.066 1.066 0 0 0 0 1.505c.207.207.479.309.755.309.272 0 .543-.101.75-.309l3.016-3.015 3.738 3.738-1.276 1.276c-.42.415-.42 1.09 0 1.506.207.207.479.308.75.308s.543-.1.75-.308l1.282-1.277 3.473 3.473-3.016 3.016a1.066 1.066 0 0 0 0 1.505c.207.207.479.309.755.309.272 0 .543-.101.75-.309l3.016-3.016 3.738 3.739-1.276 1.276a1.066 1.066 0 0 0 0 1.506 1.076 1.076 0 0 0 1.505 0l1.277-1.277 3.473 3.473-3.016 3.016a1.065 1.065 0 0 0 0 1.505c.207.207.484.309.755.309.272 0 .543-.101.75-.31l3.016-3.015 3.738 3.739-1.276 1.276a1.065 1.065 0 0 0 0 1.505c.207.207.479.31.75.31s.548-.102.755-.31l1.277-1.276 3.473 3.473-3.016 3.016a1.066 1.066 0 0 0 1.505 1.505l3.016-3.016 3.738 3.739-1.276 1.276a1.066 1.066 0 0 0 .75 1.82c.271 0 .548-.107.755-.315l1.277-1.276 4.456 4.456H2.127z"/>
    </g>
</svg>
