<svg xmlns="http://www.w3.org/2000/svg" width="48" height="48" fill="none" viewBox="0 0 48 48">
    <circle cx="24" cy="24" r="24" fill="#0C0"/>
    <path fill="#fff" d="M24.738 12.578v-1.501h.492c.196 0 .384-.078.522-.216.139-.139.216-.327.216-.523 0-.195-.077-.383-.216-.522-.138-.138-.326-.216-.522-.216h-2.462c-.195 0-.383.078-.522.216-.138.139-.216.327-.216.522 0 .196.078.384.216.523.139.138.327.216.522.216h.493v1.501c-3.325.193-6.445 1.673-8.696 4.128-2.251 2.455-3.457 5.691-3.36 9.02.096 3.33 1.486 6.49 3.875 8.812 2.389 2.32 5.588 3.62 8.92 3.62 3.33 0 6.53-1.3 8.919-3.62 2.389-2.321 3.779-5.482 3.875-8.811.096-3.33-1.11-6.566-3.36-9.02-2.252-2.456-5.371-3.936-8.696-4.129zm-.739 24.099c-2.24 0-4.428-.664-6.29-1.908-1.863-1.245-3.314-3.013-4.17-5.082-.858-2.07-1.082-4.346-.645-6.542.437-2.197 1.515-4.214 3.099-5.798 1.583-1.583 3.6-2.662 5.797-3.099 2.197-.437 4.473-.212 6.542.645 2.07.857 3.838 2.308 5.082 4.17 1.244 1.862 1.908 4.051 1.908 6.29 0 1.488-.293 2.96-.862 4.334-.569 1.374-1.403 2.622-2.454 3.673-1.052 1.052-2.3 1.886-3.674 2.455-1.373.569-2.846.862-4.333.862z"/>
    <path fill="#fff" d="M23.998 17.724c-1.51 0-2.985.448-4.24 1.286-1.254.839-2.232 2.03-2.81 3.425-.578 1.394-.729 2.929-.434 4.409.294 1.48 1.021 2.84 2.088 3.907 1.067 1.067 2.427 1.794 3.907 2.088 1.48.295 3.015.144 4.41-.434 1.393-.578 2.585-1.556 3.424-2.81.838-1.255 1.286-2.73 1.286-4.24-.002-2.023-.806-3.963-2.237-5.394-1.43-1.431-3.37-2.235-5.394-2.237zm0 13.785c-1.217 0-2.407-.36-3.419-1.037-1.012-.676-1.8-1.637-2.267-2.762-.465-1.124-.587-2.362-.35-3.555.238-1.194.824-2.29 1.684-3.151.861-.86 1.958-1.447 3.151-1.684 1.194-.238 2.431-.116 3.556.35 1.124.465 2.085 1.254 2.762 2.266.676 1.012 1.037 2.202 1.037 3.42-.003 1.63-.652 3.194-1.806 4.348-1.153 1.153-2.717 1.802-4.348 1.805z"/>
    <path fill="#fff" d="M26.994 22.583L22.45 26.56l-1.403-1.413c-.14-.137-.327-.214-.522-.214s-.383.077-.522.214c-.069.068-.124.15-.161.239-.038.09-.057.186-.057.283 0 .097.02.193.057.282.037.09.092.171.161.24l1.9 1.9c.069.069.15.123.24.16.09.038.185.056.282.056.181.004.357-.061.493-.182l5.066-4.43c.147-.131.237-.315.249-.512.012-.196-.055-.39-.186-.537-.13-.148-.314-.237-.51-.25-.197-.011-.39.055-.538.186h-.005z"/>
</svg>
