<svg xmlns="http://www.w3.org/2000/svg" width="20" height="20" fill="none" viewBox="0 0 20 20">
    <path fill="#25282B" d="M9.933 3.605V2.76h.288c.115 0 .225-.044.306-.122.081-.078.127-.184.127-.294 0-.11-.046-.216-.127-.294-.081-.078-.191-.122-.306-.122H8.78c-.115 0-.225.044-.306.122-.081.078-.127.183-.127.294 0 .11.046.216.127.294.081.078.191.122.306.122h.288v.845c-1.948.109-3.776.943-5.095 2.325-1.319 1.383-2.025 3.205-1.969 5.08.056 1.876.871 3.656 2.27 4.963 1.4 1.308 3.275 2.039 5.227 2.039 1.952 0 3.826-.731 5.226-2.039 1.4-1.307 2.214-3.087 2.27-4.962.057-1.876-.65-3.698-1.968-5.08-1.32-1.383-3.147-2.217-5.095-2.326zM9.5 17.178c-1.312 0-2.595-.374-3.686-1.075-1.091-.7-1.941-1.696-2.444-2.862-.502-1.165-.633-2.447-.377-3.684.256-1.238.888-2.374 1.816-3.266.927-.892 2.11-1.5 3.397-1.745 1.287-.246 2.62-.12 3.833.363 1.212.482 2.248 1.3 2.977 2.349.73 1.048 1.118 2.281 1.118 3.543 0 .837-.171 1.667-.505 2.44-.333.774-.822 1.477-1.438 2.07-.616.592-1.347 1.061-2.152 1.382-.805.32-1.668.485-2.539.485z"/>
    <path fill="#25282B" d="M9.5 6.503c-.884 0-1.749.252-2.484.724-.735.473-1.308 1.144-1.647 1.93-.338.785-.427 1.649-.254 2.482.172.834.598 1.6 1.223 2.201.626.601 1.422 1.01 2.29 1.176.867.166 1.766.081 2.583-.244.817-.325 1.515-.876 2.007-1.583.49-.707.753-1.538.753-2.388 0-1.14-.472-2.232-1.31-3.038-.839-.806-1.976-1.26-3.161-1.26zm0 7.764c-.713 0-1.41-.203-2.003-.584-.593-.38-1.055-.922-1.328-1.556-.273-.633-.345-1.33-.206-2.002.14-.672.483-1.29.987-1.775.505-.485 1.147-.815 1.846-.948.7-.134 1.425-.065 2.084.197s1.222.706 1.618 1.276c.396.57.608 1.24.608 1.926-.002.919-.382 1.8-1.058 2.45-.676.649-1.592 1.015-2.548 1.016z"/>
    <path fill="#25282B" d="M11.254 9.24L8.59 11.48l-.822-.796c-.081-.077-.191-.12-.306-.12-.114 0-.224.043-.305.12-.04.039-.073.085-.095.135-.022.05-.033.105-.033.16 0 .054.011.108.033.159.022.05.054.096.095.134l1.113 1.07c.04.04.088.07.14.091.053.021.109.032.166.032.106.002.209-.035.288-.103l2.969-2.495c.086-.074.138-.178.146-.288.006-.111-.033-.22-.109-.303-.077-.083-.184-.134-.3-.14-.115-.007-.228.03-.314.104h-.003z"/>
</svg>
