<svg xmlns="http://www.w3.org/2000/svg" width="20" height="20" fill="none" viewBox="0 0 20 20">
    <g opacity=".7">
        <path fill="#fff" d="M0 0H20V20H0z"/>
        <path fill="#25282B" d="M10.07 2.141c-4.38 0-7.93 3.55-7.93 7.93C2.14 14.45 5.69 18 10.07 18S18 14.45 18 10.07c0-4.379-3.55-7.929-7.93-7.929zm0 .933c3.875 0 6.997 3.122 6.997 6.996 0 3.875-3.122 6.997-6.997 6.997s-6.997-3.122-6.997-6.997c0-3.874 3.122-6.996 6.997-6.996zM7.458 5.966l-.622.87H8.61c.183 0 1.47.067 1.928.933H7.457l-.622.871h3.856c0 .018-.03.046-.031.062 0 0-.004 1.917-3.483 1.586V11.128l3.763 4.104h1.43v-.186l-3.607-4.043v-.062s2.827.04 3.296-2.27c0 0-.002-.015 0-.03h1.182l.653-.872h-1.866c-.07-.319-.214-.646-.497-.932h1.74l.623-.871H7.458z"/>
    </g>
</svg>
