{
  "Aboutus.js": "/assets/Aboutus.chunk.js",
  "Acads.js": "/assets/Acads.chunk.js",
  "Acads~Jeet~Otp.js": "/assets/Acads~Jeet~Otp.chunk.js",
  "Acads~Jeet~Otp~Team.js": "/assets/Acads~Jeet~Otp~Team.chunk.js",
  "Assignments.js": "/assets/Assignments.chunk.js",
  "CancellationAndReturn.js": "/assets/CancellationAndReturn.chunk.js",
  "Careers.js": "/assets/Careers.chunk.js",
  "Connect.js": "/assets/Connect.chunk.js",
  "Culture.js": "/assets/Culture.chunk.js",
  "Customers.js": "/assets/Customers.chunk.js",
  "Doubts.js": "/assets/Doubts.chunk.js",
  "GetRanks.js": "/assets/GetRanks.chunk.js",
  "HowWorks.js": "/assets/HowWorks.chunk.js",
  "Jeet.js": "/assets/Jeet.chunk.js",
  "LaunchingSoon.js": "/assets/LaunchingSoon.chunk.js",
  "Live Classes.js": "/assets/Live%20Classes.chunk.js",
  "Otp.js": "/assets/Otp.chunk.js",
  "Press.js": "/assets/Press.chunk.js",
  "Pricing.js": "/assets/Pricing.chunk.js",
  "PricingDetails.js": "/assets/PricingDetails.chunk.js",
  "PrivacyAndTerms.js": "/assets/PrivacyAndTerms.chunk.js",
  "Score.js": "/assets/Score.chunk.js",
  "Team.js": "/assets/Team.chunk.js",
  "TermsAndConditions.js": "/assets/TermsAndConditions.chunk.js",
  "Tests.js": "/assets/Tests.chunk.js",
  "client.js": "/assets/client.js",
  "qms.js": "/assets/qms.chunk.js",
  "vendors.js": "/assets/vendors.chunk.js"
}