<svg xmlns="http://www.w3.org/2000/svg" width="357" height="387" fill="none" viewBox="0 0 357 387">
    <path fill="url(#paint0_linear)" d="M232.228 139.607c-.22.701-.439 1.227-.878 1.752 1.098.701 1.866 1.227 2.525 1.927.549-.525.769-.876.878-1.576-.329-.526-1.317-1.402-2.525-2.103z"/>
    <path fill="url(#paint1_linear)" d="M232.228 373.852c-.22.7-.439 1.226-.878 1.751 1.098.701 1.866 1.227 2.525 1.927.549-.525.769-.875.878-1.576-.329-.526-1.317-1.402-2.525-2.102z"/>
    <path fill="url(#paint2_linear)" d="M100.732 94.537c.44.7.549 1.226.44 2.277.768-.35 1.098-.876 1.866-1.927.11-.876-.11-1.401-.549-2.102-.549 1.051-.988 1.577-1.757 1.752z"/>
    <path fill="url(#paint3_linear)" d="M100.732 328.781c.44.701.549 1.226.44 2.277.768-.35 1.098-.875 1.866-1.927.11-.875-.11-1.401-.549-2.102-.549 1.051-.988 1.577-1.757 1.752z"/>
    <path fill="url(#paint4_linear)" d="M30.262 7.43c.878-1.226 1.427-2.452 1.647-4.03-.55-.875-.988-1.4-1.537-1.576-.44 1.752-.769 2.628-1.647 3.854.768.35 1.207.701 1.537 1.752z"/>
    <path fill="url(#paint5_linear)" d="M198.977 77.704c-.769-.35-1.427-.525-2.086-.175-.22.876-.22 1.401-.11 2.102.769-.175 1.318-.175 2.086.35-.11-1.05-.11-1.576.11-2.277z"/>
    <path fill="url(#paint6_linear)" d="M28.27 316.601c.389-1.112.545-1.854.311-3.09-1.324-.618-2.025-1.113-3.194-1.978-.077.742-.233 1.236-.389 1.607 1.402.989 2.181 1.854 3.272 3.461z"/>
    <path fill="url(#paint7_linear)" d="M144.484 134.024c0-1.226-.219-1.927-.768-2.628-.769.176-1.318.526-1.647 1.227.219 1.226.11 2.277-.11 3.854.878-1.226 1.427-1.927 2.525-2.453z"/>
    <path fill="url(#paint8_linear)" d="M144.484 368.268c0-1.226-.219-1.927-.768-2.627-.769.175-1.318.525-1.647 1.226.219 1.226.11 2.277-.11 3.854.878-1.226 1.427-1.927 2.525-2.453z"/>
    <path fill="url(#paint9_linear)" d="M233.078 44.452c0-1.226-.219-1.927-.768-2.628-.769.175-1.318.526-1.647 1.227.219 1.226.109 2.277-.11 3.854.878-1.227 1.427-1.927 2.525-2.453z"/>
    <path fill="url(#paint10_linear)" d="M307.024 58.673c-.879-.525-1.318-1.051-2.086-1.927-.33.526-.549 1.051-.549 1.752.439.7 1.098 1.402 2.086 2.277 0-1.226.11-1.752.549-2.102z"/>
    <path fill="url(#paint11_linear)" d="M270.221 107.988c-.22 1.227-.44 1.927-.989 2.978.33.351.659.701.989.701.329-.701.768-1.576 1.098-2.803-.549 0-.879-.175-1.098-.876z"/>
    <path fill="url(#paint12_linear)" d="M270.221 342.232c-.22 1.227-.44 1.927-.989 2.979.33.35.659.7.989.7.329-.7.768-1.576 1.098-2.803-.549 0-.879-.175-1.098-.876z"/>
    <path fill="url(#paint13_linear)" d="M234.051 115.712c.22-.351.549-.701.989-.701-.44-1.752-.769-2.803-1.428-4.204-.659.175-.988.525-1.208.876.879 1.401 1.208 2.452 1.647 4.029z"/>
    <path fill="url(#paint14_linear)" d="M234.051 349.954c.22-.35.549-.701.989-.701-.44-1.752-.769-2.803-1.428-4.204-.659.175-.988.525-1.208.876.879 1.401 1.208 2.452 1.647 4.029z"/>
    <path fill="url(#paint15_linear)" d="M329.647 7.905c.22-.35.549-.7.988-.7-.439-1.752-.768-2.804-1.427-4.205-.659.175-.988.526-1.208.876.878 1.401 1.208 2.453 1.647 4.03z"/>
    <path fill="url(#paint16_linear)" d="M271.633 312.446c.33-.876.439-1.402.22-2.453-.988-.35-1.647-.7-2.526-1.401 0 .525-.109 1.051-.329 1.401 1.098.526 1.757 1.227 2.635 2.453z"/>
    <path fill="url(#paint17_linear)" d="M190.611 138.467c.549.351.988.351 1.757-.175-.33-1.927-.44-3.153-.22-5.255-.549.35-.988.175-1.867-.176-.109 2.103 0 3.679.33 5.606z"/>
    <path fill="url(#paint18_linear)" d="M190.611 372.711c.549.351.988.351 1.757-.175-.33-1.927-.44-3.153-.22-5.255-.549.35-.988.175-1.867-.176-.109 2.103 0 3.679.33 5.606z"/>
    <path fill="url(#paint19_linear)" d="M354.433 138.467c.549.351.988.351 1.757-.175-.33-1.927-.44-3.153-.22-5.255-.549.35-.988.175-1.866-.176-.11 2.103 0 3.679.329 5.606z"/>
    <path fill="url(#paint20_linear)" d="M354.433 372.711c.549.351.988.351 1.757-.175-.33-1.927-.44-3.153-.22-5.255-.549.35-.988.175-1.866-.176-.11 2.103 0 3.679.329 5.606z"/>
    <path fill="url(#paint21_linear)" d="M253.531 8.453c-1.318-1.402-2.196-1.927-3.404-2.453-.22 1.577-.11 2.628 0 3.679.768 0 1.317.525 2.086 1.401.329-1.401.659-1.927 1.318-2.627z"/>
    <path fill="url(#paint22_linear)" d="M101.853 276.165c-.659-.176-1.537-.351-2.196.35-.22.876-.439 1.401-.768 2.277.549 0 .878.351 1.317 1.227.33-1.402.879-2.453 1.647-3.854z"/>
    <path fill="url(#paint23_linear)" d="M166.129 318.91c-.549.351-.988.526-1.537.701 0 .525.11.876.329 1.226.439 0 .988-.175 1.647-.525-.329-.526-.439-.876-.439-1.402z"/>
    <path fill="url(#paint24_linear)" d="M205.307 320.246c-.143-.706-.143-1.2.192-1.977-.671-.141-1.102 0-1.916.353-.24.565-.24.988-.096 1.765.718-.282 1.245-.424 1.82-.141z"/>
    <path fill="url(#paint25_linear)" d="M23.74 133.894c.604-.877 1.141-1.072 1.947-1.169-.739-1.755-1.611-3.314-2.216-3.899-.604.487-1.007 1.072-1.477 2.047.672.585 1.074 1.462 1.746 3.021z"/>
    <path fill="url(#paint26_linear)" d="M23.74 368.138c.604-.877 1.141-1.072 1.947-1.169-.739-1.754-1.611-3.314-2.216-3.899-.604.488-1.007 1.072-1.477 2.047.672.585 1.074 1.462 1.746 3.021z"/>
    <path fill="url(#paint27_linear)" d="M104.038 9.153c1.098-.7 1.647-1.05 2.525-.876-.109-.7 0-1.226.11-1.576-.988-.35-1.757-.176-2.855.525 0 .7.11 1.226.22 1.927z"/>
    <path fill="url(#paint28_linear)" d="M21.065 80.75c1.098.525 1.757.525 3.075 0-.55-2.103-.55-3.504-.33-5.081-.988-.7-1.756-.7-2.964-.876.439 2.102.439 3.679.22 5.956z"/>
    <path fill="url(#paint29_linear)" d="M49.07 49.951c-.439.526-.439 1.227-.548 2.453 1.537.35 3.074 1.401 4.83 2.803.11-.876.33-1.402.77-2.102-1.758-1.752-2.855-2.453-5.051-3.154z"/>
    <path fill="url(#paint30_linear)" d="M142.508 85.063c-.439.525-.439 1.226-.549 2.452 1.537.35 3.074 1.402 4.831 2.803.11-.876.33-1.401.769-2.102-1.757-1.752-2.855-2.453-5.051-3.153z"/>
    <path fill="url(#paint31_linear)" d="M142.508 319.307c-.439.525-.439 1.226-.549 2.452 1.537.351 3.074 1.402 4.831 2.803.11-.876.33-1.401.769-2.102-1.757-1.752-2.855-2.453-5.051-3.153z"/>
    <path fill="url(#paint32_linear)" d="M35.275 133.783c.879-.35 1.208-.876 1.757-2.102-.768-1.927-1.098-3.329-1.647-5.431-.44.526-.768.701-1.098.876.659 2.453.769 4.029.988 6.657z"/>
    <path fill="url(#paint33_linear)" d="M35.275 368.027c.879-.35 1.208-.876 1.757-2.102-.768-1.927-1.098-3.329-1.647-5.431-.44.526-.768.701-1.098.876.659 2.453.769 4.029.988 6.657z"/>
    <path fill="url(#paint34_linear)" d="M134.068 285.976c.549 0 1.098.351 1.757.876 0-2.277.11-3.854.439-5.606-.549-.876-.988-1.051-1.537-1.051-.329 1.227-.549 3.329-.659 5.781z"/>
    <path fill="url(#paint35_linear)" d="M309.334 310.137c.549 0 1.098.35 1.757.875 0-2.277.109-3.854.439-5.605-.549-.876-.988-1.052-1.537-1.052-.33 1.227-.549 3.329-.659 5.782z"/>
    <path fill="url(#paint36_linear)" d="M287.465 133.166c-.769 1.402-1.427 3.153-1.537 5.431.659 1.226.988 2.102 1.427 3.679.33-1.227.879-1.752 2.196-1.927-.988-1.927-1.537-4.205-2.086-7.183z"/>
    <path fill="url(#paint37_linear)" d="M287.465 367.41c-.769 1.402-1.427 3.153-1.537 5.431.659 1.226.988 2.102 1.427 3.679.33-1.226.879-1.752 2.196-1.927-.988-1.927-1.537-4.205-2.086-7.183z"/>
    <path fill="url(#paint38_linear)" d="M347.186 46.848c-.769 1.401-1.428 3.153-1.538 5.43.659 1.227.989 2.103 1.428 3.68.329-1.227.878-1.752 2.196-1.928-.988-1.927-1.537-4.204-2.086-7.182z"/>
    <path fill="url(#paint39_linear)" d="M55.861 313.201c.44 0 .769.35 1.098 1.051.33-.876.33-1.577.44-2.803-.22-.526-.55-.701-.989-.701-.11 1.051-.22 1.752-.549 2.453z"/>
    <path fill="url(#paint40_linear)" d="M18.84 211.871c0 1.051-.22 1.577-.658 2.453 1.098.35 2.086.525 2.635.35.11-.876.11-1.577 0-2.453-.55.176-1.098 0-1.977-.35z"/>
    <path fill="url(#paint41_linear)" d="M144.353 6.386c1.098-1.927 1.757-2.978 3.075-3.679-.33-.876-.439-1.577-.439-2.277-1.428.7-2.416 1.576-3.624 3.503.22 1.227.549 1.927.988 2.453z"/>
    <path fill="url(#paint42_linear)" d="M340.412 310.695c-.11.701-.439 1.577-1.428 2.628.33.701.769 1.051 1.428 1.226.659-1.051.988-1.576 1.427-2.978-.549-.175-.878-.35-1.427-.876z"/>
    <path fill="url(#paint43_linear)" d="M71.75 153.141c.659-.526 1.537-.526 3.294.525.11-1.226.11-2.452-.33-3.854-1.317-.525-2.195-.525-3.513 0 .33.876.44 1.752.55 3.329z"/>
    <path fill="url(#paint44_linear)" d="M230.506 83.532c0 .876.11 1.402.439 2.278.549-.701.988-.876 1.427-.876 0-.876 0-1.402-.219-2.278-.549.526-.988.701-1.647.876z"/>
    <path fill="url(#paint45_linear)" d="M230.506 317.776c0 .876.11 1.402.439 2.278.549-.701.988-.876 1.427-.876 0-.876 0-1.402-.219-2.278-.549.526-.988.701-1.647.876z"/>
    <path fill="url(#paint46_linear)" d="M124.803 206.339c.11 1.401.659 2.277 1.757 3.504 1.207-2.453 2.196-3.679 3.843-5.081-.769-.876-1.098-1.752-1.538-3.854-1.647 1.226-2.745 2.978-4.062 5.431z"/>
    <path fill="url(#paint47_linear)" d="M347.185 288.779c.439-1.577.658-2.803.768-4.205-.768 0-1.207.175-1.647.351.11.876-.109 1.576-.439 2.627.659.176.988.526 1.318 1.227z"/>
    <path fill="url(#paint48_linear)" d="M169.011 273.576c.11-.876.22-1.577.549-2.453-1.317-.175-2.196-.35-3.184-1.051-.549.701-.659 1.402-.769 2.278.769.525 1.977 1.051 3.404 1.226z"/>
    <path fill="url(#paint49_linear)" d="M71.096 1.72c-1.098.701-1.867.877-3.075.877 0 .876.11 1.751.44 2.452.768.175 1.866-.175 3.184-.525-.55-1.051-.769-1.752-.55-2.803z"/>
    <path fill="url(#paint50_linear)" d="M230.751 181.215c.22-1.052.33-1.577.769-2.453-.22-.35-.549-.526-.769-.526-.329.526-.549 1.227-.878 2.453.439-.175.659 0 .878.526z"/>
    <path fill="url(#paint51_linear)" d="M204.102 125.84c-1.207.701-2.086 1.577-2.745 2.978.22 1.226.549 1.927 1.098 2.628.879-1.577 1.538-2.102 2.745-2.803-.768-1.051-1.098-1.577-1.098-2.803z"/>
    <path fill="url(#paint52_linear)" d="M204.102 360.084c-1.207.701-2.086 1.577-2.745 2.978.22 1.226.549 1.927 1.098 2.628.879-1.577 1.538-2.102 2.745-2.803-.768-1.051-1.098-1.577-1.098-2.803z"/>
    <path fill="url(#paint53_linear)" d="M87.125 142.658c-.659-.351-.878-1.052-1.318-1.928-.658 1.577-1.098 3.154-1.207 4.03.439.525.878.7 1.537 1.051.11-1.051.439-1.927.988-3.153z"/>
    <path fill="url(#paint54_linear)" d="M87.125 376.902c-.659-.351-.878-1.051-1.318-1.927-.658 1.576-1.098 3.153-1.207 4.029.439.525.878.701 1.537 1.051.11-1.051.439-1.927.988-3.153z"/>
    <path fill="url(#paint55_linear)" d="M277.546 77.05c.787-1.033 1.136-1.77 1.224-3.54-1.312-1.624-2.011-2.804-3.148-4.87-.262.886-.612 1.476-.874 1.771 1.312 2.213 1.924 3.836 2.798 6.64z"/>
    <path fill="url(#paint56_linear)" d="M22.637 40.974c-.768-.35-1.427-.526-2.086-.176-.22.876-.22 1.402-.11 2.103.769-.176 1.318-.176 2.086.35-.11-1.051-.11-1.577.11-2.277z"/>
    <path fill="url(#paint57_linear)" d="M37.828 163.613c-.439.526-.439 1.227-.549 2.453 1.537.35 3.075 1.401 4.831 2.803.11-.876.33-1.402.77-2.102-1.758-1.752-2.856-2.453-5.052-3.154z"/>
    <path fill="url(#paint58_linear)" d="M289.986 178.544c1.098-1.927 1.757-2.978 3.075-3.679-.33-.876-.44-1.576-.44-2.277-1.427.701-2.415 1.577-3.623 3.504.22 1.226.549 1.927.988 2.452z"/>
    <path fill="url(#paint59_linear)" d="M232.228 258.453c-.22.701-.439 1.226-.878 1.752 1.098.701 1.866 1.226 2.525 1.927.549-.526.769-.876.878-1.577-.329-.525-1.317-1.401-2.525-2.102z"/>
    <path fill="url(#paint60_linear)" d="M286.012 276.335c-.879.525-1.537.525-2.526-.351-.109 1.927.11 3.329.659 5.781.769.701 1.318.701 2.196 0-.329-1.927-.549-3.503-.329-5.43z"/>
    <path fill="url(#paint61_linear)" d="M265.368 45.634c.402.164.627.448.726 1.254 1.538-1.477 2.346-2.678 3.658-4.438-.224-1.049-.55-1.373-.851-1.496-1.087 2.044-2.096 3.162-3.533 4.68z"/>
    <path fill="url(#paint62_linear)" d="M190.611 257.313c.549.35.988.35 1.757-.175-.33-1.927-.44-3.154-.22-5.256-.549.351-.988.175-1.867-.175-.109 2.102 0 3.679.33 5.606z"/>
    <path fill="url(#paint63_linear)" d="M354.433 257.313c.549.35.988.35 1.757-.175-.33-1.927-.44-3.154-.22-5.256-.549.351-.988.175-1.866-.175-.11 2.102 0 3.679.329 5.606z"/>
    <path fill="url(#paint64_linear)" d="M11.283 260.74c.879-.35 1.208-.876 1.757-2.102-.769-1.927-1.098-3.329-1.647-5.431-.44.526-.769.701-1.098.876.659 2.453.768 4.029.988 6.657z"/>
    <path fill="url(#paint65_linear)" d="M104.217 312.717c.549 0 1.098.35 1.756.876 0-2.278.11-3.855.44-5.606-.549-.876-.989-1.051-1.537-1.051-.33 1.226-.549 3.328-.659 5.781z"/>
    <path fill="url(#paint66_linear)" d="M4.813 144.328c-.769 1.402-1.428 3.153-1.538 5.431.66 1.226.989 2.102 1.428 3.679.33-1.226.878-1.752 2.196-1.927-.988-1.927-1.537-4.205-2.086-7.183z"/>
    <path fill="url(#paint67_linear)" d="M4.813 378.572c-.769 1.402-1.428 3.154-1.538 5.431.66 1.226.989 2.102 1.428 3.679.33-1.226.878-1.752 2.196-1.927-.988-1.927-1.537-4.205-2.086-7.183z"/>
    <path fill="url(#paint68_linear)" d="M204.829 4.252c0 1.051-.22 1.577-.659 2.453 1.098.35 2.086.525 2.635.35.11-.876.11-1.577 0-2.453-.549.175-1.098 0-1.976-.35z"/>
    <path fill="url(#paint69_linear)" d="M41.486 275.704c.11 1.402.66 2.278 1.757 3.504 1.208-2.453 2.196-3.679 3.843-5.081-.768-.875-1.098-1.751-1.537-3.854-1.647 1.227-2.745 2.979-4.063 5.431z"/>
    <path fill="url(#paint70_linear)" d="M323.695 246.628c.11 1.401.659 2.277 1.757 3.504 1.208-2.453 2.196-3.679 3.843-5.081-.768-.876-1.098-1.752-1.537-3.854-1.647 1.227-2.745 2.978-4.063 5.431z"/>
    <path fill="url(#paint71_linear)" d="M7.645 291.615c-.769-.876-1.757-1.752-2.855-1.577-.549.876-.988 1.402-1.757 2.102.659.351.879 1.051 1.098 2.628.879-1.226 1.977-2.102 3.514-3.153z"/>
    <path fill="url(#paint72_linear)" d="M230.751 300.058c.22-1.051.33-1.576.769-2.452-.22-.351-.549-.526-.769-.526-.329.526-.549 1.226-.878 2.453.439-.175.659 0 .878.525z"/>
    <path fill="url(#paint73_linear)" d="M87.125 261.501c-.659-.35-.878-1.051-1.318-1.927-.658 1.577-1.098 3.153-1.207 4.029.439.526.878.701 1.537 1.051.11-1.051.439-1.927.988-3.153z"/>
    <path fill="url(#paint74_linear)" d="M235.929 65.527c-.233.343-.465.686-.931.8.466 1.487.853 2.401 1.552 3.544.62-.228.931-.571 1.086-.914-.854-1.029-1.241-2.058-1.707-3.43z"/>
    <path fill="url(#paint75_linear)" d="M243.919 106.381c-.47.488-.874.834-1.478 1.097.736.981 1.237 1.696 1.57 2.513.705-.223 1.041-.426 1.411-.955-.099-.551-.667-1.633-1.503-2.655z"/>
    <path fill="url(#paint76_linear)" d="M243.919 340.625c-.47.488-.874.834-1.478 1.097.736.981 1.237 1.696 1.57 2.513.705-.222 1.041-.425 1.411-.955-.099-.55-.667-1.633-1.503-2.655z"/>
    <path fill="url(#paint77_linear)" d="M165.319 205.491c-1.239-.676-1.808-1.249-2.677-2.454-.706.732-1.144 1.404-1.448 2.3.535.899 1.27 1.88 2.643 2.781.238-1.264.575-1.977 1.482-2.627z"/>
    <path fill="url(#paint78_linear)" d="M39.863 117.01c.132.734.03 1.203-.474 2.017.838.002 1.342-.302 2.45-.87.438-.672.439-1.182.306-1.916-.907.65-1.511.913-2.282.769z"/>
    <path fill="url(#paint79_linear)" d="M39.863 351.254c.132.734.03 1.203-.474 2.017.838.002 1.342-.302 2.45-.87.438-.672.439-1.181.306-1.916-.907.65-1.511.914-2.282.769z"/>
    <path fill="url(#paint80_linear)" d="M69.24 71.75c-1.007.099-1.61-.148-2.178-1.23-.842 1.527-1.18 2.75-1.621 4.95.433.858.936 1.064 2.01.822.44-1.691.846-3.056 1.788-4.543z"/>
    <path fill="url(#paint81_linear)" d="M277.09 12.879c-.569-.573-1.105-.962-1.843-.923-.538.63-.74 1.058-.909 1.67.771.144 1.273.35 1.775 1.065.304-.897.506-1.324.977-1.813z"/>
    <path fill="url(#paint82_linear)" d="M158.747 280.579c.402.165.636.43.768 1.165 1.446-1.281 2.186-2.339 3.397-3.886-.266-.959-.6-1.266-.902-1.389-.977 1.812-1.918 2.789-3.263 4.11z"/>
    <path fill="url(#paint83_linear)" d="M186.751 153.705c.003-1.019.172-1.631.577-2.486-.369.019-.57-.063-.603-.246-.472.998-.642 1.609-.879 2.872.268-.06.469.022.905-.14z"/>
    <path fill="url(#paint84_linear)" d="M163.489 284.658c.499.5.758 1.198.738 3.262.767-.378 1.388-.913 2.082-1.913-.193-1.459-.373-2.322-1.086-3.304-.391.827-.872 1.222-1.734 1.955z"/>
    <path fill="url(#paint85_linear)" d="M180.514 7.207c-.606.773-.91 1.67-1.014 3.158 1.812-.28 2.784-.053 4.191.521.103-.978.44-1.691 1.383-3.177-1.441-.758-2.749-.782-4.56-.502z"/>
    <path fill="url(#paint86_linear)" d="M75.014 249.973c-.09-.438-.055-.826.019-1.298-.959.613-1.572.965-2.27 1.182-.216.615-.21.918-.12 1.357.533-.184 1.412-.628 2.371-1.241z"/>
    <path fill="url(#paint87_linear)" d="M235.024 264.281c-.879-.467-1.318-.934-2.086-1.713-.33.468-.549.935-.549 1.558.439.622 1.098 1.245 2.086 2.024 0-1.09.11-1.557.549-1.869z"/>
    <path fill="url(#paint88_linear)" d="M290.864 94.852c-.673.916-1.144 1.404-2.051 2.054.167.408.333.816.635.94.571-.447 1.31-.996 2.084-1.87-.503-.206-.737-.472-.668-1.124z"/>
    <path fill="url(#paint89_linear)" d="M290.864 329.096c-.673.916-1.144 1.404-2.051 2.054.167.408.333.817.635.94.571-.447 1.31-.996 2.084-1.871-.503-.205-.737-.471-.668-1.123z"/>
    <path fill="url(#paint90_linear)" d="M76.414 235.357c.134.225.268.449.166.918.84-.507 1.41-.954 2.285-1.788-.032-.693-.166-.918-.3-1.143-.672.916-1.243 1.363-2.15 2.013z"/>
    <path fill="url(#paint91_linear)" d="M226.383 296.617c.134.224.267.449.166.918.839-.508 1.411-.955 2.285-1.788-.032-.694-.166-.918-.299-1.143-.673.916-1.245 1.363-2.152 2.013z"/>
    <path fill="url(#paint92_linear)" d="M310.243 12.785c.336-.203.772-.365 1.174-.2.273-1.59.376-2.569.312-3.956-.671-.103-1.107.059-1.443.262.265 1.469.162 2.447-.043 3.894z"/>
    <path fill="url(#paint93_linear)" d="M217.005 261.827c.639-.59.942-.977 1.145-1.914-.77-.655-1.238-1.186-1.772-2.085-.203.428-.505.815-.841 1.018.803.838 1.136 1.654 1.468 2.981z"/>
    <path fill="url(#paint94_linear)" d="M352.432 183.919c.367.491.769.655 1.675.515.44-1.692.812-2.731 1.822-4.359-.637.079-.972-.227-1.641-.841-.91 1.67-1.416 2.994-1.856 4.685z"/>
    <path fill="url(#paint95_linear)" d="M350.991 10.18c-.666-1.634-1.268-2.39-2.172-3.27-.808 1.202-1.112 2.098-1.416 2.994.704.288 1.004.92 1.371 1.92.841-1.016 1.345-1.32 2.217-1.645z"/>
    <path fill="url(#paint96_linear)" d="M72.003 168.75c-.535-.389-1.272-.86-2.145-.536-.538.63-.941.976-1.58 1.566.503.205.67.613.734 1.49.841-1.017 1.748-1.667 2.991-2.52z"/>
    <path fill="url(#paint97_linear)" d="M173.089 91.969c.739-.549 1.142-.894 2.015-1.218.001-.51-.065-.877-.299-1.143-.537.12-1.209.527-2.116 1.177.435.348.569.572.4 1.184z"/>
    <path fill="url(#paint98_linear)" d="M173.089 326.213c.739-.549 1.142-.894 2.015-1.218.001-.51-.065-.877-.299-1.143-.537.121-1.209.527-2.116 1.177.435.348.569.573.4 1.184z"/>
    <path fill="url(#paint99_linear)" d="M114.397 227.571c-.637.08-1.106.058-1.676-.005-.203.428-.237.754-.171 1.121.402.165.972.227 1.71.189-.099-.551-.065-.877.137-1.305z"/>
    <path fill="url(#paint100_linear)" d="M129.238 248.189c.141-.629.331-1.031.937-1.538-.56-.365-1.009-.412-1.89-.429-.437.37-.6.715-.768 1.401.767.039 1.304.121 1.721.566z"/>
    <path fill="url(#paint101_linear)" d="M227.591 296.929c.891-.488 1.458-.445 2.233-.223-.001-1.704-.2-3.299-.528-4.001-.741.17-1.335.496-2.14 1.113.389.727.42 1.591.435 3.111z"/>
    <path fill="url(#paint102_linear)" d="M64.654 191.453c-.133-.735-.064-1.387.408-2.385-1.946.056-3.288.358-5.235.924-.573 1.466-.609 2.302-.51 2.853 1.948-1.075 3.391-1.336 5.337-1.392z"/>
    <path fill="url(#paint103_linear)" d="M196.084 101.899c-.552.004-1.085-.29-1.859-1.368-.456.575-.727 1.15-.884 1.999.689.738 1.171 1.012 2.103 1.24.015-.679.226-1.126.64-1.871z"/>
    <path fill="url(#paint104_linear)" d="M196.084 336.144c-.552.003-1.085-.291-1.859-1.369-.456.575-.727 1.15-.884 1.999.689.739 1.171 1.012 2.103 1.24.015-.679.226-1.126.64-1.87z"/>
    <path fill="url(#paint105_linear)" d="M332.323 32.506c-.604.264-.874.834-1.447 1.79 1.273.86 2.276 2.29 3.345 4.088.437-.672.84-1.017 1.512-1.423-.934-2.083-1.669-3.063-3.41-4.455z"/>
    <path fill="url(#paint106_linear)" d="M2.714 223.786c.57.062 1.007-.1 1.846-.607-.431-1.877-.291-4.202-.017-6.811-.672.406-1.04.425-1.711.321-.51 2.854-.514 4.383-.118 7.097z"/>
    <path fill="url(#paint107_linear)" d="M295.929 186.959c.57.063 1.006-.099 1.846-.606-.431-1.878-.292-4.202-.017-6.811-.672.406-1.041.425-1.711.321-.51 2.854-.514 4.383-.118 7.096z"/>
    <path fill="url(#paint108_linear)" d="M40.765 25.623c.94.043 1.443-.262 2.418-1.054.038-1.856.276-3.12.582-5.035-.604.263-.973.283-1.342.302-.341 2.242-.848 3.566-1.658 5.787z"/>
    <path fill="url(#paint109_linear)" d="M349.338 212.347c.502.205.87.696 1.271 1.37.876-1.854 1.584-3.096 2.559-4.398-.165-.918-.5-1.225-1.002-1.43-.774.875-1.784 2.503-2.828 4.458z"/>
    <path fill="url(#paint110_linear)" d="M269.429 227.622c.503.206.871.696 1.271 1.37.877-1.853 1.584-3.095 2.56-4.398-.165-.918-.5-1.224-1.003-1.43-.773.875-1.783 2.504-2.828 4.458z"/>
    <path fill="url(#paint111_linear)" d="M272.78 136.831c-1.243.853-2.52 2.032-3.497 3.844.131 1.244.096 2.08-.109 3.528.773-.875 1.478-1.097 2.752-.747-.163-1.938.211-3.997.854-6.625z"/>
    <path fill="url(#paint112_linear)" d="M272.78 371.075c-1.243.853-2.52 2.032-3.497 3.844.131 1.245.096 2.081-.109 3.528.773-.875 1.478-1.097 2.752-.747-.163-1.938.211-3.996.854-6.625z"/>
    <path fill="url(#paint113_linear)" d="M15.648 181.689c.402.164.569.573.6 1.266.64-.589.909-1.16 1.482-2.117 0-.509-.233-.775-.636-.939-.505.814-.875 1.343-1.446 1.79z"/>
    <path fill="url(#paint114_linear)" d="M20.757 85.389c-.404.855-.807 1.2-1.547 1.75.87.695 1.708 1.207 2.278 1.27.438-.672.707-1.242.944-1.996-.57-.063-1.005-.41-1.675-1.024z"/>
    <path fill="url(#paint115_linear)" d="M20.757 319.633c-.404.855-.807 1.201-1.547 1.75.87.695 1.708 1.207 2.278 1.27.438-.672.707-1.242.944-1.996-.57-.062-1.005-.41-1.675-1.024z"/>
    <path fill="url(#paint116_linear)" d="M125.984 261.756c-.37.53-1.008 1.119-2.318 1.605.032.693.3 1.143.835 1.532 1.008-.609 1.512-.914 2.453-1.89-.435-.348-.669-.614-.97-1.247z"/>
    <path fill="url(#paint117_linear)" d="M289.789 313.047c-.37.53-1.009 1.119-2.318 1.605.032.693.299 1.143.835 1.532 1.008-.609 1.511-.914 2.453-1.89-.435-.348-.669-.614-.97-1.247z"/>
    <path fill="url(#paint118_linear)" d="M20.267 154.797c.806-.181 1.61.147 2.814 1.66.572-.957 1.044-1.955 1.181-3.26-1.004-.92-1.808-1.249-3.216-1.314-.036.836-.273 1.59-.779 2.914z"/>
    <path fill="url(#paint119_linear)" d="M119.885 120.511c-.439 1.182-.274 2.1.259 3.508 2.05-1.544 3.427-2.172 5.474-2.697-.367-1-.331-1.836.076-3.711-1.98.382-3.659 1.397-5.809 2.9z"/>
    <path fill="url(#paint120_linear)" d="M119.885 354.753c-.439 1.182-.274 2.1.259 3.508 2.05-1.544 3.427-2.172 5.474-2.697-.367-1-.331-1.836.076-3.711-1.98.382-3.659 1.397-5.809 2.9z"/>
    <path fill="url(#paint121_linear)" d="M332.199 130.956c-.439 1.182-.273 2.1.26 3.509 2.05-1.545 3.426-2.173 5.473-2.698-.366-1-.331-1.836.076-3.711-1.979.382-3.659 1.397-5.809 2.9z"/>
    <path fill="url(#paint122_linear)" d="M332.199 365.201c-.439 1.181-.273 2.099.26 3.508 2.05-1.544 3.426-2.173 5.473-2.697-.366-1.001-.331-1.837.076-3.712-1.979.382-3.659 1.397-5.809 2.901z"/>
    <path fill="url(#paint123_linear)" d="M291.75 270.756c1.009-1.119 1.682-2.035 2.322-3.134-.704-.288-1.173-.309-1.643-.331-.236.754-.707 1.242-1.413 1.974.536.389.702.797.734 1.491z"/>
    <path fill="url(#paint124_linear)" d="M134.485 191.757c.437-.672.807-1.201 1.446-1.791-1.139-.635-1.876-1.106-2.511-2.046-.772.365-1.142.894-1.58 1.566.502.715 1.405 1.594 2.645 2.271z"/>
    <path fill="url(#paint125_linear)" d="M148.909 139.78c-.366-1-.934-2.083-2.007-2.351-.839.508-1.444.771-2.417 1.054.468.531.4 1.184-.006 2.549 1.276-.67 2.618-.972 4.43-1.252z"/>
    <path fill="url(#paint126_linear)" d="M148.909 374.024c-.366-1-.934-2.083-2.007-2.351-.839.508-1.444.771-2.417 1.054.468.532.4 1.184-.006 2.549 1.276-.669 2.618-.972 4.43-1.252z"/>
    <path fill="url(#paint127_linear)" d="M226.554 139.686c.606-.774.909-1.16 1.648-1.709-.066-.367-.3-.633-.501-.715-.504.305-.975.793-1.748 1.667.469.022.603.247.601.757z"/>
    <path fill="url(#paint128_linear)" d="M226.554 373.93c.606-.773.909-1.16 1.648-1.709-.066-.367-.3-.633-.501-.715-.504.305-.975.793-1.748 1.668.469.021.603.246.601.756z"/>
    <path fill="url(#paint129_linear)" d="M347.669 82.235c-1.375.119-2.516.503-3.659 1.397-.271 1.08-.239 1.774-.006 2.55 1.411-.955 2.216-1.136 3.592-1.255-.299-1.143-.399-1.694.073-2.692z"/>
    <path fill="url(#paint130_linear)" d="M347.669 316.48c-1.375.118-2.516.503-3.659 1.397-.271 1.08-.239 1.773-.006 2.549 1.411-.955 2.216-1.136 3.592-1.255-.299-1.143-.399-1.693.073-2.691z"/>
    <path fill="url(#paint131_linear)" d="M40.513 181.571c.304-.897.44-1.692.308-2.426-.47-.022-.839-.002-1.175.201.065.877-.036 1.345-.24 2.283.437-.162.705-.223 1.107-.058z"/>
    <path fill="url(#paint132_linear)" d="M109.904 54.6c-.468-.531-.399-1.183-.464-2.06-1.21 1.036-2.219 2.155-2.657 2.827.2.592.535.899 1.003 1.43.505-.814 1.144-1.404 2.118-2.197z"/>
    <path fill="url(#paint133_linear)" d="M235.24 320.727c-.468-.531-.399-1.183-.464-2.061-1.21 1.037-2.219 2.156-2.657 2.828.2.592.535.898 1.003 1.43.505-.814 1.144-1.404 2.118-2.197z"/>
    <path fill="url(#paint134_linear)" d="M10.522 187.409c-.345.192-.69.384-1.16.303-.146 1.383-.143 2.272.057 3.464.656.046 1.072-.117 1.346-.338-.385-1.157-.345-2.139-.243-3.429z"/>
    <path fill="url(#paint135_linear)" d="M24.83 249.837c-.737-.471-1.14-.635-1.473-1.452-.303.387-.538.631-.806.691.333.817.7 1.307 1.37 1.921.47-.488.606-.774.908-1.16z"/>
    <path fill="url(#paint136_linear)" d="M174.802 311.093c-.737-.471-1.139-.636-1.472-1.452-.303.386-.538.63-.807.691.334.817.701 1.307 1.371 1.921.47-.489.605-.774.908-1.16z"/>
    <defs>
        <linearGradient id="paint0_linear" x1="232.585" x2="234.621" y1="143.365" y2="140.976" gradientUnits="userSpaceOnUse">
            <stop stop-color="#FF5C5C"/>
            <stop offset=".301" stop-color="#F44444"/>
            <stop offset=".935" stop-color="#D60707"/>
            <stop offset="1" stop-color="#D30000"/>
        </linearGradient>
        <linearGradient id="paint1_linear" x1="232.585" x2="234.621" y1="377.609" y2="375.22" gradientUnits="userSpaceOnUse">
            <stop stop-color="#FF5C5C"/>
            <stop offset=".301" stop-color="#F44444"/>
            <stop offset=".935" stop-color="#D60707"/>
            <stop offset="1" stop-color="#D30000"/>
        </linearGradient>
        <linearGradient id="paint2_linear" x1="101.555" x2="103.322" y1="93.681" y2="95.766" gradientUnits="userSpaceOnUse">
            <stop stop-color="#FF5C5C"/>
            <stop offset=".301" stop-color="#F44444"/>
            <stop offset=".935" stop-color="#D60707"/>
            <stop offset="1" stop-color="#D30000"/>
        </linearGradient>
        <linearGradient id="paint3_linear" x1="101.555" x2="103.322" y1="327.925" y2="330.01" gradientUnits="userSpaceOnUse">
            <stop stop-color="#FF5C5C"/>
            <stop offset=".301" stop-color="#F44444"/>
            <stop offset=".935" stop-color="#D60707"/>
            <stop offset="1" stop-color="#D30000"/>
        </linearGradient>
        <linearGradient id="paint4_linear" x1="31.307" x2="29.149" y1="5.466" y2="4.622" gradientUnits="userSpaceOnUse">
            <stop stop-color="#FF5C5C"/>
            <stop offset=".301" stop-color="#F44444"/>
            <stop offset=".935" stop-color="#D60707"/>
            <stop offset="1" stop-color="#D30000"/>
        </linearGradient>
        <linearGradient id="paint5_linear" x1="197.873" x2="197.719" y1="77.413" y2="79.771" gradientUnits="userSpaceOnUse">
            <stop stop-color="#FF5C5C"/>
            <stop offset=".301" stop-color="#F44444"/>
            <stop offset=".935" stop-color="#D60707"/>
            <stop offset="1" stop-color="#D30000"/>
        </linearGradient>
        <linearGradient id="paint6_linear" x1="27.262" x2="25.676" y1="312.302" y2="315.147" gradientUnits="userSpaceOnUse">
            <stop stop-color="#FF5C5C"/>
            <stop offset=".301" stop-color="#F44444"/>
            <stop offset=".935" stop-color="#D60707"/>
            <stop offset="1" stop-color="#D30000"/>
        </linearGradient>
        <linearGradient id="paint7_linear" x1="143.431" x2="141.08" y1="135.288" y2="132.35" gradientUnits="userSpaceOnUse">
            <stop stop-color="#4D8EFF"/>
            <stop offset=".428" stop-color="#3F76FF"/>
            <stop offset="1" stop-color="#2850FF"/>
        </linearGradient>
        <linearGradient id="paint8_linear" x1="143.431" x2="141.08" y1="369.532" y2="366.595" gradientUnits="userSpaceOnUse">
            <stop stop-color="#4D8EFF"/>
            <stop offset=".428" stop-color="#3F76FF"/>
            <stop offset="1" stop-color="#2850FF"/>
        </linearGradient>
        <linearGradient id="paint9_linear" x1="232.024" x2="229.674" y1="45.716" y2="42.778" gradientUnits="userSpaceOnUse">
            <stop stop-color="#4D8EFF"/>
            <stop offset=".428" stop-color="#3F76FF"/>
            <stop offset="1" stop-color="#2850FF"/>
        </linearGradient>
        <linearGradient id="paint10_linear" x1="306.071" x2="304.425" y1="57.562" y2="59.351" gradientUnits="userSpaceOnUse">
            <stop stop-color="#4D8EFF"/>
            <stop offset=".428" stop-color="#3F76FF"/>
            <stop offset="1" stop-color="#2850FF"/>
        </linearGradient>
        <linearGradient id="paint11_linear" x1="269.716" x2="271.266" y1="109.433" y2="109.934" gradientUnits="userSpaceOnUse">
            <stop stop-color="#4D8EFF"/>
            <stop offset=".428" stop-color="#3F76FF"/>
            <stop offset="1" stop-color="#2850FF"/>
        </linearGradient>
        <linearGradient id="paint12_linear" x1="269.716" x2="271.266" y1="343.677" y2="344.178" gradientUnits="userSpaceOnUse">
            <stop stop-color="#4D8EFF"/>
            <stop offset=".428" stop-color="#3F76FF"/>
            <stop offset="1" stop-color="#2850FF"/>
        </linearGradient>
        <linearGradient id="paint13_linear" x1="233.191" x2="235.01" y1="113.887" y2="113.194" gradientUnits="userSpaceOnUse">
            <stop stop-color="#4D8EFF"/>
            <stop offset=".428" stop-color="#3F76FF"/>
            <stop offset="1" stop-color="#2850FF"/>
        </linearGradient>
        <linearGradient id="paint14_linear" x1="233.191" x2="235.01" y1="348.129" y2="347.437" gradientUnits="userSpaceOnUse">
            <stop stop-color="#4D8EFF"/>
            <stop offset=".428" stop-color="#3F76FF"/>
            <stop offset="1" stop-color="#2850FF"/>
        </linearGradient>
        <linearGradient id="paint15_linear" x1="328.786" x2="330.606" y1="6.08" y2="5.388" gradientUnits="userSpaceOnUse">
            <stop stop-color="#4D8EFF"/>
            <stop offset=".428" stop-color="#3F76FF"/>
            <stop offset="1" stop-color="#2850FF"/>
        </linearGradient>
        <linearGradient id="paint16_linear" x1="270.784" x2="269.609" y1="309.042" y2="311.35" gradientUnits="userSpaceOnUse">
            <stop stop-color="#4D8EFF"/>
            <stop offset=".428" stop-color="#3F76FF"/>
            <stop offset="1" stop-color="#2850FF"/>
        </linearGradient>
        <linearGradient id="paint17_linear" x1="192.682" x2="189.913" y1="135.585" y2="135.759" gradientUnits="userSpaceOnUse">
            <stop stop-color="#FC9512"/>
            <stop offset=".007" stop-color="#FC9612"/>
            <stop offset=".68" stop-color="#FED319"/>
            <stop offset="1" stop-color="#FFEB1C"/>
        </linearGradient>
        <linearGradient id="paint18_linear" x1="192.682" x2="189.913" y1="369.829" y2="370.004" gradientUnits="userSpaceOnUse">
            <stop stop-color="#FC9512"/>
            <stop offset=".007" stop-color="#FC9612"/>
            <stop offset=".68" stop-color="#FED319"/>
            <stop offset="1" stop-color="#FFEB1C"/>
        </linearGradient>
        <linearGradient id="paint19_linear" x1="356.504" x2="353.735" y1="135.585" y2="135.759" gradientUnits="userSpaceOnUse">
            <stop stop-color="#FC9512"/>
            <stop offset=".007" stop-color="#FC9612"/>
            <stop offset=".68" stop-color="#FED319"/>
            <stop offset="1" stop-color="#FFEB1C"/>
        </linearGradient>
        <linearGradient id="paint20_linear" x1="356.504" x2="353.735" y1="369.829" y2="370.004" gradientUnits="userSpaceOnUse">
            <stop stop-color="#FC9512"/>
            <stop offset=".007" stop-color="#FC9612"/>
            <stop offset=".68" stop-color="#FED319"/>
            <stop offset="1" stop-color="#FFEB1C"/>
        </linearGradient>
        <linearGradient id="paint21_linear" x1="252.004" x2="250.009" y1="6.425" y2="9.849" gradientUnits="userSpaceOnUse">
            <stop stop-color="#FC9512"/>
            <stop offset=".007" stop-color="#FC9612"/>
            <stop offset=".68" stop-color="#FED319"/>
            <stop offset="1" stop-color="#FFEB1C"/>
        </linearGradient>
        <linearGradient id="paint22_linear" x1="101.146" x2="98.935" y1="278.141" y2="277.389" gradientUnits="userSpaceOnUse">
            <stop stop-color="#FC9512"/>
            <stop offset=".007" stop-color="#FC9612"/>
            <stop offset=".68" stop-color="#FED319"/>
            <stop offset="1" stop-color="#FFEB1C"/>
        </linearGradient>
        <linearGradient id="paint23_linear" x1="165.402" x2="166.18" y1="319.145" y2="320.803" gradientUnits="userSpaceOnUse">
            <stop stop-color="#FC9512"/>
            <stop offset=".007" stop-color="#FC9612"/>
            <stop offset=".68" stop-color="#FED319"/>
            <stop offset="1" stop-color="#FFEB1C"/>
        </linearGradient>
        <linearGradient id="paint24_linear" x1="204.49" x2="204.363" y1="320.405" y2="317.877" gradientUnits="userSpaceOnUse">
            <stop stop-color="#FC9512"/>
            <stop offset=".007" stop-color="#FC9612"/>
            <stop offset=".68" stop-color="#FED319"/>
            <stop offset="1" stop-color="#FFEB1C"/>
        </linearGradient>
        <linearGradient id="paint25_linear" x1="22.771" x2="25.678" y1="132.671" y2="131.175" gradientUnits="userSpaceOnUse">
            <stop stop-color="#FC9512"/>
            <stop offset=".007" stop-color="#FC9612"/>
            <stop offset=".68" stop-color="#FED319"/>
            <stop offset="1" stop-color="#FFEB1C"/>
        </linearGradient>
        <linearGradient id="paint26_linear" x1="22.771" x2="25.678" y1="366.915" y2="365.419" gradientUnits="userSpaceOnUse">
            <stop stop-color="#FC9512"/>
            <stop offset=".007" stop-color="#FC9612"/>
            <stop offset=".68" stop-color="#FED319"/>
            <stop offset="1" stop-color="#FFEB1C"/>
        </linearGradient>
        <linearGradient id="paint27_linear" x1="105.179" x2="105.997" y1="6.299" y2="9.232" gradientUnits="userSpaceOnUse">
            <stop stop-color="#FC9512"/>
            <stop offset=".007" stop-color="#FC9612"/>
            <stop offset=".68" stop-color="#FED319"/>
            <stop offset="1" stop-color="#FFEB1C"/>
        </linearGradient>
        <linearGradient id="paint28_linear" x1="20.974" x2="24.552" y1="78.076" y2="78.008" gradientUnits="userSpaceOnUse">
            <stop stop-color="#FC9512"/>
            <stop offset=".007" stop-color="#FC9612"/>
            <stop offset=".68" stop-color="#FED319"/>
            <stop offset="1" stop-color="#FFEB1C"/>
        </linearGradient>
        <linearGradient id="paint29_linear" x1="51.923" x2="49.556" y1="50.351" y2="53.187" gradientUnits="userSpaceOnUse">
            <stop stop-color="#FC9512"/>
            <stop offset=".007" stop-color="#FC9612"/>
            <stop offset=".68" stop-color="#FED319"/>
            <stop offset="1" stop-color="#FFEB1C"/>
        </linearGradient>
        <linearGradient id="paint30_linear" x1="145.361" x2="142.993" y1="85.463" y2="88.299" gradientUnits="userSpaceOnUse">
            <stop stop-color="#FC9512"/>
            <stop offset=".007" stop-color="#FC9612"/>
            <stop offset=".68" stop-color="#FED319"/>
            <stop offset="1" stop-color="#FFEB1C"/>
        </linearGradient>
        <linearGradient id="paint31_linear" x1="145.361" x2="142.993" y1="319.707" y2="322.543" gradientUnits="userSpaceOnUse">
            <stop stop-color="#FC9512"/>
            <stop offset=".007" stop-color="#FC9612"/>
            <stop offset=".68" stop-color="#FED319"/>
            <stop offset="1" stop-color="#FFEB1C"/>
        </linearGradient>
        <linearGradient id="paint32_linear" x1="36.434" x2="33.982" y1="129.077" y2="129.882" gradientUnits="userSpaceOnUse">
            <stop stop-color="#FC9512"/>
            <stop offset=".007" stop-color="#FC9612"/>
            <stop offset=".68" stop-color="#FED319"/>
            <stop offset="1" stop-color="#FFEB1C"/>
        </linearGradient>
        <linearGradient id="paint33_linear" x1="36.434" x2="33.982" y1="363.321" y2="364.127" gradientUnits="userSpaceOnUse">
            <stop stop-color="#FC9512"/>
            <stop offset=".007" stop-color="#FC9612"/>
            <stop offset=".68" stop-color="#FED319"/>
            <stop offset="1" stop-color="#FFEB1C"/>
        </linearGradient>
        <linearGradient id="paint34_linear" x1="136.807" x2="133.928" y1="283.973" y2="283.658" gradientUnits="userSpaceOnUse">
            <stop stop-color="#FF3EB9"/>
            <stop offset=".043" stop-color="#FF44BC"/>
            <stop offset=".701" stop-color="#FF98E3"/>
            <stop offset="1" stop-color="#FFB9F2"/>
        </linearGradient>
        <linearGradient id="paint35_linear" x1="312.073" x2="309.193" y1="308.133" y2="307.818" gradientUnits="userSpaceOnUse">
            <stop stop-color="#FF3EB9"/>
            <stop offset=".043" stop-color="#FF44BC"/>
            <stop offset=".701" stop-color="#FF98E3"/>
            <stop offset="1" stop-color="#FFB9F2"/>
        </linearGradient>
        <linearGradient id="paint36_linear" x1="288.661" x2="285.012" y1="136.534" y2="138.012" gradientUnits="userSpaceOnUse">
            <stop stop-color="#FF3EB9"/>
            <stop offset=".043" stop-color="#FF44BC"/>
            <stop offset=".701" stop-color="#FF98E3"/>
            <stop offset="1" stop-color="#FFB9F2"/>
        </linearGradient>
        <linearGradient id="paint37_linear" x1="288.661" x2="285.012" y1="370.779" y2="372.256" gradientUnits="userSpaceOnUse">
            <stop stop-color="#FF3EB9"/>
            <stop offset=".043" stop-color="#FF44BC"/>
            <stop offset=".701" stop-color="#FF98E3"/>
            <stop offset="1" stop-color="#FFB9F2"/>
        </linearGradient>
        <linearGradient id="paint38_linear" x1="348.381" x2="344.733" y1="50.216" y2="51.694" gradientUnits="userSpaceOnUse">
            <stop stop-color="#FF3EB9"/>
            <stop offset=".043" stop-color="#FF44BC"/>
            <stop offset=".701" stop-color="#FF98E3"/>
            <stop offset="1" stop-color="#FFB9F2"/>
        </linearGradient>
        <linearGradient id="paint39_linear" x1="56.077" x2="57.691" y1="312.039" y2="312.405" gradientUnits="userSpaceOnUse">
            <stop stop-color="#FF3EB9"/>
            <stop offset=".043" stop-color="#FF44BC"/>
            <stop offset=".701" stop-color="#FF98E3"/>
            <stop offset="1" stop-color="#FFB9F2"/>
        </linearGradient>
        <linearGradient id="paint40_linear" x1="19.769" x2="18.985" y1="211.823" y2="215.257" gradientUnits="userSpaceOnUse">
            <stop stop-color="#FF3EB9"/>
            <stop offset=".043" stop-color="#FF44BC"/>
            <stop offset=".701" stop-color="#FF98E3"/>
            <stop offset="1" stop-color="#FFB9F2"/>
        </linearGradient>
        <linearGradient id="paint41_linear" x1="144.731" x2="147.52" y1="1.574" y2="4.051" gradientUnits="userSpaceOnUse">
            <stop stop-color="#FF3EB9"/>
            <stop offset=".043" stop-color="#FF44BC"/>
            <stop offset=".701" stop-color="#FF98E3"/>
            <stop offset="1" stop-color="#FFB9F2"/>
        </linearGradient>
        <linearGradient id="paint42_linear" x1="339.503" x2="342.033" y1="311.319" y2="312.494" gradientUnits="userSpaceOnUse">
            <stop stop-color="#FF3EB9"/>
            <stop offset=".043" stop-color="#FF44BC"/>
            <stop offset=".701" stop-color="#FF98E3"/>
            <stop offset="1" stop-color="#FFB9F2"/>
        </linearGradient>
        <linearGradient id="paint43_linear" x1="73.064" x2="73.165" y1="154.317" y2="148.336" gradientUnits="userSpaceOnUse">
            <stop stop-color="#FF3EB9"/>
            <stop offset=".043" stop-color="#FF44BC"/>
            <stop offset=".701" stop-color="#FF98E3"/>
            <stop offset="1" stop-color="#FFB9F2"/>
        </linearGradient>
        <linearGradient id="paint44_linear" x1="231.284" x2="232.461" y1="83.073" y2="85.313" gradientUnits="userSpaceOnUse">
            <stop stop-color="#FF3EB9"/>
            <stop offset=".043" stop-color="#FF44BC"/>
            <stop offset=".701" stop-color="#FF98E3"/>
            <stop offset="1" stop-color="#FFB9F2"/>
        </linearGradient>
        <linearGradient id="paint45_linear" x1="231.284" x2="232.461" y1="317.317" y2="319.557" gradientUnits="userSpaceOnUse">
            <stop stop-color="#FF3EB9"/>
            <stop offset=".043" stop-color="#FF44BC"/>
            <stop offset=".701" stop-color="#FF98E3"/>
            <stop offset="1" stop-color="#FFB9F2"/>
        </linearGradient>
        <linearGradient id="paint46_linear" x1="128.905" x2="124.631" y1="207.77" y2="204.694" gradientUnits="userSpaceOnUse">
            <stop stop-color="#00EE98"/>
            <stop offset=".28" stop-color="#00D685"/>
            <stop offset=".868" stop-color="#095"/>
            <stop offset="1" stop-color="#008A49"/>
        </linearGradient>
        <linearGradient id="paint47_linear" x1="347.981" x2="345.947" y1="286.802" y2="286.53" gradientUnits="userSpaceOnUse">
            <stop stop-color="#00EE98"/>
            <stop offset=".28" stop-color="#00D685"/>
            <stop offset=".868" stop-color="#095"/>
            <stop offset="1" stop-color="#008A49"/>
        </linearGradient>
        <linearGradient id="paint48_linear" x1="168" x2="166.588" y1="269.556" y2="273.332" gradientUnits="userSpaceOnUse">
            <stop stop-color="#00EE98"/>
            <stop offset=".28" stop-color="#00D685"/>
            <stop offset=".868" stop-color="#095"/>
            <stop offset="1" stop-color="#008A49"/>
        </linearGradient>
        <linearGradient id="paint49_linear" x1="69.61" x2="70.667" y1="2.044" y2="5.405" gradientUnits="userSpaceOnUse">
            <stop stop-color="#00EE98"/>
            <stop offset=".28" stop-color="#00D685"/>
            <stop offset=".868" stop-color="#095"/>
            <stop offset="1" stop-color="#008A49"/>
        </linearGradient>
        <linearGradient id="paint50_linear" x1="231.138" x2="229.87" y1="180.035" y2="179.662" gradientUnits="userSpaceOnUse">
            <stop stop-color="#00EE98"/>
            <stop offset=".28" stop-color="#00D685"/>
            <stop offset=".868" stop-color="#095"/>
            <stop offset="1" stop-color="#008A49"/>
        </linearGradient>
        <linearGradient id="paint51_linear" x1="202.489" x2="204.725" y1="127.035" y2="129.008" gradientUnits="userSpaceOnUse">
            <stop stop-color="#00EE98"/>
            <stop offset=".28" stop-color="#00D685"/>
            <stop offset=".868" stop-color="#095"/>
            <stop offset="1" stop-color="#008A49"/>
        </linearGradient>
        <linearGradient id="paint52_linear" x1="202.489" x2="204.725" y1="361.279" y2="363.252" gradientUnits="userSpaceOnUse">
            <stop stop-color="#00EE98"/>
            <stop offset=".28" stop-color="#00D685"/>
            <stop offset=".868" stop-color="#095"/>
            <stop offset="1" stop-color="#008A49"/>
        </linearGradient>
        <linearGradient id="paint53_linear" x1="86.859" x2="84.441" y1="144.129" y2="143.298" gradientUnits="userSpaceOnUse">
            <stop stop-color="#00EE98"/>
            <stop offset=".28" stop-color="#00D685"/>
            <stop offset=".868" stop-color="#095"/>
            <stop offset="1" stop-color="#008A49"/>
        </linearGradient>
        <linearGradient id="paint54_linear" x1="86.859" x2="84.441" y1="378.373" y2="377.542" gradientUnits="userSpaceOnUse">
            <stop stop-color="#00EE98"/>
            <stop offset=".28" stop-color="#00D685"/>
            <stop offset=".868" stop-color="#095"/>
            <stop offset="1" stop-color="#008A49"/>
        </linearGradient>
        <linearGradient id="paint55_linear" x1="277.52" x2="274.684" y1="71.073" y2="73.059" gradientUnits="userSpaceOnUse">
            <stop stop-color="#00EE98"/>
            <stop offset=".28" stop-color="#00D685"/>
            <stop offset=".868" stop-color="#095"/>
            <stop offset="1" stop-color="#008A49"/>
        </linearGradient>
        <linearGradient id="paint56_linear" x1="21.533" x2="21.38" y1="40.683" y2="43.041" gradientUnits="userSpaceOnUse">
            <stop stop-color="#FF5C5C"/>
            <stop offset=".301" stop-color="#F44444"/>
            <stop offset=".935" stop-color="#D60707"/>
            <stop offset="1" stop-color="#D30000"/>
        </linearGradient>
        <linearGradient id="paint57_linear" x1="40.681" x2="38.313" y1="164.013" y2="166.849" gradientUnits="userSpaceOnUse">
            <stop stop-color="#FC9512"/>
            <stop offset=".007" stop-color="#FC9612"/>
            <stop offset=".68" stop-color="#FED319"/>
            <stop offset="1" stop-color="#FFEB1C"/>
        </linearGradient>
        <linearGradient id="paint58_linear" x1="290.364" x2="293.153" y1="173.732" y2="176.209" gradientUnits="userSpaceOnUse">
            <stop stop-color="#FF3EB9"/>
            <stop offset=".043" stop-color="#FF44BC"/>
            <stop offset=".701" stop-color="#FF98E3"/>
            <stop offset="1" stop-color="#FFB9F2"/>
        </linearGradient>
        <linearGradient id="paint59_linear" x1="232.585" x2="234.621" y1="262.21" y2="259.822" gradientUnits="userSpaceOnUse">
            <stop stop-color="#FF5C5C"/>
            <stop offset=".301" stop-color="#F44444"/>
            <stop offset=".935" stop-color="#D60707"/>
            <stop offset="1" stop-color="#D30000"/>
        </linearGradient>
        <linearGradient id="paint60_linear" x1="286.34" x2="283.118" y1="278.871" y2="279.054" gradientUnits="userSpaceOnUse">
            <stop stop-color="#FF5C5C"/>
            <stop offset=".301" stop-color="#F44444"/>
            <stop offset=".935" stop-color="#D60707"/>
            <stop offset="1" stop-color="#D30000"/>
        </linearGradient>
        <linearGradient id="paint61_linear" x1="266.955" x2="268.689" y1="43.298" y2="44.639" gradientUnits="userSpaceOnUse">
            <stop stop-color="#FF5C5C"/>
            <stop offset=".301" stop-color="#F44444"/>
            <stop offset=".935" stop-color="#D60707"/>
            <stop offset="1" stop-color="#D30000"/>
        </linearGradient>
        <linearGradient id="paint62_linear" x1="192.682" x2="189.913" y1="254.431" y2="254.605" gradientUnits="userSpaceOnUse">
            <stop stop-color="#FC9512"/>
            <stop offset=".007" stop-color="#FC9612"/>
            <stop offset=".68" stop-color="#FED319"/>
            <stop offset="1" stop-color="#FFEB1C"/>
        </linearGradient>
        <linearGradient id="paint63_linear" x1="356.504" x2="353.735" y1="254.431" y2="254.605" gradientUnits="userSpaceOnUse">
            <stop stop-color="#FC9512"/>
            <stop offset=".007" stop-color="#FC9612"/>
            <stop offset=".68" stop-color="#FED319"/>
            <stop offset="1" stop-color="#FFEB1C"/>
        </linearGradient>
        <linearGradient id="paint64_linear" x1="12.441" x2="9.989" y1="256.034" y2="256.839" gradientUnits="userSpaceOnUse">
            <stop stop-color="#FC9512"/>
            <stop offset=".007" stop-color="#FC9612"/>
            <stop offset=".68" stop-color="#FED319"/>
            <stop offset="1" stop-color="#FFEB1C"/>
        </linearGradient>
        <linearGradient id="paint65_linear" x1="106.956" x2="104.076" y1="310.714" y2="310.398" gradientUnits="userSpaceOnUse">
            <stop stop-color="#FF3EB9"/>
            <stop offset=".043" stop-color="#FF44BC"/>
            <stop offset=".701" stop-color="#FF98E3"/>
            <stop offset="1" stop-color="#FFB9F2"/>
        </linearGradient>
        <linearGradient id="paint66_linear" x1="6.008" x2="2.36" y1="147.697" y2="149.174" gradientUnits="userSpaceOnUse">
            <stop stop-color="#FF3EB9"/>
            <stop offset=".043" stop-color="#FF44BC"/>
            <stop offset=".701" stop-color="#FF98E3"/>
            <stop offset="1" stop-color="#FFB9F2"/>
        </linearGradient>
        <linearGradient id="paint67_linear" x1="6.008" x2="2.36" y1="381.941" y2="383.418" gradientUnits="userSpaceOnUse">
            <stop stop-color="#FF3EB9"/>
            <stop offset=".043" stop-color="#FF44BC"/>
            <stop offset=".701" stop-color="#FF98E3"/>
            <stop offset="1" stop-color="#FFB9F2"/>
        </linearGradient>
        <linearGradient id="paint68_linear" x1="205.757" x2="204.974" y1="4.203" y2="7.638" gradientUnits="userSpaceOnUse">
            <stop stop-color="#FF3EB9"/>
            <stop offset=".043" stop-color="#FF44BC"/>
            <stop offset=".701" stop-color="#FF98E3"/>
            <stop offset="1" stop-color="#FFB9F2"/>
        </linearGradient>
        <linearGradient id="paint69_linear" x1="45.589" x2="41.315" y1="277.135" y2="274.059" gradientUnits="userSpaceOnUse">
            <stop stop-color="#00EE98"/>
            <stop offset=".28" stop-color="#00D685"/>
            <stop offset=".868" stop-color="#095"/>
            <stop offset="1" stop-color="#008A49"/>
        </linearGradient>
        <linearGradient id="paint70_linear" x1="327.798" x2="323.524" y1="248.059" y2="244.983" gradientUnits="userSpaceOnUse">
            <stop stop-color="#00EE98"/>
            <stop offset=".28" stop-color="#00D685"/>
            <stop offset=".868" stop-color="#095"/>
            <stop offset="1" stop-color="#008A49"/>
        </linearGradient>
        <linearGradient id="paint71_linear" x1="6.021" x2="3.122" y1="293.488" y2="291.133" gradientUnits="userSpaceOnUse">
            <stop stop-color="#00EE98"/>
            <stop offset=".28" stop-color="#00D685"/>
            <stop offset=".868" stop-color="#095"/>
            <stop offset="1" stop-color="#008A49"/>
        </linearGradient>
        <linearGradient id="paint72_linear" x1="231.138" x2="229.87" y1="298.878" y2="298.505" gradientUnits="userSpaceOnUse">
            <stop stop-color="#00EE98"/>
            <stop offset=".28" stop-color="#00D685"/>
            <stop offset=".868" stop-color="#095"/>
            <stop offset="1" stop-color="#008A49"/>
        </linearGradient>
        <linearGradient id="paint73_linear" x1="86.859" x2="84.441" y1="262.973" y2="262.142" gradientUnits="userSpaceOnUse">
            <stop stop-color="#00EE98"/>
            <stop offset=".28" stop-color="#00D685"/>
            <stop offset=".868" stop-color="#095"/>
            <stop offset="1" stop-color="#008A49"/>
        </linearGradient>
        <linearGradient id="paint74_linear" x1="236.851" x2="235.143" y1="67.086" y2="67.89" gradientUnits="userSpaceOnUse">
            <stop stop-color="#00EE98"/>
            <stop offset=".28" stop-color="#00D685"/>
            <stop offset=".868" stop-color="#095"/>
            <stop offset="1" stop-color="#008A49"/>
        </linearGradient>
        <linearGradient id="paint75_linear" x1="242.8" x2="245.436" y1="109.572" y2="108.122" gradientUnits="userSpaceOnUse">
            <stop stop-color="#FF5C5C"/>
            <stop offset=".301" stop-color="#F44444"/>
            <stop offset=".935" stop-color="#D60707"/>
            <stop offset="1" stop-color="#D30000"/>
        </linearGradient>
        <linearGradient id="paint76_linear" x1="242.8" x2="245.436" y1="343.816" y2="342.366" gradientUnits="userSpaceOnUse">
            <stop stop-color="#FF5C5C"/>
            <stop offset=".301" stop-color="#F44444"/>
            <stop offset=".935" stop-color="#D60707"/>
            <stop offset="1" stop-color="#D30000"/>
        </linearGradient>
        <linearGradient id="paint77_linear" x1="164.067" x2="161.536" y1="204.25" y2="207.131" gradientUnits="userSpaceOnUse">
            <stop stop-color="#FF5C5C"/>
            <stop offset=".301" stop-color="#F44444"/>
            <stop offset=".935" stop-color="#D60707"/>
            <stop offset="1" stop-color="#D30000"/>
        </linearGradient>
        <linearGradient id="paint78_linear" x1="40.945" x2="41.558" y1="116.621" y2="119.03" gradientUnits="userSpaceOnUse">
            <stop stop-color="#FF5C5C"/>
            <stop offset=".301" stop-color="#F44444"/>
            <stop offset=".935" stop-color="#D60707"/>
            <stop offset="1" stop-color="#D30000"/>
        </linearGradient>
        <linearGradient id="paint79_linear" x1="40.945" x2="41.558" y1="350.865" y2="353.274" gradientUnits="userSpaceOnUse">
            <stop stop-color="#FF5C5C"/>
            <stop offset=".301" stop-color="#F44444"/>
            <stop offset=".935" stop-color="#D60707"/>
            <stop offset="1" stop-color="#D30000"/>
        </linearGradient>
        <linearGradient id="paint80_linear" x1="68.564" x2="65.594" y1="73.936" y2="72.752" gradientUnits="userSpaceOnUse">
            <stop stop-color="#FF5C5C"/>
            <stop offset=".301" stop-color="#F44444"/>
            <stop offset=".935" stop-color="#D60707"/>
            <stop offset="1" stop-color="#D30000"/>
        </linearGradient>
        <linearGradient id="paint81_linear" x1="276.191" x2="275.269" y1="12.229" y2="14.151" gradientUnits="userSpaceOnUse">
            <stop stop-color="#FF5C5C"/>
            <stop offset=".301" stop-color="#F44444"/>
            <stop offset=".935" stop-color="#D60707"/>
            <stop offset="1" stop-color="#D30000"/>
        </linearGradient>
        <linearGradient id="paint82_linear" x1="160.203" x2="161.889" y1="278.522" y2="279.896" gradientUnits="userSpaceOnUse">
            <stop stop-color="#FF5C5C"/>
            <stop offset=".301" stop-color="#F44444"/>
            <stop offset=".935" stop-color="#D60707"/>
            <stop offset="1" stop-color="#D30000"/>
        </linearGradient>
        <linearGradient id="paint83_linear" x1="185.878" x2="187.254" y1="152.348" y2="152.697" gradientUnits="userSpaceOnUse">
            <stop stop-color="#FF5C5C"/>
            <stop offset=".301" stop-color="#F44444"/>
            <stop offset=".935" stop-color="#D60707"/>
            <stop offset="1" stop-color="#D30000"/>
        </linearGradient>
        <linearGradient id="paint84_linear" x1="163.259" x2="167.037" y1="286.38" y2="285.134" gradientUnits="userSpaceOnUse">
            <stop stop-color="#FF5C5C"/>
            <stop offset=".301" stop-color="#F44444"/>
            <stop offset=".935" stop-color="#D60707"/>
            <stop offset="1" stop-color="#D30000"/>
        </linearGradient>
        <linearGradient id="paint85_linear" x1="181.531" x2="181.966" y1="11.148" y2="6.295" gradientUnits="userSpaceOnUse">
            <stop stop-color="#4D8EFF"/>
            <stop offset=".428" stop-color="#3F76FF"/>
            <stop offset="1" stop-color="#2850FF"/>
        </linearGradient>
        <linearGradient id="paint86_linear" x1="73.712" x2="74.555" y1="248.75" y2="250.519" gradientUnits="userSpaceOnUse">
            <stop stop-color="#4D8EFF"/>
            <stop offset=".428" stop-color="#3F76FF"/>
            <stop offset="1" stop-color="#2850FF"/>
        </linearGradient>
        <linearGradient id="paint87_linear" x1="234.071" x2="232.632" y1="263.294" y2="265.053" gradientUnits="userSpaceOnUse">
            <stop stop-color="#4D8EFF"/>
            <stop offset=".428" stop-color="#3F76FF"/>
            <stop offset="1" stop-color="#2850FF"/>
        </linearGradient>
        <linearGradient id="paint88_linear" x1="289.846" x2="290.963" y1="95.839" y2="96.937" gradientUnits="userSpaceOnUse">
            <stop stop-color="#4D8EFF"/>
            <stop offset=".428" stop-color="#3F76FF"/>
            <stop offset="1" stop-color="#2850FF"/>
        </linearGradient>
        <linearGradient id="paint89_linear" x1="289.846" x2="290.963" y1="330.083" y2="331.181" gradientUnits="userSpaceOnUse">
            <stop stop-color="#4D8EFF"/>
            <stop offset=".428" stop-color="#3F76FF"/>
            <stop offset="1" stop-color="#2850FF"/>
        </linearGradient>
        <linearGradient id="paint90_linear" x1="77.478" x2="78.35" y1="234.243" y2="235.301" gradientUnits="userSpaceOnUse">
            <stop stop-color="#4D8EFF"/>
            <stop offset=".428" stop-color="#3F76FF"/>
            <stop offset="1" stop-color="#2850FF"/>
        </linearGradient>
        <linearGradient id="paint91_linear" x1="227.447" x2="228.319" y1="295.502" y2="296.561" gradientUnits="userSpaceOnUse">
            <stop stop-color="#4D8EFF"/>
            <stop offset=".428" stop-color="#3F76FF"/>
            <stop offset="1" stop-color="#2850FF"/>
        </linearGradient>
        <linearGradient id="paint92_linear" x1="310.157" x2="312.092" y1="10.978" y2="11.052" gradientUnits="userSpaceOnUse">
            <stop stop-color="#4D8EFF"/>
            <stop offset=".428" stop-color="#3F76FF"/>
            <stop offset="1" stop-color="#2850FF"/>
        </linearGradient>
        <linearGradient id="paint93_linear" x1="217.538" x2="215.75" y1="258.739" y2="260.371" gradientUnits="userSpaceOnUse">
            <stop stop-color="#4D8EFF"/>
            <stop offset=".428" stop-color="#3F76FF"/>
            <stop offset="1" stop-color="#2850FF"/>
        </linearGradient>
        <linearGradient id="paint94_linear" x1="355.437" x2="352.877" y1="182.348" y2="181.348" gradientUnits="userSpaceOnUse">
            <stop stop-color="#FC9512"/>
            <stop offset=".007" stop-color="#FC9612"/>
            <stop offset=".68" stop-color="#FED319"/>
            <stop offset="1" stop-color="#FFEB1C"/>
        </linearGradient>
        <linearGradient id="paint95_linear" x1="350.374" x2="347.486" y1="7.959" y2="10.313" gradientUnits="userSpaceOnUse">
            <stop stop-color="#FC9512"/>
            <stop offset=".007" stop-color="#FC9612"/>
            <stop offset=".68" stop-color="#FED319"/>
            <stop offset="1" stop-color="#FFEB1C"/>
        </linearGradient>
        <linearGradient id="paint96_linear" x1="70.595" x2="69.021" y1="170.093" y2="168.497" gradientUnits="userSpaceOnUse">
            <stop stop-color="#FC9512"/>
            <stop offset=".007" stop-color="#FC9612"/>
            <stop offset=".68" stop-color="#FED319"/>
            <stop offset="1" stop-color="#FFEB1C"/>
        </linearGradient>
        <linearGradient id="paint97_linear" x1="174.065" x2="173.237" y1="91.365" y2="90.091" gradientUnits="userSpaceOnUse">
            <stop stop-color="#FC9512"/>
            <stop offset=".007" stop-color="#FC9612"/>
            <stop offset=".68" stop-color="#FED319"/>
            <stop offset="1" stop-color="#FFEB1C"/>
        </linearGradient>
        <linearGradient id="paint98_linear" x1="174.065" x2="173.237" y1="325.61" y2="324.336" gradientUnits="userSpaceOnUse">
            <stop stop-color="#FC9512"/>
            <stop offset=".007" stop-color="#FC9612"/>
            <stop offset=".68" stop-color="#FED319"/>
            <stop offset="1" stop-color="#FFEB1C"/>
        </linearGradient>
        <linearGradient id="paint99_linear" x1="113.641" x2="113.653" y1="227.49" y2="229.131" gradientUnits="userSpaceOnUse">
            <stop stop-color="#FC9512"/>
            <stop offset=".007" stop-color="#FC9612"/>
            <stop offset=".68" stop-color="#FED319"/>
            <stop offset="1" stop-color="#FFEB1C"/>
        </linearGradient>
        <linearGradient id="paint100_linear" x1="128.429" x2="129.191" y1="248.013" y2="245.874" gradientUnits="userSpaceOnUse">
            <stop stop-color="#FC9512"/>
            <stop offset=".007" stop-color="#FC9612"/>
            <stop offset=".68" stop-color="#FED319"/>
            <stop offset="1" stop-color="#FFEB1C"/>
        </linearGradient>
        <linearGradient id="paint101_linear" x1="227.175" x2="230.399" y1="295.571" y2="295.295" gradientUnits="userSpaceOnUse">
            <stop stop-color="#FC9512"/>
            <stop offset=".007" stop-color="#FC9612"/>
            <stop offset=".68" stop-color="#FED319"/>
            <stop offset="1" stop-color="#FFEB1C"/>
        </linearGradient>
        <linearGradient id="paint102_linear" x1="61.964" x2="61.177" y1="192.386" y2="188.837" gradientUnits="userSpaceOnUse">
            <stop stop-color="#FC9512"/>
            <stop offset=".007" stop-color="#FC9612"/>
            <stop offset=".68" stop-color="#FED319"/>
            <stop offset="1" stop-color="#FFEB1C"/>
        </linearGradient>
        <linearGradient id="paint103_linear" x1="195.572" x2="193.855" y1="100.853" y2="103.728" gradientUnits="userSpaceOnUse">
            <stop stop-color="#FC9512"/>
            <stop offset=".007" stop-color="#FC9612"/>
            <stop offset=".68" stop-color="#FED319"/>
            <stop offset="1" stop-color="#FFEB1C"/>
        </linearGradient>
        <linearGradient id="paint104_linear" x1="195.572" x2="193.855" y1="335.097" y2="337.972" gradientUnits="userSpaceOnUse">
            <stop stop-color="#FC9512"/>
            <stop offset=".007" stop-color="#FC9612"/>
            <stop offset=".68" stop-color="#FED319"/>
            <stop offset="1" stop-color="#FFEB1C"/>
        </linearGradient>
        <linearGradient id="paint105_linear" x1="334.781" x2="331.7" y1="33.898" y2="35.636" gradientUnits="userSpaceOnUse">
            <stop stop-color="#FC9512"/>
            <stop offset=".007" stop-color="#FC9612"/>
            <stop offset=".68" stop-color="#FED319"/>
            <stop offset="1" stop-color="#FFEB1C"/>
        </linearGradient>
        <linearGradient id="paint106_linear" x1="1.885" x2="4.826" y1="220.466" y2="220.768" gradientUnits="userSpaceOnUse">
            <stop stop-color="#FC9512"/>
            <stop offset=".007" stop-color="#FC9612"/>
            <stop offset=".68" stop-color="#FED319"/>
            <stop offset="1" stop-color="#FFEB1C"/>
        </linearGradient>
        <linearGradient id="paint107_linear" x1="295.1" x2="298.04" y1="183.64" y2="183.942" gradientUnits="userSpaceOnUse">
            <stop stop-color="#FC9512"/>
            <stop offset=".007" stop-color="#FC9612"/>
            <stop offset=".68" stop-color="#FED319"/>
            <stop offset="1" stop-color="#FFEB1C"/>
        </linearGradient>
        <linearGradient id="paint108_linear" x1="43.637" x2="41.079" y1="22.226" y2="21.997" gradientUnits="userSpaceOnUse">
            <stop stop-color="#FC9512"/>
            <stop offset=".007" stop-color="#FC9612"/>
            <stop offset=".68" stop-color="#FED319"/>
            <stop offset="1" stop-color="#FFEB1C"/>
        </linearGradient>
        <linearGradient id="paint109_linear" x1="352.616" x2="350.212" y1="211.741" y2="210.232" gradientUnits="userSpaceOnUse">
            <stop stop-color="#FF3EB9"/>
            <stop offset=".043" stop-color="#FF44BC"/>
            <stop offset=".701" stop-color="#FF98E3"/>
            <stop offset="1" stop-color="#FFB9F2"/>
        </linearGradient>
        <linearGradient id="paint110_linear" x1="272.708" x2="270.304" y1="227.017" y2="225.507" gradientUnits="userSpaceOnUse">
            <stop stop-color="#FF3EB9"/>
            <stop offset=".043" stop-color="#FF44BC"/>
            <stop offset=".701" stop-color="#FF98E3"/>
            <stop offset="1" stop-color="#FFB9F2"/>
        </linearGradient>
        <linearGradient id="paint111_linear" x1="272.579" x2="268.669" y1="140.019" y2="139.962" gradientUnits="userSpaceOnUse">
            <stop stop-color="#FF3EB9"/>
            <stop offset=".043" stop-color="#FF44BC"/>
            <stop offset=".701" stop-color="#FF98E3"/>
            <stop offset="1" stop-color="#FFB9F2"/>
        </linearGradient>
        <linearGradient id="paint112_linear" x1="272.579" x2="268.669" y1="374.263" y2="374.206" gradientUnits="userSpaceOnUse">
            <stop stop-color="#FF3EB9"/>
            <stop offset=".043" stop-color="#FF44BC"/>
            <stop offset=".701" stop-color="#FF98E3"/>
            <stop offset="1" stop-color="#FFB9F2"/>
        </linearGradient>
        <linearGradient id="paint113_linear" x1="16.292" x2="17.539" y1="180.824" y2="181.837" gradientUnits="userSpaceOnUse">
            <stop stop-color="#FF3EB9"/>
            <stop offset=".043" stop-color="#FF44BC"/>
            <stop offset=".701" stop-color="#FF98E3"/>
            <stop offset="1" stop-color="#FFB9F2"/>
        </linearGradient>
        <linearGradient id="paint114_linear" x1="21.626" x2="19.825" y1="85.697" y2="88.36" gradientUnits="userSpaceOnUse">
            <stop stop-color="#FF3EB9"/>
            <stop offset=".043" stop-color="#FF44BC"/>
            <stop offset=".701" stop-color="#FF98E3"/>
            <stop offset="1" stop-color="#FFB9F2"/>
        </linearGradient>
        <linearGradient id="paint115_linear" x1="21.626" x2="19.825" y1="319.941" y2="322.604" gradientUnits="userSpaceOnUse">
            <stop stop-color="#FF3EB9"/>
            <stop offset=".043" stop-color="#FF44BC"/>
            <stop offset=".701" stop-color="#FF98E3"/>
            <stop offset="1" stop-color="#FFB9F2"/>
        </linearGradient>
        <linearGradient id="paint116_linear" x1="124.913" x2="126.554" y1="261.924" y2="264.002" gradientUnits="userSpaceOnUse">
            <stop stop-color="#FF3EB9"/>
            <stop offset=".043" stop-color="#FF44BC"/>
            <stop offset=".701" stop-color="#FF98E3"/>
            <stop offset="1" stop-color="#FFB9F2"/>
        </linearGradient>
        <linearGradient id="paint117_linear" x1="288.718" x2="290.359" y1="313.215" y2="315.293" gradientUnits="userSpaceOnUse">
            <stop stop-color="#FF3EB9"/>
            <stop offset=".043" stop-color="#FF44BC"/>
            <stop offset=".701" stop-color="#FF98E3"/>
            <stop offset="1" stop-color="#FFB9F2"/>
        </linearGradient>
        <linearGradient id="paint118_linear" x1="21.017" x2="23.129" y1="156.246" y2="151.296" gradientUnits="userSpaceOnUse">
            <stop stop-color="#FF3EB9"/>
            <stop offset=".043" stop-color="#FF44BC"/>
            <stop offset=".701" stop-color="#FF98E3"/>
            <stop offset="1" stop-color="#FFB9F2"/>
        </linearGradient>
        <linearGradient id="paint119_linear" x1="123.09" x2="120.824" y1="123.209" y2="118.867" gradientUnits="userSpaceOnUse">
            <stop stop-color="#00EE98"/>
            <stop offset=".28" stop-color="#00D685"/>
            <stop offset=".868" stop-color="#095"/>
            <stop offset="1" stop-color="#008A49"/>
        </linearGradient>
        <linearGradient id="paint120_linear" x1="123.09" x2="120.824" y1="357.452" y2="353.109" gradientUnits="userSpaceOnUse">
            <stop stop-color="#00EE98"/>
            <stop offset=".28" stop-color="#00D685"/>
            <stop offset=".868" stop-color="#095"/>
            <stop offset="1" stop-color="#008A49"/>
        </linearGradient>
        <linearGradient id="paint121_linear" x1="335.404" x2="333.138" y1="133.655" y2="129.312" gradientUnits="userSpaceOnUse">
            <stop stop-color="#00EE98"/>
            <stop offset=".28" stop-color="#00D685"/>
            <stop offset=".868" stop-color="#095"/>
            <stop offset="1" stop-color="#008A49"/>
        </linearGradient>
        <linearGradient id="paint122_linear" x1="335.404" x2="333.138" y1="367.899" y2="363.556" gradientUnits="userSpaceOnUse">
            <stop stop-color="#00EE98"/>
            <stop offset=".28" stop-color="#00D685"/>
            <stop offset=".868" stop-color="#095"/>
            <stop offset="1" stop-color="#008A49"/>
        </linearGradient>
        <linearGradient id="paint123_linear" x1="293.24" x2="291.568" y1="269.445" y2="268.335" gradientUnits="userSpaceOnUse">
            <stop stop-color="#00EE98"/>
            <stop offset=".28" stop-color="#00D685"/>
            <stop offset=".868" stop-color="#095"/>
            <stop offset="1" stop-color="#008A49"/>
        </linearGradient>
        <linearGradient id="paint124_linear" x1="135.106" x2="132.647" y1="188.107" y2="190.905" gradientUnits="userSpaceOnUse">
            <stop stop-color="#00EE98"/>
            <stop offset=".28" stop-color="#00D685"/>
            <stop offset=".868" stop-color="#095"/>
            <stop offset="1" stop-color="#008A49"/>
        </linearGradient>
        <linearGradient id="paint125_linear" x1="146.702" x2="145.28" y1="140.697" y2="137.549" gradientUnits="userSpaceOnUse">
            <stop stop-color="#00EE98"/>
            <stop offset=".28" stop-color="#00D685"/>
            <stop offset=".868" stop-color="#095"/>
            <stop offset="1" stop-color="#008A49"/>
        </linearGradient>
        <linearGradient id="paint126_linear" x1="146.702" x2="145.28" y1="374.941" y2="371.794" gradientUnits="userSpaceOnUse">
            <stop stop-color="#00EE98"/>
            <stop offset=".28" stop-color="#00D685"/>
            <stop offset=".868" stop-color="#095"/>
            <stop offset="1" stop-color="#008A49"/>
        </linearGradient>
        <linearGradient id="paint127_linear" x1="227.362" x2="226.429" y1="138.87" y2="138.002" gradientUnits="userSpaceOnUse">
            <stop stop-color="#00EE98"/>
            <stop offset=".28" stop-color="#00D685"/>
            <stop offset=".868" stop-color="#095"/>
            <stop offset="1" stop-color="#008A49"/>
        </linearGradient>
        <linearGradient id="paint128_linear" x1="227.362" x2="226.429" y1="373.114" y2="372.246" gradientUnits="userSpaceOnUse">
            <stop stop-color="#00EE98"/>
            <stop offset=".28" stop-color="#00D685"/>
            <stop offset=".868" stop-color="#095"/>
            <stop offset="1" stop-color="#008A49"/>
        </linearGradient>
        <linearGradient id="paint129_linear" x1="345.732" x2="346.765" y1="82.604" y2="85.15" gradientUnits="userSpaceOnUse">
            <stop stop-color="#00EE98"/>
            <stop offset=".28" stop-color="#00D685"/>
            <stop offset=".868" stop-color="#095"/>
            <stop offset="1" stop-color="#008A49"/>
        </linearGradient>
        <linearGradient id="paint130_linear" x1="345.732" x2="346.765" y1="316.849" y2="319.394" gradientUnits="userSpaceOnUse">
            <stop stop-color="#00EE98"/>
            <stop offset=".28" stop-color="#00D685"/>
            <stop offset=".868" stop-color="#095"/>
            <stop offset="1" stop-color="#008A49"/>
        </linearGradient>
        <linearGradient id="paint131_linear" x1="40.783" x2="39.474" y1="180.339" y2="180.202" gradientUnits="userSpaceOnUse">
            <stop stop-color="#00EE98"/>
            <stop offset=".28" stop-color="#00D685"/>
            <stop offset=".868" stop-color="#095"/>
            <stop offset="1" stop-color="#008A49"/>
        </linearGradient>
        <linearGradient id="paint132_linear" x1="109.094" x2="107.377" y1="55.698" y2="53.946" gradientUnits="userSpaceOnUse">
            <stop stop-color="#00EE98"/>
            <stop offset=".28" stop-color="#00D685"/>
            <stop offset=".868" stop-color="#095"/>
            <stop offset="1" stop-color="#008A49"/>
        </linearGradient>
        <linearGradient id="paint133_linear" x1="234.43" x2="232.713" y1="321.825" y2="320.073" gradientUnits="userSpaceOnUse">
            <stop stop-color="#00EE98"/>
            <stop offset=".28" stop-color="#00D685"/>
            <stop offset=".868" stop-color="#095"/>
            <stop offset="1" stop-color="#008A49"/>
        </linearGradient>
        <linearGradient id="paint134_linear" x1="10.766" x2="8.897" y1="189.022" y2="189.109" gradientUnits="userSpaceOnUse">
            <stop stop-color="#00EE98"/>
            <stop offset=".28" stop-color="#00D685"/>
            <stop offset=".868" stop-color="#095"/>
            <stop offset="1" stop-color="#008A49"/>
        </linearGradient>
        <linearGradient id="paint135_linear" x1="23.005" x2="24.569" y1="250.307" y2="248.873" gradientUnits="userSpaceOnUse">
            <stop stop-color="#00EE98"/>
            <stop offset=".28" stop-color="#00D685"/>
            <stop offset=".868" stop-color="#095"/>
            <stop offset="1" stop-color="#008A49"/>
        </linearGradient>
        <linearGradient id="paint136_linear" x1="172.978" x2="174.542" y1="311.563" y2="310.129" gradientUnits="userSpaceOnUse">
            <stop stop-color="#00EE98"/>
            <stop offset=".28" stop-color="#00D685"/>
            <stop offset=".868" stop-color="#095"/>
            <stop offset="1" stop-color="#008A49"/>
        </linearGradient>
    </defs>
</svg>
