<svg xmlns="http://www.w3.org/2000/svg" width="20" height="20" fill="none" viewBox="0 0 20 20">
    <path fill="#3676FB" d="M7.08 3.75c-1.832 0-3.331 1.524-3.331 3.387 0 1.165.584 2.201 1.47 2.812-1.008.297-1.94.83-2.694 1.56C1.324 12.677.627 14.3.625 15.963v.007c0 .098.003.2.007.297.006.164.075.319.192.432.116.114.271.177.432.177h17.492c.162 0 .317-.063.433-.177.116-.113.185-.268.192-.432.004-.1 0-.179 0-.238v-.006c-.002-1.344-.565-2.657-1.536-3.6-.57-.552-1.265-.964-2.017-1.21.638-.505 1.054-1.29 1.054-2.17 0-1.512-1.22-2.752-2.707-2.752-1.488 0-2.707 1.24-2.707 2.752 0 .893.426 1.693 1.08 2.197-.284.099-.56.217-.826.357-.028-.028-.05-.059-.078-.086-.754-.732-1.686-1.264-2.694-1.561.886-.61 1.47-1.647 1.47-2.812 0-1.863-1.499-3.387-3.332-3.387zm0 1.27c1.158 0 2.083.94 2.083 2.117S8.238 9.254 7.08 9.254c-1.157 0-2.082-.94-2.082-2.117S5.923 5.02 7.08 5.02zm7.087 2.54c.813 0 1.458.656 1.458 1.482s-.646 1.482-1.458 1.482c-.812 0-1.458-.656-1.458-1.482s.646-1.482 1.458-1.482zM7.08 10.948c1.363 0 2.741.554 3.697 1.481.866.84 1.377 2 1.47 3.176H1.914c.093-1.177.61-2.335 1.477-3.176.955-.927 2.327-1.481 3.69-1.481zm7.087 1.27c1.035 0 2.087.422 2.811 1.124.62.602.998 1.424 1.1 2.263h-4.581c-.065-1.063-.393-2.095-.97-2.99.521-.233 1.072-.397 1.64-.397z"/>
</svg>
