<?xml version="1.0" encoding="UTF-8"?>
<svg width="136px" height="136px" viewBox="0 0 136 136" version="1.1" xmlns="http://www.w3.org/2000/svg" xmlns:xlink="http://www.w3.org/1999/xlink">
    <!-- Generator: Sketch 52.1 (67048) - http://www.bohemiancoding.com/sketch -->
    <title>Group 85 Copy</title>
    <desc>Created with Sketch.</desc>
    <defs>
        <path d="M48,0 L48,0 C74.509668,-4.86974701e-15 96,21.490332 96,48 L96,48 C96,74.509668 74.509668,96 48,96 L48,96 C21.490332,96 3.24649801e-15,74.509668 0,48 L0,48 C-3.24649801e-15,21.490332 21.490332,4.86974701e-15 48,0 Z" id="path-1"></path>
        <filter x="-31.2%" y="-29.2%" width="166.7%" height="166.7%" filterUnits="objectBoundingBox" id="filter-2">
            <feOffset dx="2" dy="4" in="SourceAlpha" result="shadowOffsetOuter1"></feOffset>
            <feGaussianBlur stdDeviation="10" in="shadowOffsetOuter1" result="shadowBlurOuter1"></feGaussianBlur>
            <feColorMatrix values="0 0 0 0 0   0 0 0 0 0   0 0 0 0 0  0 0 0 0.163864357 0" type="matrix" in="shadowBlurOuter1"></feColorMatrix>
        </filter>
    </defs>
    <g id="Landing" stroke="none" stroke-width="1" fill="none" fill-rule="evenodd">
        <g id="JEET" transform="translate(-46.000000, -1212.000000)" fill-rule="nonzero">
            <g id="Group-85-Copy" transform="translate(64.000000, 1228.000000)">
                <g id="Rectangle-44">
                    <use fill="black" fill-opacity="1" filter="url(#filter-2)" xlink:href="#path-1"></use>
                    <use fill="#FFFFFF" xlink:href="#path-1"></use>
                </g>
                <g id="Marks-outline" transform="translate(20.000000, 20.000000)" fill="#F16988">
                    <path d="M39.5630637,14.37975 L14.3727079,39.5575833 C13.802521,40.1275 13.802521,41.0503333 14.3727079,41.6196667 C14.6575095,41.9043333 15.0316035,42.0466667 15.4045303,42.0466667 C15.7786242,42.0466667 16.1509674,41.9043333 16.4363526,41.6196667 L41.6261249,16.4418333 C42.1963118,15.8719167 42.1963118,14.9490833 41.6261249,14.37975 C41.055938,13.8104167 40.132667,13.8104167 39.5630637,14.37975 Z M47.808305,8.20108333 C42.5172973,2.912 35.4818794,0 28,0 C20.5169533,0 13.4827027,2.912 8.19169502,8.20108333 C-2.73056501,19.1181667 -2.73056501,36.8824167 8.19169502,47.7995 C13.4827027,53.088 20.5169533,56 28,56 C35.4818794,56 42.5172973,53.088 47.808305,47.7989167 C58.730565,36.8824167 58.730565,19.1175833 47.808305,8.20108333 Z M45.7452438,45.7368333 C41.0045803,50.4740833 34.7021766,53.0833333 28,53.0833333 C21.2966562,53.0833333 14.9942525,50.4740833 10.2547562,45.7368333 C0.469951904,35.9560833 0.469951904,20.0433333 10.2547562,10.2625833 C14.9942525,5.52591667 21.2966562,2.91666667 28,2.91666667 C34.7021766,2.91666667 41.0045803,5.52591667 45.7452438,10.2631667 C55.5288809,20.0433333 55.5288809,35.9566667 45.7452438,45.7368333 Z M35.5869292,31.2450833 C34.4278799,31.2450833 33.3376965,31.696 32.5183082,32.5155833 C31.6977526,33.3351667 31.2460385,34.42425 31.2460385,35.5839167 C31.2460385,36.7435833 31.697169,37.8320833 32.5183082,38.6516667 C33.3376965,39.4706667 34.4272963,39.92275 35.5869292,39.92275 C36.7465622,39.92275 37.8367455,39.47125 38.6567175,38.6516667 C40.3491863,36.9605833 40.3491863,34.2078333 38.6567175,32.5161667 C37.8367455,31.6965833 36.7471458,31.2450833 35.5869292,31.2450833 Z M36.5936564,36.5895833 C36.0567352,37.12625 35.118874,37.1268333 34.5819529,36.589 C34.3129087,36.3206667 34.1646718,35.96425 34.1646718,35.5839167 C34.1646718,35.2035833 34.3129087,34.8471667 34.5819529,34.57825 C34.8509971,34.3093333 35.2075828,34.16175 35.5869292,34.16175 C35.9674429,34.16175 36.3246122,34.3093333 36.5936564,34.57825 C37.1475022,35.133 37.1475022,36.0348333 36.5936564,36.5895833 Z M20.4119036,24.7549167 C21.5721201,24.7549167 22.6617199,24.304 23.4816918,23.4838333 C24.3010802,22.6648333 24.7527943,21.5751667 24.7527943,20.4160833 C24.7527943,19.257 24.3016638,18.1679167 23.4816918,17.3483333 C22.6617199,16.52875 21.5715365,16.07725 20.4119036,16.07725 C19.2522706,16.07725 18.1626708,16.52875 17.3432825,17.3483333 C16.5238941,18.1679167 16.0710128,19.257 16.07218,20.4160833 C16.07218,21.5745833 16.5233105,22.66425 17.3421153,23.4838333 C18.1632545,24.3034167 19.2528542,24.7549167 20.4119036,24.7549167 Z M19.4063436,19.4104167 C19.6742206,19.1420833 20.0319735,18.9939167 20.4119036,18.9939167 C20.7924172,18.9939167 21.1495865,19.1420833 21.4186307,19.4104167 C21.6865077,19.67875 21.8347446,20.03575 21.8347446,20.4160833 C21.8347446,20.7964167 21.6865077,21.1534167 21.4174635,21.42175 C20.8805423,21.9595833 19.9450156,21.9595833 19.4069272,21.42175 C19.1378831,21.1534167 18.9908134,20.7964167 18.9908134,20.4160833 C18.9896461,20.0363333 19.1372994,19.67875 19.4063436,19.4104167 Z" id="Shape"></path>
                </g>
            </g>
        </g>
    </g>
</svg>