<svg xmlns="http://www.w3.org/2000/svg" width="24" height="24" fill="none" viewBox="0 0 24 24">
    <circle cx="12" cy="12" r="12" fill="#FF8F73"/>
    <path fill="#fff" d="M12.344 13.43c-.04-.055-.091-.1-.151-.13s-.126-.047-.193-.047c-.068 0-.134.016-.194.047-.06.03-.111.075-.15.13L9.63 16.236c-.045.064-.072.138-.078.216-.006.078.01.156.046.225.035.07.09.128.156.168.066.04.143.062.221.062h.79v1.668c0 .113.046.22.125.3.08.08.187.124.3.124h1.618c.113 0 .22-.045.3-.124.08-.08.124-.187.124-.3v-1.66h.791c.08 0 .157-.02.225-.062.068-.04.123-.1.158-.17.036-.071.052-.15.045-.23-.007-.078-.036-.153-.083-.217l-2.024-2.808zm.466 2.638c-.113 0-.22.044-.3.124-.08.08-.124.187-.124.3v1.66h-.773v-1.66c0-.113-.044-.22-.124-.3-.08-.08-.187-.124-.3-.124h-.388L12 14.4l1.198 1.667h-.387zM11.657 10.57c.04.055.091.1.15.13.06.03.127.047.194.047s.133-.016.193-.047c.06-.03.112-.075.15-.13l2.025-2.807c.045-.064.073-.138.078-.216.006-.078-.01-.156-.045-.225-.036-.07-.09-.128-.157-.168-.066-.04-.143-.062-.22-.062h-.792V5.424c0-.113-.044-.22-.124-.3-.08-.08-.187-.124-.3-.124h-1.618c-.112 0-.22.045-.3.124-.08.08-.124.187-.124.3v1.66h-.79c-.08 0-.158.02-.226.062-.067.04-.122.1-.158.17-.036.071-.051.15-.045.23.007.078.036.153.084.217l2.025 2.808zm-.466-2.638c.112 0 .22-.044.3-.124.08-.08.124-.187.124-.3v-1.66h.772v1.66c0 .113.045.22.124.3.08.08.188.124.3.124h.388L12 9.6l-1.197-1.667h.388zM5.424 13.233h1.66v.791c0 .08.02.157.062.225.04.068.1.122.17.158.071.036.15.052.23.045.078-.007.153-.036.217-.083l2.808-2.024c.054-.04.099-.091.13-.151.03-.06.046-.126.046-.193s-.016-.134-.047-.194c-.03-.06-.075-.111-.13-.15L7.764 9.63c-.064-.045-.138-.072-.216-.078-.078-.006-.156.01-.225.046-.07.035-.128.09-.168.156-.04.066-.062.143-.062.22v.792H5.424c-.113 0-.22.045-.3.124-.08.08-.124.187-.124.3v1.618c0 .113.045.22.124.3.08.08.187.124.3.124zm.423-1.62h1.661c.113 0 .22-.045.3-.124.08-.08.124-.187.124-.3v-.387L9.6 12l-1.667 1.198v-.389c0-.112-.044-.22-.124-.3-.08-.079-.187-.123-.3-.123h-1.66v-.773zM18.577 10.767h-1.661v-.791c.001-.08-.02-.157-.061-.225-.041-.068-.1-.122-.17-.158-.071-.036-.15-.052-.23-.045-.078.007-.154.036-.217.083l-2.808 2.024c-.054.04-.099.091-.13.151-.03.06-.046.126-.046.193s.016.134.046.194c.031.06.076.111.13.15l2.808 2.026c.063.045.138.072.216.078.078.006.155-.01.225-.046.07-.035.127-.09.168-.156.04-.066.062-.143.062-.22v-.792h1.668c.112 0 .22-.045.3-.124.08-.08.124-.187.124-.3v-1.618c0-.113-.045-.22-.124-.3-.08-.08-.188-.124-.3-.124zm-.424 1.62h-1.66c-.113 0-.22.045-.3.124-.08.08-.125.187-.125.3v.388L14.402 12l1.667-1.198v.389c0 .112.044.22.124.3.08.079.187.123.3.123h1.66v.773z"/>
</svg>
