<svg xmlns="http://www.w3.org/2000/svg" width="24" height="24" fill="none" viewBox="0 0 24 24">
    <g fill="#25282B" opacity=".7">
        <path d="M19.275 2.25h-14.8C3.661 2.25 3 2.957 3 3.829v16.206c0 .868.66 1.579 1.475 1.579h14.8c.814 0 1.475-.71 1.475-1.579V3.829c0-.872-.66-1.579-1.475-1.579zm-.295 17.47H4.77V4.143h14.21V19.72z"/>
        <path d="M17.652 7.773c0 .524-.395.947-.885.947H6.982c-.486 0-.885-.423-.885-.947 0-.521.399-.948.885-.948h9.785c.49 0 .885.427.885.948zM10.328 11.93c0 .525-.399.948-.885.948h-2.46c-.487 0-.886-.423-.886-.947 0-.525.399-.948.885-.948h2.46c.487 0 .886.423.886.947zM10.328 16.14c0 .524-.399.947-.885.947h-2.46c-.487 0-.886-.423-.886-.947 0-.521.399-.948.885-.948h2.46c.487 0 .886.427.886.948zM17.411 12.83l-3.071 3.29c-.174.183-.401.278-.626.278-.227 0-.454-.095-.628-.278l-1.18-1.263c-.345-.369-.345-.969 0-1.341.345-.37.909-.37 1.254 0l.554.593 2.446-2.617c.345-.37.905-.37 1.25 0 .346.37.346.969.001 1.338z"/>
    </g>
</svg>
