<svg width="40" height="40" fill="none" xmlns="http://www.w3.org/2000/svg">
    <path d="M26.62 20.494a6.275 6.275 0 0 0-6.268-6.267 6.275 6.275 0 0 0-6.268 6.267 6.275 6.275 0 0 0 6.268 6.268 6.275 6.275 0 0 0 6.269-6.268zm-10.682 0a4.42 4.42 0 0 1 4.414-4.414 4.42 4.42 0 0 1 4.415 4.414 4.42 4.42 0 0 1-4.415 4.415 4.42 4.42 0 0 1-4.414-4.415z" fill="#F36"/>
    <path d="M23.463 30.665c-.032 0-.063.004-.094.005l-.6-2.432a.926.926 0 1 0-1.8.443l.615 2.493a3.756 3.756 0 0 0-1.879 3.248 3.762 3.762 0 0 0 3.758 3.758 3.762 3.762 0 0 0 3.757-3.758 3.762 3.762 0 0 0-3.757-3.757zm0 5.662a1.906 1.906 0 0 1-1.904-1.904c0-.823.525-1.523 1.257-1.789.026-.004.052-.008.078-.014a.922.922 0 0 0 .15-.053 1.906 1.906 0 0 1 2.324 1.856c-.001 1.05-.856 1.904-1.905 1.904zM34.575 18.263a3.76 3.76 0 0 0-3.53 2.481l-2.53-.253a.928.928 0 0 0-.185 1.844l2.536.254a3.76 3.76 0 0 0 3.71 3.189 3.762 3.762 0 0 0 3.757-3.758 3.762 3.762 0 0 0-3.758-3.757zm0 5.661a1.906 1.906 0 0 1-1.904-1.904c0-1.05.855-1.904 1.904-1.904 1.05 0 1.904.854 1.904 1.904 0 1.05-.854 1.904-1.904 1.904zM24.34 14.534a.927.927 0 0 0 1.271-.319l2.076-3.464c.27.062.549.097.837.097a3.762 3.762 0 0 0 3.758-3.758 3.762 3.762 0 0 0-3.758-3.757 3.762 3.762 0 0 0-3.758 3.757c0 1.118.493 2.12 1.27 2.809l-2.015 3.364a.927.927 0 0 0 .318 1.271zm4.184-9.347c1.05 0 1.904.854 1.904 1.903 0 1.05-.854 1.905-1.904 1.905A1.906 1.906 0 0 1 26.62 7.09c0-1.05.854-1.904 1.904-1.904zM15.298 15.41a.927.927 0 0 0-.077-1.31l-.998-.887c.377-.586.599-1.28.599-2.028a3.762 3.762 0 0 0-3.758-3.757 3.762 3.762 0 0 0-3.757 3.757 3.762 3.762 0 0 0 3.757 3.758c.652 0 1.264-.167 1.799-.46l1.126 1.002a.923.923 0 0 0 1.309-.076zM9.16 11.184c0-1.05.854-1.904 1.904-1.904 1.05 0 1.905.854 1.905 1.904 0 1.05-.855 1.904-1.904 1.904a1.906 1.906 0 0 1-1.905-1.904zM12.719 22.58l-3.936.943a3.759 3.759 0 0 0-3.359-2.083 3.762 3.762 0 0 0-3.758 3.758 3.762 3.762 0 0 0 3.758 3.758 3.76 3.76 0 0 0 3.75-3.62l3.977-.954a.927.927 0 0 0-.432-1.803zm-7.295 4.522a1.906 1.906 0 0 1-1.904-1.904c0-1.05.854-1.904 1.904-1.904 1.05 0 1.904.854 1.904 1.904 0 1.05-.854 1.904-1.904 1.904z" fill="#25282B"/>
</svg>
