<svg width="24" height="24" viewBox="0 0 24 24" fill="none" xmlns="http://www.w3.org/2000/svg">
<path d="M19.2357 3.38507H15.5422V2.46169C15.5422 2.33924 15.4936 2.22181 15.407 2.13523C15.3204 2.04864 15.203 2 15.0805 2H8.61689C8.49445 2 8.37701 2.04864 8.29043 2.13523C8.20385 2.22181 8.1552 2.33924 8.1552 2.46169V3.38507H4.46169C4.33924 3.38507 4.22181 3.43371 4.13523 3.52029C4.04864 3.60688 4 3.72431 4 3.84676V21.8526C4 21.9751 4.04864 22.0925 4.13523 22.1791C4.22181 22.2657 4.33924 22.3143 4.46169 22.3143H19.2357C19.3582 22.3143 19.4756 22.2657 19.5622 22.1791C19.6488 22.0925 19.6974 21.9751 19.6974 21.8526V3.84676C19.6974 3.72431 19.6488 3.60688 19.5622 3.52029C19.4756 3.43371 19.3582 3.38507 19.2357 3.38507ZM9.07858 2.92338H14.6189V4.30845H9.07858V2.92338ZM18.7741 21.391H4.92338V4.30845H8.1552V4.77014C8.1552 4.89258 8.20385 5.01002 8.29043 5.0966C8.37701 5.18318 8.49445 5.23183 8.61689 5.23183H15.0805C15.203 5.23183 15.3204 5.18318 15.407 5.0966C15.4936 5.01002 15.5422 4.89258 15.5422 4.77014V4.30845H18.7741V21.391Z" fill="#25282B"/>
<path d="M5.84668 6.61705V19.5444C5.84668 19.6668 5.89532 19.7842 5.98191 19.8708C6.06849 19.9574 6.18592 20.006 6.30837 20.006H17.3889C17.5114 20.006 17.6288 19.9574 17.7154 19.8708C17.802 19.7842 17.8506 19.6668 17.8506 19.5444V6.61705C17.8506 6.49461 17.802 6.37717 17.7154 6.29059C17.6288 6.20401 17.5114 6.15536 17.3889 6.15536H6.30837C6.18592 6.15536 6.06849 6.20401 5.98191 6.29059C5.89532 6.37717 5.84668 6.49461 5.84668 6.61705ZM6.77006 7.07874H16.9272V19.0827H6.77006V7.07874Z" fill="#25282B"/>
<path d="M9.54079 12.1574H10.4642V13.0807C10.4642 13.2032 10.5128 13.3206 10.5994 13.4072C10.686 13.4938 10.8034 13.5424 10.9259 13.5424H12.7726C12.8951 13.5424 13.0125 13.4938 13.0991 13.4072C13.1857 13.3206 13.2343 13.2032 13.2343 13.0807V12.1574H14.1577C14.2801 12.1574 14.3976 12.1087 14.4841 12.0221C14.5707 11.9356 14.6194 11.8181 14.6194 11.6957V9.84892C14.6194 9.72648 14.5707 9.60904 14.4841 9.52246C14.3976 9.43588 14.2801 9.38723 14.1577 9.38723H13.2343V8.46386C13.2343 8.34141 13.1857 8.22398 13.0991 8.13739C13.0125 8.05081 12.8951 8.00217 12.7726 8.00217H10.9259C10.8034 8.00217 10.686 8.05081 10.5994 8.13739C10.5128 8.22398 10.4642 8.34141 10.4642 8.46386V9.38723H9.54079C9.41834 9.38723 9.30091 9.43588 9.21433 9.52246C9.12774 9.60904 9.0791 9.72648 9.0791 9.84892V11.6957C9.0791 11.8181 9.12774 11.9356 9.21433 12.0221C9.30091 12.1087 9.41834 12.1574 9.54079 12.1574ZM10.0025 10.3106H10.9259C11.0483 10.3106 11.1657 10.262 11.2523 10.1754C11.3389 10.0888 11.3875 9.97137 11.3875 9.84892V8.92555H12.3109V9.84892C12.3109 9.97137 12.3596 10.0888 12.4462 10.1754C12.5327 10.262 12.6502 10.3106 12.7726 10.3106H13.696V11.234H12.7726C12.6502 11.234 12.5327 11.2826 12.4462 11.3692C12.3596 11.4558 12.3109 11.5732 12.3109 11.6957V12.6191H11.3875V11.6957C11.3875 11.5732 11.3389 11.4558 11.2523 11.3692C11.1657 11.2826 11.0483 11.234 10.9259 11.234H10.0025V10.3106Z" fill="#FCBD00"/>
<path d="M10.0017 14.9275C9.87928 14.9275 9.76185 14.9761 9.67526 15.0627C9.58868 15.1493 9.54004 15.2667 9.54004 15.3892C9.54004 15.5116 9.58868 15.6291 9.67526 15.7156C9.76185 15.8022 9.87928 15.8509 10.0017 15.8509H13.6952C13.8177 15.8509 13.9351 15.8022 14.0217 15.7156C14.1083 15.6291 14.1569 15.5116 14.1569 15.3892C14.1569 15.2667 14.1083 15.1493 14.0217 15.0627C13.9351 14.9761 13.8177 14.9275 13.6952 14.9275H10.0017Z" fill="#25282B"/>
<path d="M15.0816 16.7743H8.61794C8.49549 16.7743 8.37806 16.8229 8.29148 16.9095C8.20489 16.9961 8.15625 17.1135 8.15625 17.236C8.15625 17.3584 8.20489 17.4758 8.29148 17.5624C8.37806 17.649 8.49549 17.6976 8.61794 17.6976H15.0816C15.204 17.6976 15.3215 17.649 15.4081 17.5624C15.4946 17.4758 15.5433 17.3584 15.5433 17.236C15.5433 17.1135 15.4946 16.9961 15.4081 16.9095C15.3215 16.8229 15.204 16.7743 15.0816 16.7743Z" fill="#25282B"/>
</svg>
