<svg xmlns="http://www.w3.org/2000/svg" width="20" height="20" fill="none" viewBox="0 0 20 20">
    <path fill="#3676FB" d="M16.005 3.284H13.97v-.678c0-.374-.304-.678-.678-.678h-2.215c-.235-.405-.673-.678-1.174-.678-.501 0-.94.273-1.174.678H6.514c-.374 0-.677.304-.677.678v.678H3.803c-.374 0-.678.303-.678.678v14.235c0 .374.304.678.678.678h12.202c.374 0 .678-.304.678-.678V3.962c0-.375-.304-.678-.678-.678zm-8.813 0h2.034c.374 0 .678-.304.678-.678 0 .374.303.678.678.678h2.033v1.355H7.192V3.284zm8.135 14.235H4.48V4.64h1.356v.678c0 .374.303.678.677.678h6.78c.373 0 .677-.304.677-.678V4.64h1.356v12.88z"/>
    <path fill="#3676FB" d="M12.613 8.028H7.19c-.375 0-.678.304-.678.678 0 .374.303.678.678.678h5.423c.374 0 .678-.304.678-.678 0-.374-.304-.678-.678-.678zM12.613 10.74H7.19c-.375 0-.678.304-.678.678 0 .375.303.678.678.678h5.423c.374 0 .678-.303.678-.678 0-.374-.304-.677-.678-.677zM12.613 13.452H7.19c-.375 0-.678.304-.678.678 0 .374.303.678.678.678h5.423c.374 0 .678-.304.678-.678 0-.374-.304-.678-.678-.678z"/>
</svg>
