<svg xmlns="http://www.w3.org/2000/svg" width="43" height="43" fill="none" viewBox="0 0 43 43">
    <path fill="#25282B" d="M31.933 14.265V33.23c0 1.727-1.405 3.131-3.131 3.131h-16.7c-1.727 0-3.131-1.404-3.131-3.13V10.268c0-1.726 1.404-3.13 3.13-3.13h12.704c.837 0 1.624.325 2.215.917l3.995 3.995c.592.591.918 1.378.918 2.214zM25.67 9.658V13.4h3.743L25.67 9.659zm4.175 23.573V15.488h-5.218c-.577 0-1.044-.467-1.044-1.044V9.226H12.102c-.575 0-1.044.467-1.044 1.043v22.962c0 .576.469 1.044 1.044 1.044h16.7c.575 0 1.043-.468 1.043-1.044zM14.19 15.488h6.263c.576 0 1.043-.467 1.043-1.044s-.467-1.044-1.043-1.044h-6.263c-.576 0-1.043.467-1.043 1.044s.467 1.044 1.043 1.044zm0 4.175h10.438c.576 0 1.043-.467 1.043-1.044s-.467-1.044-1.043-1.044H14.189c-.576 0-1.043.467-1.043 1.044s.467 1.044 1.043 1.044zm5.219 2.087h-5.219c-.576 0-1.043.467-1.043 1.044s.467 1.044 1.043 1.044h5.219c.576 0 1.044-.467 1.044-1.044s-.468-1.044-1.044-1.044zm0 4.175h-5.219c-.576 0-1.043.467-1.043 1.044s.467 1.044 1.043 1.044h5.219c.576 0 1.044-.467 1.044-1.044s-.468-1.044-1.044-1.044z"/>
    <path fill="#F36" fill-rule="evenodd" d="M23.25 22v1.124l.923.011c.84.012 1.267.499 1.42 1.116H23.25v1.125h2.343c-.154.616-.58 1.114-1.42 1.114h-.923v1.133h.24L26.26 31l.63-.804-2.17-2.649c.986-.25 1.619-1.163 1.793-2.17h1.236V24.25h-1.236c-.07-.405-.22-.788-.43-1.125h1.666v-1.125h-4.5V22z" clip-rule="evenodd"/>
</svg>
