<svg xmlns="http://www.w3.org/2000/svg" width="36" height="36" fill="none" viewBox="0 0 36 36">
        <circle cx="18" cy="18" r="18" fill="#ffffff"/>
        <path fill="#25282B" d="M16.332 12L15 13.41 19.327 18 15 22.59 16.332 24 22 18l-5.668-6z"/>
</svg>
