<svg xmlns="http://www.w3.org/2000/svg" width="20" height="20" fill="none" viewBox="0 0 20 20">
    <g opacity=".7">
        <path fill="#fff" d="M0 0H20V20H0z"/>
        <path fill="#25282B" fill-rule="evenodd" d="M6.706 7.176v-.47c0-.26.21-.47.47-.47h5.647c.26 0 .471.21.471.47v.47h4.235c.26 0 .471.211.471.471v8.941c0 .26-.21.47-.47.47h-4.236v.471c0 .26-.21.471-.47.471H7.175c-.26 0-.47-.21-.47-.47v-.471H2.47c-.26 0-.471-.21-.471-.47V7.646c0-.26.21-.47.47-.47h4.236zm10.353.942v8h-3.765v-8h3.765zm-4.706-.942v9.883H7.647V7.176h4.706zm-5.647.942v8H2.94v-8h3.765zm7.059 2.117c0 .78.632 1.412 1.412 1.412.778 0 1.411-.632 1.411-1.412 0-.779-.632-1.411-1.412-1.411-.778 0-1.411.632-1.411 1.411zm.94 0c0-.26.212-.47.472-.47.259 0 .47.211.47.47 0 .26-.211.47-.47.47-.26 0-.471-.21-.471-.47zm-6.352 0c0 .909.738 1.647 1.647 1.647s1.647-.737 1.647-1.647c0-.908-.738-1.647-1.647-1.647s-1.647.738-1.647 1.647zm.941 0c0-.389.317-.706.706-.706.39 0 .706.317.706.706 0 .39-.317.706-.706.706-.39 0-.706-.317-.706-.706zm-5.882 0c0 .78.632 1.412 1.412 1.412.778 0 1.411-.632 1.411-1.412 0-.779-.632-1.411-1.411-1.411-.78 0-1.412.632-1.412 1.411zm.94 0c0-.26.212-.47.472-.47.259 0 .47.211.47.47 0 .26-.211.47-.47.47-.26 0-.471-.21-.471-.47zm9.883 3.294h1.883c.26 0 .47-.21.47-.47s-.21-.47-.47-.47h-1.883c-.26 0-.47.21-.47.47s.21.47.47.47zm.47 1.648h.942c.26 0 .47-.211.47-.471s-.21-.47-.47-.47h-.941c-.26 0-.47.21-.47.47s.21.47.47.47zm-5.881-1.648h2.353c.26 0 .47-.21.47-.47s-.21-.47-.47-.47H8.824c-.26 0-.471.21-.471.47s.21.47.47.47zm.705 1.648h.942c.26 0 .47-.211.47-.471s-.21-.47-.47-.47h-.942c-.26 0-.47.21-.47.47s.21.47.47.47zM6.235 2.94h7.53c.26 0 .47-.21.47-.47S14.025 2 13.765 2h-7.53c-.26 0-.47.21-.47.47s.21.471.47.471zm2.118 1.647h3.294c.26 0 .47-.21.47-.47s-.21-.47-.47-.47H8.353c-.26 0-.47.21-.47.47s.21.47.47.47zm-4.47 8.941h1.882c.26 0 .47-.21.47-.47s-.21-.47-.47-.47H3.882c-.26 0-.47.21-.47.47s.21.47.47.47zm.47 1.648h.941c.26 0 .47-.211.47-.471s-.21-.47-.47-.47h-.941c-.26 0-.47.21-.47.47s.21.47.47.47z" clip-rule="evenodd"/>
    </g>
</svg>
