<svg width="24" height="24" viewBox="0 0 24 24" fill="none" xmlns="http://www.w3.org/2000/svg">
<path fill-rule="evenodd" clip-rule="evenodd" d="M6.15053 4.25067V6.26559L8.37554 6.28576C10.403 6.30591 11.4313 7.17875 11.7999 8.28494H6.15056V10.2999H11.7999C11.4291 11.4036 10.3986 12.2951 8.37554 12.2951H7.61268H7.58666H6.1499V13.6604V13.7854L6.15096 14.3253H6.72735L13.4098 20.3735L14.927 18.9329L9.69724 14.187C12.0731 13.7393 13.6 12.1036 14.0201 10.2989H17.0001V8.28396H14.0201C13.8521 7.55979 13.4905 6.87311 12.9818 6.26904H17.0001V4.25411C13.3972 4.25331 6.15053 4.25411 6.15053 4.25411V4.25067Z" fill="black"/>
</svg>
