<svg xmlns="http://www.w3.org/2000/svg" width="48" height="48" fill="none" viewBox="0 0 48 48">
    <circle cx="24" cy="24" r="24" fill="#0C0"/>
    <path fill="#fff" d="M13.963 12c.44 0 .85.23 1.055.614h-.002l.613 1.142.409.057.919-.918c.34-.34.901-.45 1.385-.2l.019.008h-.002l.745.436.018.012v-.001c.42.28.605.799.454 1.275l-.394 1.23.246.324 1.324-.013h.004c.5 0 .946.308 1.11.77 0 .001.068.185.138.457.07.274.101.467.101.467.078.488-.17.969-.616 1.197l-1.168.599-.06.398.94.902c.366.35.447.901.206 1.354l-.01.018.001-.001-.446.727-.013.017h.001c-.287.413-.815.593-1.304.444l.002.002-1.27-.38-.319.23.014 1.293c.003.491-.312.933-.788 1.095-.003 0-.191.068-.47.136-.28.07-.481.099-.481.099h-.004-.003c-.048.006-.053.013-.16.013-.442 0-.85-.233-1.055-.616h.002l-.613-1.142-.407-.057-.921.916c-.342.343-.905.45-1.387.201l-.017-.009.002.001-.744-.436-.018-.012c-.42-.28-.606-.798-.454-1.275l.392-1.23-.242-.321-1.328.013h-.002-.002c-.5 0-.945-.31-1.109-.77 0-.003-.07-.185-.14-.458-.07-.274-.1-.469-.1-.469-.078-.488.17-.968.616-1.196l1.168-.6.06-.394-.94-.902c-.366-.35-.448-.902-.206-1.355l.01-.018-.001.002.446-.729.012-.017c.287-.41.813-.593 1.302-.445h.002l1.267.381.32-.232-.014-1.293c-.003-.492.314-.933.79-1.095.002 0 .19-.066.468-.134.28-.07.481-.1.481-.1h.007c.067-.01.072-.012.16-.012zm-.128 1.433c-.053.011-.103.023-.174.04-.07.017-.116.03-.168.044l.011 1.16c.004.44-.213.844-.579 1.078l-.311.225c-.343.284-.81.379-1.242.246v.001l-1.11-.337-.187.305.832.796h.001c.32.308.46.744.368 1.164l.005-.022-.062.418.001-.02c-.038.438-.303.825-.702 1.029l-1.05.54c.011.051.021.099.039.168.017.07.032.115.047.165l1.192-.013h.003c.445 0 .855.211 1.092.566l.244.325-.015-.018c.29.335.387.792.253 1.212l-.349 1.086.312.183.817-.813c.252-.25.601-.381.965-.381.082 0 .143 0 .234.023l-.03-.007.427.061-.02-.002c.447.038.843.296 1.051.685l.55 1.028c.054-.01.104-.02.176-.038.07-.017.116-.031.166-.046l-.011-1.16c-.004-.439.213-.844.579-1.078l-.017.01.347-.25-.018.014c.24-.2.553-.3.875-.3.127 0 .25.019.367.053h.002l1.11.338.186-.303-.832-.798h-.002c-.318-.308-.46-.743-.367-1.162l-.005.021.062-.417-.001.02c.039-.438.304-.825.702-1.029l1.05-.54c-.011-.051-.021-.1-.039-.169-.017-.069-.032-.114-.047-.165l-1.191.013h-.002-.002c-.445 0-.855-.21-1.092-.566l-.246-.325.015.018c-.29-.336-.385-.794-.25-1.213l.346-1.086-.311-.181-.817.811v.001c-.252.251-.602.383-.966.383-.083 0-.144-.003-.232-.024l.03.007-.429-.062.02.001c-.447-.038-.842-.297-1.05-.684l-.551-1.029zm5.332 2.273c.007-.002-.012.02 0 0zm-4.107.67c1.42 0 2.58 1.137 2.58 2.525s-1.16 2.523-2.58 2.523c-1.42 0-2.582-1.134-2.582-2.523 0-1.388 1.162-2.524 2.582-2.524zm14.908.003c.401 0 .645.023.646.023l.032.001h-.002c.586.052 1.08.472 1.219 1.029l.466 1.895v.002c-.007-.03.011.018.044.053.033.034.081.06.076.06.008.002.014.004.019.007l-.002-.001.63.255.02.009h-.002c-.045-.022.02 0 .074-.003.053-.002.108-.027.07-.005h.002l1.7-1.017h.002c.498-.296 1.167-.245 1.626.157l.014.012.881.862.013.014c.395.434.455 1.08.145 1.575L36.6 22.973c.015-.023-.006.02-.008.067-.002.048.014.099.011.096l.006.014.001.002.26.614.006.016v.002c-.01-.028.016.021.051.053.035.032.087.05.056.043h.001l1.941.457c.57.135.998.617 1.052 1.188l.002.021v.017l.001.017.009.133c.006.115.011.28.011.475 0 .393-.023.633-.023.634l-.002.031v-.001c-.052.572-.482 1.056-1.052 1.191l-1.939.456h-.002l-.003.002c.02-.004-.018.009-.05.04-.036.032-.063.078-.061.073l-.008.019.001-.002-.261.615c-.003.009-.006.015-.01.02l.001-.001c.014-.027-.005.025-.003.072.002.047.027.097.01.07l1.042 1.663c.31.496.244 1.15-.162 1.592-.004.005-.008.01-.013.013l-.88.861-.015.013c-.443.385-1.104.443-1.611.142h-.001-.001l-1.702-1.017c.024.014-.02-.008-.065-.01s-.092.007-.103.011l-.013.006-.002.001-.63.255-.015.006h-.003c.03-.01-.02.016-.052.05s-.05.084-.044.054v.002l-.468 1.897c-.137.559-.632.974-1.215 1.028 0 0-.277.026-.68.026s-.645-.025-.646-.025c-.011 0-.022 0-.032-.002h.001c-.585-.05-1.08-.469-1.217-1.027l-.468-1.897v-.002c.008.032-.01-.017-.044-.052-.033-.035-.081-.061-.075-.06l-.02-.007h.003l-.63-.254-.022-.01.002.001c.047.023-.018-.002-.072 0-.054.003-.115.034-.071.007l-1.702 1.019c-.207.123-.45.185-.698.185-.338 0-.671-.117-.93-.342l-.015-.014-.88-.86-.013-.014c-.395-.435-.455-1.081-.145-1.577l1.042-1.662v-.002c-.014.022.007-.02.008-.067.002-.048-.013-.1-.011-.096l-.006-.014-.001-.002-.26-.614-.006-.016v-.002c.01.03-.015-.021-.05-.053-.037-.031-.09-.05-.058-.043h-.002l-1.94-.457c-.572-.135-.996-.618-1.051-1.188v-.002c0-.001-.027-.27-.027-.663 0-.394.025-.631.025-.632l.002-.031v.001c.053-.571.48-1.055 1.05-1.191l1.941-.456h.001c-.03.007.02-.01.055-.043.035-.032.062-.08.06-.074l.008-.018v.002l.26-.616.01-.02-.001.002c-.014.027.005-.026.003-.072s-.024-.092-.01-.07v-.001l-1.04-1.662c-.31-.496-.246-1.15.16-1.593l.013-.013.882-.86.015-.013c.443-.385 1.105-.444 1.611-.142l1.702 1.019c-.02-.012.021.007.065.01.045.002.092-.01.101-.014l.015-.005.002-.001.63-.254.015-.006h.003c-.03.01.02-.015.052-.05.032-.034.05-.085.044-.056v-.002l.468-1.897c.138-.559.633-.974 1.217-1.027l.017-.002H29.322l.02-.001.138-.009c.118-.006.285-.013.487-.013zm-.002 1.401c-.164 0-.3.006-.396.01l-.113.007h-.001l-.457 1.858c-.124.507-.51.93-1.005 1.094l-.545.22c-.48.231-1.069.2-1.522-.07l-1.649-.986-.729.711 1.01 1.614c.278.445.31 1.01.081 1.466l-.227.537c-.173.493-.609.877-1.127 1l-1.899.446c-.004.053-.018.217-.018.499 0 .16.005.293.01.387l.006.11v.002l1.902.448c.519.121.951.5 1.12.98l.224.535c.233.468.207 1.043-.07 1.488l-1.009 1.61.727.713 1.65-.986c.233-.138.498-.194.759-.205.26-.012.515.017.742.128l.548.219.003.001c.503.171.894.596 1.018 1.101l.458 1.858c.055.003.22.016.51.016.165 0 .301-.004.398-.008l.113-.007.458-1.86c.124-.506.51-.929 1.003-1.094l.545-.22h.004c.208-.1.442-.145.681-.145.303 0 .594.07.839.216l1.647.987.729-.712-1.008-1.613c-.278-.445-.31-1.01-.081-1.467l.225-.535.002-.004c.174-.491.608-.876 1.126-.999l1.9-.446c.003-.053.017-.215.017-.498 0-.16-.004-.293-.009-.387l-.007-.11-1.902-.448c-.518-.122-.95-.5-1.12-.981l-.225-.535c-.233-.469-.206-1.043.073-1.488l1.008-1.612-.727-.712-1.65.987c-.233.14-.5.194-.76.206-.262.011-.515-.018-.743-.129l.02.01-.566-.23c-.504-.17-.899-.596-1.025-1.103l-.456-1.856c-.054-.004-.221-.018-.51-.018zm-14.906 0c-.635 0-1.146.5-1.146 1.121s.51 1.12 1.146 1.12c.635 0 1.146-.499 1.146-1.12 0-.62-.51-1.12-1.146-1.12zm14.906 4.062c2.447 0 4.443 1.953 4.443 4.346 0 2.392-1.996 4.344-4.444 4.344-2.447 0-4.445-1.952-4.445-4.344 0-2.393 1.998-4.346 4.446-4.346zm-19.01.243l-.003.009.003-.009zm19.01 1.16c-1.663 0-3.01 1.317-3.01 2.943 0 1.625 1.347 2.942 3.01 2.942 1.662 0 3.01-1.317 3.01-2.942 0-1.626-1.348-2.942-3.01-2.942z"/>
</svg>
