  309

Na      0.000001   -0.000003   -0.000001
Na      2.927141   -0.000003   -1.809053
Na      2.927141   -0.000003    1.809052
Na     -2.927139   -0.000003   -1.809053
Na     -2.927139   -0.000003    1.809052
Na     -1.809052    2.927142   -0.000001
Na      1.809054    2.927142   -0.000001
Na     -1.809051   -2.927147   -0.000001
Na      1.809054   -2.927147   -0.000001
Na      0.000001   -1.809059    2.927139
Na      0.000001    1.809053    2.927139
Na      0.000001   -1.809059   -2.927140
Na      0.000001    1.809053   -2.927140
Na      5.944219   -0.000002   -3.673600
Na      5.994281   -0.000003   -0.000001
Na      5.944219   -0.000002    3.673600
Na     -5.944218   -0.000002   -3.673601
Na     -5.994280   -0.000003   -0.000001
Na     -5.944218   -0.000002    3.673600
Na     -3.673599    5.944223   -0.000000
Na      0.000001    5.994286   -0.000001
Na      3.673601    5.944223   -0.000000
Na     -3.673598   -5.944226   -0.000000
Na      0.000001   -5.994288   -0.000001
Na      3.673600   -5.944225   -0.000000
Na      0.000001   -3.673607    5.944216
Na      0.000001   -0.000003    5.994280
Na      0.000001    3.673604    5.944217
Na      0.000001   -3.673607   -5.944217
Na      0.000001   -0.000003   -5.994280
Na      0.000001    3.673603   -5.944218
Na      2.997110   -1.852301    4.849413
Na      2.997111    1.852296    4.849414
Na      2.997110   -1.852301   -4.849414
Na      2.997110    1.852296   -4.849415
Na     -2.997108   -1.852301    4.849414
Na     -2.997109    1.852297    4.849415
Na     -2.997108   -1.852301   -4.849414
Na     -2.997108    1.852296   -4.849415
Na      4.849416    2.997111   -1.852296
Na      4.849416    2.997111    1.852295
Na     -4.849415    2.997111   -1.852296
Na     -4.849415    2.997111    1.852295
Na      4.849415   -2.997115   -1.852296
Na      4.849415   -2.997115    1.852295
Na     -4.849414   -2.997116   -1.852296
Na     -4.849414   -2.997116    1.852295
Na     -1.852295    4.849420    2.997108
Na      1.852297    4.849420    2.997108
Na     -1.852294   -4.849423    2.997107
Na      1.852296   -4.849422    2.997107
Na     -1.852295    4.849420   -2.997109
Na      1.852297    4.849419   -2.997109
Na     -1.852294   -4.849423   -2.997108
Na      1.852296   -4.849422   -2.997107
Na      9.087468   -0.000001   -5.616337
Na      9.128921   -0.000002   -1.889100
Na      9.128921   -0.000002    1.889100
Na      9.087469   -0.000001    5.616338
Na     -9.087470   -0.000001   -5.616339
Na     -9.128924   -0.000002   -1.889101
Na     -9.128924   -0.000002    1.889100
Na     -9.087471   -0.000001    5.616339
Na     -5.616335    9.087467   -0.000000
Na     -1.889099    9.128919   -0.000000
Na      1.889101    9.128918   -0.000000
Na      5.616335    9.087465   -0.000000
Na     -5.616331   -9.087462   -0.000000
Na     -1.889099   -9.128913   -0.000000
Na      1.889100   -9.128912   -0.000000
Na      5.616331   -9.087460   -0.000000
Na      0.000000   -5.616339    9.087465
Na      0.000001   -1.889104    9.128922
Na      0.000001    1.889101    9.128925
Na      0.000000    5.616340    9.087469
Na      0.000000   -5.616338   -9.087464
Na      0.000001   -1.889104   -9.128921
Na      0.000001    1.889101   -9.128923
Na      0.000000    5.616339   -9.087468
Na      6.092762   -1.876411    6.801741
Na      3.036202   -3.765559    7.969216
Na      6.092763    1.876408    6.801743
Na      3.064503   -0.000002    8.022818
Na      3.036204    3.765557    7.969220
Na      6.092761   -1.876411   -6.801741
Na      3.036201   -3.765558   -7.969216
Na      6.092762    1.876408   -6.801742
Na      3.064503   -0.000002   -8.022817
Na      3.036203    3.765556   -7.969219
Na     -6.092762   -1.876412    6.801744
Na     -3.036201   -3.765559    7.969218
Na     -6.092763    1.876409    6.801745
Na     -3.064502   -0.000002    8.022819
Na     -3.036203    3.765557    7.969221
Na     -6.092761   -1.876411   -6.801743
Na     -3.036201   -3.765559   -7.969217
Na     -6.092762    1.876409   -6.801745
Na     -3.064501   -0.000002   -8.022818
Na     -3.036203    3.765557   -7.969220
Na      6.801740    6.092763   -1.876407
Na      7.969219    3.036203   -3.765554
Na      6.801741    6.092763    1.876407
Na      8.022817    3.064503   -0.000000
Na      7.969220    3.036203    3.765554
Na     -6.801742    6.092764   -1.876408
Na     -7.969221    3.036204   -3.765555
Na     -6.801742    6.092765    1.876407
Na     -8.022819    3.064504   -0.000000
Na     -7.969222    3.036205    3.765555
Na      6.801735   -6.092762   -1.876405
Na      7.969216   -3.036204   -3.765553
Na      6.801735   -6.092762    1.876405
Na      8.022814   -3.064505   -0.000000
Na      7.969217   -3.036205    3.765553
Na     -6.801736   -6.092764   -1.876406
Na     -7.969218   -3.036206   -3.765554
Na     -6.801737   -6.092764    1.876406
Na     -8.022816   -3.064507   -0.000000
Na     -7.969219   -3.036206    3.765554
Na     -1.876407    6.801746    6.092760
Na     -3.765553    7.969221    3.036200
Na      1.876408    6.801745    6.092759
Na      0.000001    8.022818    3.064499
Na      3.765553    7.969219    3.036199
Na     -1.876405   -6.801743    6.092756
Na     -3.765550   -7.969217    3.036196
Na      1.876406   -6.801742    6.092755
Na      0.000001   -8.022814    3.064496
Na      3.765551   -7.969215    3.036195
Na     -1.876407    6.801745   -6.092760
Na     -3.765552    7.969220   -3.036200
Na      1.876408    6.801744   -6.092759
Na      0.000001    8.022818   -3.064499
Na      3.765553    7.969219   -3.036199
Na     -1.876404   -6.801742   -6.092756
Na     -3.765550   -7.969216   -3.036196
Na      1.876406   -6.801741   -6.092755
Na      0.000001   -8.022814   -3.064496
Na      3.765550   -7.969215   -3.036195
Na      4.958356   -4.958362    4.958354
Na      4.958359    4.958361    4.958357
Na      4.958356   -4.958362   -4.958354
Na      4.958359    4.958361   -4.958357
Na     -4.958356   -4.958363    4.958355
Na     -4.958359    4.958363    4.958358
Na     -4.958355   -4.958363   -4.958356
Na     -4.958358    4.958362   -4.958358
Na     12.188778   -0.000001   -7.533119
Na     12.286939   -0.000001   -3.801508
Na     12.268277   -0.000001   -0.000000
Na     12.286940   -0.000001    3.801508
Na     12.188779   -0.000001    7.533119
Na    -12.188781   -0.000001   -7.533121
Na    -12.286943   -0.000001   -3.801508
Na    -12.268281   -0.000001   -0.000000
Na    -12.286943   -0.000001    3.801508
Na    -12.188782   -0.000001    7.533121
Na     -7.533115   12.188775   -0.000000
Na     -3.801506   12.286934   -0.000000
Na      0.000001   12.268270   -0.000000
Na      3.801507   12.286933   -0.000000
Na      7.533115   12.188773   -0.000000
Na     -7.533111  -12.188770   -0.000000
Na     -3.801505  -12.286926   -0.000000
Na      0.000001  -12.268261   -0.000000
Na      3.801506  -12.286925   -0.000000
Na      7.533110  -12.188767   -0.000000
Na      0.000000   -7.533120   12.188775
Na      0.000000   -3.801511   12.286941
Na      0.000001   -0.000001   12.268281
Na      0.000000    3.801509   12.286944
Na      0.000000    7.533122   12.188779
Na      0.000000   -7.533119  -12.188773
Na      0.000000   -3.801511  -12.286939
Na      0.000001   -0.000001  -12.268280
Na      0.000000    3.801509  -12.286942
Na      0.000000    7.533121  -12.188778
Na      9.218905   -1.896105    8.765562
Na      6.134173   -3.791130    9.925245
Na      3.067971   -5.697615   11.115046
Na      9.218906    1.896103    8.765563
Na      6.203235   -0.000001   10.003859
Na      3.084990   -1.927179   11.194914
Na      6.134175    3.791129    9.925248
Na      3.084991    1.927177   11.194916
Na      3.067973    5.697615   11.115050
Na      9.218904   -1.896104   -8.765561
Na      6.134172   -3.791130   -9.925244
Na      3.067971   -5.697614  -11.115045
Na      9.218905    1.896103   -8.765562
Na      6.203234   -0.000001  -10.003858
Na      3.084990   -1.927179  -11.194913
Na      6.134174    3.791129   -9.925247
Na      3.084990    1.927177  -11.194914
Na      3.067973    5.697614  -11.115049
Na     -9.218906   -1.896105    8.765564
Na     -6.134173   -3.791131    9.925247
Na     -3.067971   -5.697615   11.115047
Na     -9.218907    1.896104    8.765566
Na     -6.203235   -0.000001   10.003861
Na     -3.084990   -1.927179   11.194915
Na     -6.134175    3.791130    9.925250
Na     -3.084990    1.927177   11.194917
Na     -3.067973    5.697615   11.115051
Na     -9.218905   -1.896105   -8.765563
Na     -6.134172   -3.791131   -9.925246
Na     -3.067970   -5.697615  -11.115046
Na     -9.218906    1.896103   -8.765565
Na     -6.203234   -0.000001  -10.003860
Na     -3.084989   -1.927179  -11.194914
Na     -6.134174    3.791129   -9.925249
Na     -3.084990    1.927177  -11.194915
Na     -3.067972    5.697614  -11.115050
Na      8.765558    9.218904   -1.896101
Na      9.925245    6.134174   -3.791127
Na     11.115049    3.067972   -5.697612
Na      8.765558    9.218904    1.896101
Na     10.003855    6.203235   -0.000000
Na     11.194913    3.084989   -1.927177
Na      9.925245    6.134174    3.791126
Na     11.194913    3.084990    1.927176
Na     11.115050    3.067973    5.697612
Na     -8.765560    9.218906   -1.896102
Na     -9.925247    6.134176   -3.791128
Na    -11.115051    3.067974   -5.697613
Na     -8.765560    9.218906    1.896102
Na    -10.003858    6.203237   -0.000000
Na    -11.194915    3.084991   -1.927177
Na     -9.925248    6.134176    3.791127
Na    -11.194916    3.084991    1.927176
Na    -11.115052    3.067974    5.697613
Na      8.765552   -9.218901   -1.896099
Na      9.925240   -6.134173   -3.791125
Na     11.115046   -3.067973   -5.697611
Na      8.765553   -9.218901    1.896099
Na     10.003851   -6.203235   -0.000000
Na     11.194910   -3.084991   -1.927176
Na      9.925241   -6.134173    3.791124
Na     11.194910   -3.084991    1.927176
Na     11.115047   -3.067974    5.697611
Na     -8.765554   -9.218903   -1.896100
Na     -9.925242   -6.134175   -3.791126
Na    -11.115049   -3.067975   -5.697612
Na     -8.765554   -9.218903    1.896100
Na    -10.003853   -6.203237   -0.000000
Na    -11.194913   -3.084992   -1.927177
Na     -9.925243   -6.134175    3.791126
Na    -11.194913   -3.084993    1.927176
Na    -11.115050   -3.067975    5.697612
Na     -1.896102    8.765564    9.218903
Na     -3.791126    9.925247    6.134170
Na     -5.697609   11.115047    3.067969
Na      1.896103    8.765564    9.218902
Na      0.000001   10.003857    6.203230
Na     -1.927175   11.194910    3.084985
Na      3.791126    9.925246    6.134169
Na      1.927177   11.194909    3.084985
Na      5.697609   11.115046    3.067968
Na     -1.896100   -8.765560    9.218898
Na     -3.791123   -9.925242    6.134165
Na     -5.697606  -11.115042    3.067965
Na      1.896101   -8.765560    9.218898
Na      0.000001  -10.003851    6.203226
Na     -1.927175  -11.194904    3.084982
Na      3.791123   -9.925240    6.134164
Na      1.927176  -11.194903    3.084982
Na      5.697606  -11.115040    3.067965
Na     -1.896102    8.765563   -9.218902
Na     -3.791125    9.925246   -6.134169
Na     -5.697609   11.115047   -3.067969
Na      1.896102    8.765563   -9.218902
Na      0.000001   10.003856   -6.203230
Na     -1.927175   11.194909   -3.084986
Na      3.791126    9.925245   -6.134169
Na      1.927177   11.194909   -3.084985
Na      5.697609   11.115045   -3.067968
Na     -1.896100   -8.765559   -9.218898
Na     -3.791122   -9.925241   -6.134165
Na     -5.697606  -11.115041   -3.067966
Na      1.896100   -8.765559   -9.218897
Na      0.000001  -10.003850   -6.203227
Na     -1.927175  -11.194903   -3.084983
Na      3.791123   -9.925239   -6.134164
Na      1.927176  -11.194902   -3.084983
Na      5.697606  -11.115039   -3.067965
Na      8.109867   -4.991645    6.918809
Na      8.109870    4.991645    6.918812
Na      6.918807   -8.109869    4.991636
Na      6.918811    8.109870    4.991640
Na      4.991640   -6.918815    8.109864
Na      4.991643    6.918816    8.109867
Na      8.109866   -4.991644   -6.918809
Na      8.109869    4.991644   -6.918812
Na      6.918807   -8.109868   -4.991636
Na      6.918811    8.109870   -4.991640
Na      4.991639   -6.918814   -8.109863
Na      4.991642    6.918815   -8.109867
Na     -8.109868   -4.991646    6.918811
Na     -8.109870    4.991646    6.918814
Na     -6.918808   -8.109870    4.991638
Na     -6.918812    8.109872    4.991641
Na     -4.991640   -6.918816    8.109865
Na     -4.991643    6.918817    8.109868
Na     -8.109867   -4.991646   -6.918811
Na     -8.109870    4.991645   -6.918814
Na     -6.918807   -8.109870   -4.991638
Na     -6.918811    8.109871   -4.991641
Na     -4.991639   -6.918815   -8.109864
Na     -4.991642    6.918816   -8.109868
