\relax 
\providecommand\hyper@newdestlabel[2]{}
\citation{Kamath2019b}
\@writefile{lof}{\addvspace {10\p@ }}
\@writefile{lot}{\addvspace {10\p@ }}
\@writefile{toc}{\setlength  {\cftchapterindent }{0em} \setlength  {\cftchapternumwidth }{\cftlastnumwidth }}
\@writefile{toc}{\contentsline {chapter}{\chapternumberline {2}\MakeTextUppercase  {Fundamentação Teórica}}{9}{chapter.2}\protected@file@percent }
\newlabel{cap:rev.teorica}{{\M@TitleReference {2}{\MakeTextUppercase  {Fundamentação Teórica}}}{9}{Fundamentação Teórica}{chapter.2}{}}
\@writefile{toc}{\contentsline {section}{\numberline {2.1}Reconhecimento Automático de Fala}{9}{section.2.1}\protected@file@percent }
\citation{Kamath2019b}
\@writefile{toc}{\contentsline {section}{\numberline {2.2}Coeficientes Mel-Cepstrais}{10}{section.2.2}\protected@file@percent }
\newlabel{sec:mfcc}{{\M@TitleReference {2.2}{Coeficientes Mel-Cepstrais}}{10}{Coeficientes Mel-Cepstrais}{section.2.2}{}}
\newlabel{sec:pre_enfase}{{\M@TitleReference {2.2.1}{Filtro de Pré-Ênfase}}{10}{Filtro de Pré-Ênfase}{subsection.2.2.1}{}}
\@writefile{toc}{\contentsline {subsection}{\numberline {2.2.1}Filtro de Pré-Ênfase}{10}{subsection.2.2.1}\protected@file@percent }
\citation{Kamath2019b}
\citation{Kamath2019b}
\newlabel{eq:1storder}{{2.1}{11}{Filtro de Pré-Ênfase}{equation.2.2.1}{}}
\newlabel{sec:framing}{{\M@TitleReference {2.2.2}{\textit  {Framing} e \textit  {Windowing}}}{11}{\textit {Framing} e \textit {Windowing}}{subsection.2.2.2}{}}
\@writefile{toc}{\contentsline {subsection}{\numberline {2.2.2}\textit  {Framing} e \textit  {Windowing}}{11}{subsection.2.2.2}\protected@file@percent }
\citation{oppenheim99}
\citation{gabor1946}
\@writefile{lof}{\contentsline {figure}{\numberline {1}{\ignorespaces Exemplo de distorção causada na frequência de um sinal devido à descontinuidade.}}{12}{figure.caption.4}\protected@file@percent }
\providecommand*\caption@xref[2]{\@setref\relax\@undefined{#1}}
\newlabel{fig:distorção}{{\M@TitleReference {1}{Exemplo de distorção causada na frequência de um sinal devido à descontinuidade.}}{12}{Exemplo de distorção causada na frequência de um sinal devido à descontinuidade}{figure.caption.4}{}}
\newlabel{eq:hann}{{2.2}{12}{\textit {Framing} e \textit {Windowing}}{equation.2.2.2}{}}
\@writefile{lof}{\contentsline {figure}{\numberline {2}{\ignorespaces Janela de Hann de 25 milissegundos utilizada para o processamento de cada frame}}{12}{figure.caption.5}\protected@file@percent }
\newlabel{fig:hann}{{\M@TitleReference {2}{Janela de Hann de 25 milissegundos utilizada para o processamento de cada frame}}{12}{Janela de Hann de 25 milissegundos utilizada para o processamento de cada frame}{figure.caption.5}{}}
\citation{Almeida2014}
\citation{MERMELSTEIN_1990}
\citation{Kamath2019b}
\@writefile{toc}{\contentsline {subsection}{\numberline {2.2.3}Aplicação da Transformada Discreta de Fourier}{13}{subsection.2.2.3}\protected@file@percent }
\newlabel{sec:stft}{{\M@TitleReference {2.2.3}{Aplicação da Transformada Discreta de Fourier}}{13}{Aplicação da Transformada Discreta de Fourier}{subsection.2.2.3}{}}
\newlabel{eq:stft}{{2.3}{13}{Aplicação da Transformada Discreta de Fourier}{equation.2.2.3}{}}
\newlabel{eq:gtau}{{2.4}{13}{Aplicação da Transformada Discreta de Fourier}{equation.2.2.4}{}}
\@writefile{toc}{\contentsline {subsection}{\numberline {2.2.4}Banco de Filtros em Escala Mel}{13}{subsection.2.2.4}\protected@file@percent }
\newlabel{ref:filterbank}{{\M@TitleReference {2.2.4}{Banco de Filtros em Escala Mel}}{13}{Banco de Filtros em Escala Mel}{subsection.2.2.4}{}}
\citation{MERMELSTEIN_1990}
\citation{van_der_Pols_1977}
\citation{Almeida2014}
\@writefile{lof}{\contentsline {figure}{\numberline {3}{\ignorespaces Representação de um sinal do conjunto de dados e seu espectrograma}}{14}{figure.caption.6}\protected@file@percent }
\newlabel{fig:espectrograma}{{\M@TitleReference {3}{Representação de um sinal do conjunto de dados e seu espectrograma}}{14}{Representação de um sinal do conjunto de dados e seu espectrograma}{figure.caption.6}{}}
\newlabel{eq:melfreq}{{2.5}{14}{Banco de Filtros em Escala Mel}{equation.2.2.5}{}}
\@writefile{lof}{\contentsline {figure}{\numberline {4}{\ignorespaces Banco de Filtros Triangulares, linearmente espaçados em frequências mais baixas e logaritmicamente espaçados em frequências mais altas, simulando o funcionamento do sistema auditivo.}}{15}{figure.caption.7}\protected@file@percent }
\newlabel{fig:filterbank}{{\M@TitleReference {4}{Banco de Filtros Triangulares, linearmente espaçados em frequências mais baixas e logaritmicamente espaçados em frequências mais altas, simulando o funcionamento do sistema auditivo.}}{15}{Banco de Filtros Triangulares, linearmente espaçados em frequências mais baixas e logaritmicamente espaçados em frequências mais altas, simulando o funcionamento do sistema auditivo}{figure.caption.7}{}}
\@writefile{lof}{\contentsline {figure}{\numberline {5}{\ignorespaces Espectrograma Auditivo, gerado após passagem pelo banco de filtros.}}{15}{figure.caption.8}\protected@file@percent }
\newlabel{fig:auditoryspec}{{\M@TitleReference {5}{Espectrograma Auditivo, gerado após passagem pelo banco de filtros.}}{15}{Espectrograma Auditivo, gerado após passagem pelo banco de filtros}{figure.caption.8}{}}
\citation{geron2019}
\citation{lecunspeech}
\@writefile{lof}{\contentsline {figure}{\numberline {6}{\ignorespaces  Exemplo de representação de Coeficientes Mel Cepstrais com 13 coeficientes}}{16}{figure.caption.9}\protected@file@percent }
\newlabel{fig:mfcc13}{{\M@TitleReference {6}{ Exemplo de representação de Coeficientes Mel Cepstrais com 13 coeficientes}}{16}{Exemplo de representação de Coeficientes Mel Cepstrais com 13 coeficientes}{figure.caption.9}{}}
\@writefile{toc}{\contentsline {section}{\numberline {2.3}Aprendizado de Máquinas}{16}{section.2.3}\protected@file@percent }
\newlabel{sec:maquinas_aprendizagem}{{\M@TitleReference {2.3}{Aprendizado de Máquinas}}{16}{Aprendizado de Máquinas}{section.2.3}{}}
\citation{mccullosh1943}
\citation{DBLP:journals/corr/Schmidhuber14}
\citation{rosenblatt1958}
\@writefile{toc}{\contentsline {subsection}{\numberline {2.3.1}Redes Neurais Convolucionais}{18}{subsection.2.3.1}\protected@file@percent }
\newlabel{sec:CNN}{{\M@TitleReference {2.3.1}{Redes Neurais Convolucionais}}{18}{Redes Neurais Convolucionais}{subsection.2.3.1}{}}
\citation{fukushima1979}
\@writefile{lof}{\contentsline {figure}{\numberline {7}{\ignorespaces Exemplo de Perceptron.}}{19}{figure.caption.10}\protected@file@percent }
\newlabel{fig:perceptron}{{\M@TitleReference {7}{Exemplo de Perceptron.}}{19}{Exemplo de Perceptron}{figure.caption.10}{}}
\citation{chollet2018}
\citation{chollet2018}
\citation{geron2019}
\citation{geron2019}
\@writefile{lof}{\contentsline {figure}{\numberline {8}{\ignorespaces Padrões locais identificáveis em uma imagem.}}{20}{figure.caption.11}\protected@file@percent }
\newlabel{fig:patterns}{{\M@TitleReference {8}{Padrões locais identificáveis em uma imagem.}}{20}{Padrões locais identificáveis em uma imagem}{figure.caption.11}{}}
\@writefile{lof}{\contentsline {figure}{\numberline {9}{\ignorespaces Exemplo de diferentes mapas de características gerados por diferentes filtros convolucionais de uma CNN}}{20}{figure.caption.12}\protected@file@percent }
\newlabel{fig:featuremap}{{\M@TitleReference {9}{Exemplo de diferentes mapas de características gerados por diferentes filtros convolucionais de uma CNN}}{20}{Exemplo de diferentes mapas de características gerados por diferentes filtros convolucionais de uma CNN}{figure.caption.12}{}}
\citation{Rumelhart1986}
\citation{lecun1989backpropagation}
\citation{lecun1998gradient}
\@writefile{lof}{\contentsline {figure}{\numberline {10}{\ignorespaces Exemplo de operação de MaxPooling com um filtro de 2x2, varrendo a matriz com um passo de 2.}}{21}{figure.caption.13}\protected@file@percent }
\newlabel{fig:maxpooling}{{\M@TitleReference {10}{Exemplo de operação de MaxPooling com um filtro de 2x2, varrendo a matriz com um passo de 2.}}{21}{Exemplo de operação de MaxPooling com um filtro de 2x2, varrendo a matriz com um passo de 2}{figure.caption.13}{}}
\citation{lecun1998gradient}
\citation{lecun1998gradient}
\citation{geron2019}
\citation{udacity2018}
\@writefile{lof}{\contentsline {figure}{\numberline {11}{\ignorespaces A arquitetura LeNet-5 aplicada à reconhecimento de dígitos estabeleceu um padrão para Redes Convolucionais}}{22}{figure.caption.14}\protected@file@percent }
\newlabel{fig:lenet5}{{\M@TitleReference {11}{A arquitetura LeNet-5 aplicada à reconhecimento de dígitos estabeleceu um padrão para Redes Convolucionais}}{22}{A arquitetura LeNet-5 aplicada à reconhecimento de dígitos estabeleceu um padrão para Redes Convolucionais}{figure.caption.14}{}}
\@writefile{toc}{\contentsline {subsection}{\numberline {2.3.2}Redes Neurais Recorrentes}{22}{subsection.2.3.2}\protected@file@percent }
\newlabel{sec:rnn}{{\M@TitleReference {2.3.2}{Redes Neurais Recorrentes}}{22}{Redes Neurais Recorrentes}{subsection.2.3.2}{}}
\citation{Kamath2019c}
\citation{Kamath2019c}
\citation{laurent2015batch}
\@writefile{lof}{\contentsline {figure}{\numberline {12}{\ignorespaces Diagrama de funcionamento de um neurônio recorrente ao longo do tempo}}{23}{figure.caption.15}\protected@file@percent }
\newlabel{fig:rnn}{{\M@TitleReference {12}{Diagrama de funcionamento de um neurônio recorrente ao longo do tempo}}{23}{Diagrama de funcionamento de um neurônio recorrente ao longo do tempo}{figure.caption.15}{}}
\newlabel{eq:basicrnn}{{2.6}{23}{Redes Neurais Recorrentes}{equation.2.3.6}{}}
\newlabel{eq:xprnn}{{2.7}{23}{Redes Neurais Recorrentes}{equation.2.3.7}{}}
\citation{schmidhuber1997long}
\citation{Kamath2019c}
\citation{Kamath2019c}
\citation{Kamath2019c}
\@writefile{lof}{\contentsline {figure}{\numberline {13}{\ignorespaces Diagrama de um neurônio LSTM}}{24}{figure.caption.16}\protected@file@percent }
\newlabel{fig:lstm}{{\M@TitleReference {13}{Diagrama de um neurônio LSTM}}{24}{Diagrama de um neurônio LSTM}{figure.caption.16}{}}
\newlabel{eq:lstm}{{2.8}{25}{Redes Neurais Recorrentes}{equation.2.3.8}{}}
\newlabel{eq:lstm2}{{2.9}{25}{Redes Neurais Recorrentes}{equation.2.3.9}{}}
\newlabel{eq:lstm3}{{2.10}{25}{Redes Neurais Recorrentes}{equation.2.3.10}{}}
\newlabel{eq:lstm4}{{2.11}{25}{Redes Neurais Recorrentes}{equation.2.3.11}{}}
\newlabel{eq:lstm5}{{2.12}{25}{Redes Neurais Recorrentes}{equation.2.3.12}{}}
\newlabel{eq:lstm6}{{2.13}{25}{Redes Neurais Recorrentes}{equation.2.3.13}{}}
\citation{geron2019}
\@setckpt{Cap2_Revisao_Teorica/RevTeorica}{
\setcounter{page}{27}
\setcounter{equation}{13}
\setcounter{enumi}{0}
\setcounter{enumii}{0}
\setcounter{enumiii}{0}
\setcounter{enumiv}{0}
\setcounter{footnote}{0}
\setcounter{mpfootnote}{0}
\setcounter{@memmarkcntra}{-1}
\setcounter{storedpagenumber}{1}
\setcounter{book}{0}
\setcounter{part}{0}
\setcounter{chapter}{2}
\setcounter{section}{3}
\setcounter{subsection}{2}
\setcounter{subsubsection}{0}
\setcounter{paragraph}{0}
\setcounter{subparagraph}{0}
\setcounter{@ppsavesec}{0}
\setcounter{@ppsaveapp}{0}
\setcounter{vslineno}{0}
\setcounter{poemline}{0}
\setcounter{modulo@vs}{0}
\setcounter{memfvsline}{0}
\setcounter{verse}{0}
\setcounter{chrsinstr}{0}
\setcounter{poem}{0}
\setcounter{newflo@tctr}{4}
\setcounter{@contsubnum}{0}
\setcounter{maxsecnumdepth}{4}
\setcounter{sidefootnote}{0}
\setcounter{pagenote}{0}
\setcounter{pagenoteshadow}{0}
\setcounter{memfbvline}{0}
\setcounter{bvlinectr}{0}
\setcounter{cp@cntr}{0}
\setcounter{ism@mctr}{0}
\setcounter{xsm@mctr}{0}
\setcounter{csm@mctr}{0}
\setcounter{ksm@mctr}{0}
\setcounter{xksm@mctr}{0}
\setcounter{cksm@mctr}{0}
\setcounter{msm@mctr}{0}
\setcounter{xmsm@mctr}{0}
\setcounter{cmsm@mctr}{0}
\setcounter{bsm@mctr}{0}
\setcounter{workm@mctr}{0}
\setcounter{sheetsequence}{26}
\setcounter{lastsheet}{50}
\setcounter{lastpage}{51}
\setcounter{figure}{13}
\setcounter{lofdepth}{1}
\setcounter{table}{0}
\setcounter{lotdepth}{1}
\setcounter{Item}{0}
\setcounter{Hfootnote}{0}
\setcounter{memhycontfloat}{0}
\setcounter{Hpagenote}{0}
\setcounter{bookmark@seq@number}{0}
\setcounter{FBcaption@count}{0}
\setcounter{abntex@bookmarkcounter}{2}
\setcounter{alineasi}{0}
\setcounter{alineasii}{0}
\setcounter{subalineasi}{0}
\setcounter{incisosi}{0}
\setcounter{parentequation}{0}
\setcounter{caption@flags}{2}
\setcounter{continuedfloat}{0}
\setcounter{subfigure}{0}
\setcounter{subtable}{0}
\setcounter{float@type}{8}
\setcounter{AM@survey}{0}
\setcounter{lstnumber}{1}
\setcounter{ABCIaux}{0}
\setcounter{ABCImax}{0}
\setcounter{section@level}{2}
\setcounter{lstlisting}{0}
}
