%!PS-Adobe-3.0 EPSF-3.0
%%Creator: (MATLAB, The Mathworks, Inc. Version 8.5.0.197613 \(R2015a\). Operating System: Windows 8)
%%Title: D:/IFES/PG/Mao_Bionica/Imagens/matriz_confusao_simple_class.eps
%%CreationDate: 2017-07-18T15:51:11
%%Pages: (atend)
%%BoundingBox: 0 0 797 502
%%LanguageLevel: 2
%%EndComments
%%BeginProlog
%%BeginResource: procset (Apache XML Graphics Std ProcSet) 1.2 0
%%Version: 1.2 0
%%Copyright: (Copyright 2001-2003,2010 The Apache Software Foundation. License terms: http://www.apache.org/licenses/LICENSE-2.0)
/bd{bind def}bind def
/ld{load def}bd
/GR/grestore ld
/M/moveto ld
/LJ/setlinejoin ld
/C/curveto ld
/f/fill ld
/LW/setlinewidth ld
/GC/setgray ld
/t/show ld
/N/newpath ld
/CT/concat ld
/cp/closepath ld
/S/stroke ld
/L/lineto ld
/CC/setcmykcolor ld
/A/ashow ld
/GS/gsave ld
/RC/setrgbcolor ld
/RM/rmoveto ld
/ML/setmiterlimit ld
/re {4 2 roll M
1 index 0 rlineto
0 exch rlineto
neg 0 rlineto
cp } bd
/_ctm matrix def
/_tm matrix def
/BT { _ctm currentmatrix pop matrix _tm copy pop 0 0 moveto } bd
/ET { _ctm setmatrix } bd
/iTm { _ctm setmatrix _tm concat } bd
/Tm { _tm astore pop iTm 0 0 moveto } bd
/ux 0.0 def
/uy 0.0 def
/F {
  /Tp exch def
  /Tf exch def
  Tf findfont Tp scalefont setfont
  /cf Tf def  /cs Tp def
} bd
/ULS {currentpoint /uy exch def /ux exch def} bd
/ULE {
  /Tcx currentpoint pop def
  gsave
  newpath
  cf findfont cs scalefont dup
  /FontMatrix get 0 get /Ts exch def /FontInfo get dup
  /UnderlinePosition get Ts mul /To exch def
  /UnderlineThickness get Ts mul /Tt exch def
  ux uy To add moveto  Tcx uy To add lineto
  Tt setlinewidth stroke
  grestore
} bd
/OLE {
  /Tcx currentpoint pop def
  gsave
  newpath
  cf findfont cs scalefont dup
  /FontMatrix get 0 get /Ts exch def /FontInfo get dup
  /UnderlinePosition get Ts mul /To exch def
  /UnderlineThickness get Ts mul /Tt exch def
  ux uy To add cs add moveto Tcx uy To add cs add lineto
  Tt setlinewidth stroke
  grestore
} bd
/SOE {
  /Tcx currentpoint pop def
  gsave
  newpath
  cf findfont cs scalefont dup
  /FontMatrix get 0 get /Ts exch def /FontInfo get dup
  /UnderlinePosition get Ts mul /To exch def
  /UnderlineThickness get Ts mul /Tt exch def
  ux uy To add cs 10 mul 26 idiv add moveto Tcx uy To add cs 10 mul 26 idiv add lineto
  Tt setlinewidth stroke
  grestore
} bd
/QT {
/Y22 exch store
/X22 exch store
/Y21 exch store
/X21 exch store
currentpoint
/Y21 load 2 mul add 3 div exch
/X21 load 2 mul add 3 div exch
/X21 load 2 mul /X22 load add 3 div
/Y21 load 2 mul /Y22 load add 3 div
/X22 load /Y22 load curveto
} bd
/SSPD {
dup length /d exch dict def
{
/v exch def
/k exch def
currentpagedevice k known {
/cpdv currentpagedevice k get def
v cpdv ne {
/upd false def
/nullv v type /nulltype eq def
/nullcpdv cpdv type /nulltype eq def
nullv nullcpdv or
{
/upd true def
} {
/sametype v type cpdv type eq def
sametype {
v type /arraytype eq {
/vlen v length def
/cpdvlen cpdv length def
vlen cpdvlen eq {
0 1 vlen 1 sub {
/i exch def
/obj v i get def
/cpdobj cpdv i get def
obj cpdobj ne {
/upd true def
exit
} if
} for
} {
/upd true def
} ifelse
} {
v type /dicttype eq {
v {
/dv exch def
/dk exch def
/cpddv cpdv dk get def
dv cpddv ne {
/upd true def
exit
} if
} forall
} {
/upd true def
} ifelse
} ifelse
} if
} ifelse
upd true eq {
d k v put
} if
} if
} if
} forall
d length 0 gt {
d setpagedevice
} if
} bd
%%EndResource
%%BeginResource: procset (Apache XML Graphics EPS ProcSet) 1.0 0
%%Version: 1.0 0
%%Copyright: (Copyright 2002-2003 The Apache Software Foundation. License terms: http://www.apache.org/licenses/LICENSE-2.0)
/BeginEPSF { %def
/b4_Inc_state save def         % Save state for cleanup
/dict_count countdictstack def % Count objects on dict stack
/op_count count 1 sub def      % Count objects on operand stack
userdict begin                 % Push userdict on dict stack
/showpage { } def              % Redefine showpage, { } = null proc
0 setgray 0 setlinecap         % Prepare graphics state
1 setlinewidth 0 setlinejoin
10 setmiterlimit [ ] 0 setdash newpath
/languagelevel where           % If level not equal to 1 then
{pop languagelevel             % set strokeadjust and
1 ne                           % overprint to their defaults.
{false setstrokeadjust false setoverprint
} if
} if
} bd
/EndEPSF { %def
count op_count sub {pop} repeat            % Clean up stacks
countdictstack dict_count sub {end} repeat
b4_Inc_state restore
} bd
%%EndResource
%FOPBeginFontDict
%%IncludeResource: font Courier-Bold
%%IncludeResource: font Helvetica
%%IncludeResource: font Courier-BoldOblique
%%IncludeResource: font Courier-Oblique
%%IncludeResource: font Times-Roman
%%IncludeResource: font Helvetica-BoldOblique
%%IncludeResource: font Helvetica-Bold
%%IncludeResource: font Helvetica-Oblique
%%IncludeResource: font Times-BoldItalic
%%IncludeResource: font Courier
%%IncludeResource: font Times-Italic
%%IncludeResource: font Times-Bold
%%IncludeResource: font Symbol
%%IncludeResource: font ZapfDingbats
%FOPEndFontDict
%%BeginResource: encoding WinAnsiEncoding
/WinAnsiEncoding [
/.notdef /.notdef /.notdef /.notdef /.notdef
/.notdef /.notdef /.notdef /.notdef /.notdef
/.notdef /.notdef /.notdef /.notdef /.notdef
/.notdef /.notdef /.notdef /.notdef /.notdef
/.notdef /.notdef /.notdef /.notdef /.notdef
/.notdef /.notdef /.notdef /.notdef /.notdef
/.notdef /.notdef /space /exclam /quotedbl
/numbersign /dollar /percent /ampersand /quotesingle
/parenleft /parenright /asterisk /plus /comma
/hyphen /period /slash /zero /one
/two /three /four /five /six
/seven /eight /nine /colon /semicolon
/less /equal /greater /question /at
/A /B /C /D /E
/F /G /H /I /J
/K /L /M /N /O
/P /Q /R /S /T
/U /V /W /X /Y
/Z /bracketleft /backslash /bracketright /asciicircum
/underscore /quoteleft /a /b /c
/d /e /f /g /h
/i /j /k /l /m
/n /o /p /q /r
/s /t /u /v /w
/x /y /z /braceleft /bar
/braceright /asciitilde /bullet /Euro /bullet
/quotesinglbase /florin /quotedblbase /ellipsis /dagger
/daggerdbl /circumflex /perthousand /Scaron /guilsinglleft
/OE /bullet /Zcaron /bullet /bullet
/quoteleft /quoteright /quotedblleft /quotedblright /bullet
/endash /emdash /asciitilde /trademark /scaron
/guilsinglright /oe /bullet /zcaron /Ydieresis
/space /exclamdown /cent /sterling /currency
/yen /brokenbar /section /dieresis /copyright
/ordfeminine /guillemotleft /logicalnot /sfthyphen /registered
/macron /degree /plusminus /twosuperior /threesuperior
/acute /mu /paragraph /middot /cedilla
/onesuperior /ordmasculine /guillemotright /onequarter /onehalf
/threequarters /questiondown /Agrave /Aacute /Acircumflex
/Atilde /Adieresis /Aring /AE /Ccedilla
/Egrave /Eacute /Ecircumflex /Edieresis /Igrave
/Iacute /Icircumflex /Idieresis /Eth /Ntilde
/Ograve /Oacute /Ocircumflex /Otilde /Odieresis
/multiply /Oslash /Ugrave /Uacute /Ucircumflex
/Udieresis /Yacute /Thorn /germandbls /agrave
/aacute /acircumflex /atilde /adieresis /aring
/ae /ccedilla /egrave /eacute /ecircumflex
/edieresis /igrave /iacute /icircumflex /idieresis
/eth /ntilde /ograve /oacute /ocircumflex
/otilde /odieresis /divide /oslash /ugrave
/uacute /ucircumflex /udieresis /yacute /thorn
/ydieresis
] def
%%EndResource
%FOPBeginFontReencode
/Courier-Bold findfont
dup length dict begin
  {1 index /FID ne {def} {pop pop} ifelse} forall
  /Encoding WinAnsiEncoding def
  currentdict
end
/Courier-Bold exch definefont pop
/Helvetica findfont
dup length dict begin
  {1 index /FID ne {def} {pop pop} ifelse} forall
  /Encoding WinAnsiEncoding def
  currentdict
end
/Helvetica exch definefont pop
/Courier-BoldOblique findfont
dup length dict begin
  {1 index /FID ne {def} {pop pop} ifelse} forall
  /Encoding WinAnsiEncoding def
  currentdict
end
/Courier-BoldOblique exch definefont pop
/Courier-Oblique findfont
dup length dict begin
  {1 index /FID ne {def} {pop pop} ifelse} forall
  /Encoding WinAnsiEncoding def
  currentdict
end
/Courier-Oblique exch definefont pop
/Times-Roman findfont
dup length dict begin
  {1 index /FID ne {def} {pop pop} ifelse} forall
  /Encoding WinAnsiEncoding def
  currentdict
end
/Times-Roman exch definefont pop
/Helvetica-BoldOblique findfont
dup length dict begin
  {1 index /FID ne {def} {pop pop} ifelse} forall
  /Encoding WinAnsiEncoding def
  currentdict
end
/Helvetica-BoldOblique exch definefont pop
/Helvetica-Bold findfont
dup length dict begin
  {1 index /FID ne {def} {pop pop} ifelse} forall
  /Encoding WinAnsiEncoding def
  currentdict
end
/Helvetica-Bold exch definefont pop
/Helvetica-Oblique findfont
dup length dict begin
  {1 index /FID ne {def} {pop pop} ifelse} forall
  /Encoding WinAnsiEncoding def
  currentdict
end
/Helvetica-Oblique exch definefont pop
/Times-BoldItalic findfont
dup length dict begin
  {1 index /FID ne {def} {pop pop} ifelse} forall
  /Encoding WinAnsiEncoding def
  currentdict
end
/Times-BoldItalic exch definefont pop
/Courier findfont
dup length dict begin
  {1 index /FID ne {def} {pop pop} ifelse} forall
  /Encoding WinAnsiEncoding def
  currentdict
end
/Courier exch definefont pop
/Times-Italic findfont
dup length dict begin
  {1 index /FID ne {def} {pop pop} ifelse} forall
  /Encoding WinAnsiEncoding def
  currentdict
end
/Times-Italic exch definefont pop
/Times-Bold findfont
dup length dict begin
  {1 index /FID ne {def} {pop pop} ifelse} forall
  /Encoding WinAnsiEncoding def
  currentdict
end
/Times-Bold exch definefont pop
%FOPEndFontReencode
%%EndProlog
%%Page: 1 1
%%PageBoundingBox: 0 0 797 502
%%BeginPageSetup
[1 0 0 -1 0 502] CT
%%EndPageSetup
GS
[0.75 0 0 0.75 0 0.25] CT
N
0 0 M
1062 0 L
1062 669 L
0 669 L
0 0 L
cp
clip
1 GC
N
0 0 1062 669 re
f
GR
GS
[0.75 0 0 0.75 0 0.25] CT
1 GC
N
0 0 1062 669 re
f
GR
GS
[0.75 0 0 0.75 0 0.25] CT
1 GC
N
365 50.5 M
138 50.5 L
138 277.5 L
365 277.5 L
cp
f
GR
GS
[0.75 0 0 0.75 188.62508 226.12499] CT
0.149 GC
/Helvetica-Bold 16 F
GS
[1 0 0 1 0 0] CT
-17.5 17 moveto 
1 -1 scale
(Alvo) t 
GR
GR
GS
[0.75 0 0 0.75 0 0.25] CT
0.149 GC
2 setlinecap
10.0 ML
N
138 277.5 M
365 277.5 L
S
GR
GS
[0.75 0 0 0.75 0 0.25] CT
0.149 GC
2 setlinecap
10.0 ML
N
138 50.5 M
365 50.5 L
S
GR
GS
[0.75 0 0 0.75 0 0.25] CT
0.149 GC
2 setlinecap
10.0 ML
N
175.833 277.5 M
175.833 277.5 L
S
GR
GS
[0.75 0 0 0.75 0 0.25] CT
0.149 GC
2 setlinecap
10.0 ML
N
251.5 277.5 M
251.5 277.5 L
S
GR
GS
[0.75 0 0 0.75 0 0.25] CT
0.149 GC
2 setlinecap
10.0 ML
N
327.167 277.5 M
327.167 277.5 L
S
GR
GS
[0.75 0 0 0.75 0 0.25] CT
0.149 GC
2 setlinecap
10.0 ML
N
175.833 50.5 M
175.833 50.5 L
S
GR
GS
[0.75 0 0 0.75 0 0.25] CT
0.149 GC
2 setlinecap
10.0 ML
N
251.5 50.5 M
251.5 50.5 L
S
GR
GS
[0.75 0 0 0.75 0 0.25] CT
0.149 GC
2 setlinecap
10.0 ML
N
327.167 50.5 M
327.167 50.5 L
S
GR
GS
[0.75 0 0 0.75 131.875 212.37501] CT
0.149 GC
/Helvetica 13 F
GS
[1 0 0 1 0 0] CT
-4 14 moveto 
1 -1 scale
(0) t 
GR
GR
GS
[0.75 0 0 0.75 188.625 212.37501] CT
0.149 GC
/Helvetica 13 F
GS
[1 0 0 1 0 0] CT
-4 14 moveto 
1 -1 scale
(1) t 
GR
GR
GS
[0 -0.75 0.75 0 90.5 123.24992] CT
0.149 GC
/Helvetica-Bold 16 F
GS
[1 0 0 1 0 0] CT
-21.5 -4 moveto 
1 -1 scale
(Sa\355da) t 
GR
GR
GS
[0.75 0 0 0.75 0 0.25] CT
0.149 GC
2 setlinecap
10.0 ML
N
138 50.5 M
138 277.5 L
S
GR
GS
[0.75 0 0 0.75 0 0.25] CT
0.149 GC
2 setlinecap
10.0 ML
N
365 50.5 M
365 277.5 L
S
GR
GS
[0.75 0 0 0.75 0 0.25] CT
0.149 GC
2 setlinecap
10.0 ML
N
138 88.333 M
138 88.333 L
S
GR
GS
[0.75 0 0 0.75 0 0.25] CT
0.149 GC
2 setlinecap
10.0 ML
N
138 164 M
138 164 L
S
GR
GS
[0.75 0 0 0.75 0 0.25] CT
0.149 GC
2 setlinecap
10.0 ML
N
138 239.667 M
138 239.667 L
S
GR
GS
[0.75 0 0 0.75 0 0.25] CT
0.149 GC
2 setlinecap
10.0 ML
N
365 88.333 M
365 88.333 L
S
GR
GS
[0.75 0 0 0.75 0 0.25] CT
0.149 GC
2 setlinecap
10.0 ML
N
365 164 M
365 164 L
S
GR
GS
[0.75 0 0 0.75 0 0.25] CT
0.149 GC
2 setlinecap
10.0 ML
N
365 239.667 M
365 239.667 L
S
GR
GS
[0.75 0 0 0.75 99.5 66.5] CT
0.149 GC
/Helvetica 13 F
GS
[1 0 0 1 0 0] CT
-8 5.5 moveto 
1 -1 scale
(0) t 
GR
GR
GS
[0.75 0 0 0.75 99.5 123.25] CT
0.149 GC
/Helvetica 13 F
GS
[1 0 0 1 0 0] CT
-8 5.5 moveto 
1 -1 scale
(1) t 
GR
GR
GS
[0.75 0 0 0.75 0 0.25] CT
0.471 0.902 0.706 RC
N
138 50.5 M
213.667 50.5 L
213.667 126.167 L
cp
f
GR
GS
[0.75 0 0 0.75 0 0.25] CT
0.471 0.902 0.706 RC
N
138 50.5 M
213.667 126.167 L
138 126.167 L
cp
f
GR
GS
[0.75 0 0 0.75 0 0.25] CT
2 setlinecap
10.0 ML
N
138 50.5 M
213.667 50.5 L
213.667 126.167 L
138 126.167 L
138 50.5 L
S
GR
GS
[0.75 0 0 0.75 131.875 66.5] CT
/Helvetica-Bold 13 F
GS
[1 0 0 1 0 0] CT
-11 -3 moveto 
1 -1 scale
(399) t 
GR
GR
GS
[0.75 0 0 0.75 131.875 66.5] CT
/Helvetica 13 F
GS
[1 0 0 1 0 0] CT
-18.5 14 moveto 
1 -1 scale
(28.5%) t 
GR
GR
GS
[0.75 0 0 0.75 0 0.25] CT
0.902 0.549 0.549 RC
N
138 126.167 M
213.667 126.167 L
213.667 201.833 L
cp
f
GR
GS
[0.75 0 0 0.75 0 0.25] CT
0.902 0.549 0.549 RC
N
138 126.167 M
213.667 201.833 L
138 201.833 L
cp
f
GR
GS
[0.75 0 0 0.75 0 0.25] CT
2 setlinecap
10.0 ML
N
138 126.167 M
213.667 126.167 L
213.667 201.833 L
138 201.833 L
138 126.167 L
S
GR
GS
[0.75 0 0 0.75 131.875 123.25] CT
/Helvetica-Bold 13 F
GS
[1 0 0 1 0 0] CT
-4 -3 moveto 
1 -1 scale
(1) t 
GR
GR
GS
[0.75 0 0 0.75 131.875 123.25] CT
/Helvetica 13 F
GS
[1 0 0 1 0 0] CT
-15 14 moveto 
1 -1 scale
(0.1%) t 
GR
GR
GS
[0.75 0 0 0.75 0 0.25] CT
0.502 GC
N
138 201.833 M
213.667 201.833 L
213.667 277.5 L
cp
f
GR
GS
[0.75 0 0 0.75 0 0.25] CT
0.502 GC
N
138 201.833 M
213.667 277.5 L
138 277.5 L
cp
f
GR
GS
[0.75 0 0 0.75 0 0.25] CT
2 setlinecap
10.0 ML
N
138 201.833 M
213.667 201.833 L
213.667 277.5 L
138 277.5 L
138 201.833 L
S
GR
GS
[0.75 0 0 0.75 131.875 180] CT
0 0.4 0 RC
/Helvetica 13 F
GS
[1 0 0 1 0 0] CT
-18.5 -3 moveto 
1 -1 scale
(99.8%) t 
GR
GR
GS
[0.75 0 0 0.75 131.875 180] CT
0.4 0 0 RC
/Helvetica 13 F
GS
[1 0 0 1 0 0] CT
-15 14 moveto 
1 -1 scale
(0.2%) t 
GR
GR
GS
[0.75 0 0 0.75 0 0.25] CT
0.902 0.549 0.549 RC
N
213.667 50.5 M
289.333 50.5 L
289.333 126.167 L
cp
f
GR
GS
[0.75 0 0 0.75 0 0.25] CT
0.902 0.549 0.549 RC
N
213.667 50.5 M
289.333 126.167 L
213.667 126.167 L
cp
f
GR
GS
[0.75 0 0 0.75 0 0.25] CT
2 setlinecap
10.0 ML
N
213.667 50.5 M
289.333 50.5 L
289.333 126.167 L
213.667 126.167 L
213.667 50.5 L
S
GR
GS
[0.75 0 0 0.75 188.625 66.5] CT
/Helvetica-Bold 13 F
GS
[1 0 0 1 0 0] CT
-11 -3 moveto 
1 -1 scale
(267) t 
GR
GR
GS
[0.75 0 0 0.75 188.625 66.5] CT
/Helvetica 13 F
GS
[1 0 0 1 0 0] CT
-18.5 14 moveto 
1 -1 scale
(19.1%) t 
GR
GR
GS
[0.75 0 0 0.75 0 0.25] CT
0.471 0.902 0.706 RC
N
213.667 126.167 M
289.333 126.167 L
289.333 201.833 L
cp
f
GR
GS
[0.75 0 0 0.75 0 0.25] CT
0.471 0.902 0.706 RC
N
213.667 126.167 M
289.333 201.833 L
213.667 201.833 L
cp
f
GR
GS
[0.75 0 0 0.75 0 0.25] CT
2 setlinecap
10.0 ML
N
213.667 126.167 M
289.333 126.167 L
289.333 201.833 L
213.667 201.833 L
213.667 126.167 L
S
GR
GS
[0.75 0 0 0.75 188.625 123.25] CT
/Helvetica-Bold 13 F
GS
[1 0 0 1 0 0] CT
-11 -3 moveto 
1 -1 scale
(733) t 
GR
GR
GS
[0.75 0 0 0.75 188.625 123.25] CT
/Helvetica 13 F
GS
[1 0 0 1 0 0] CT
-18.5 14 moveto 
1 -1 scale
(52.4%) t 
GR
GR
GS
[0.75 0 0 0.75 0 0.25] CT
0.502 GC
N
213.667 201.833 M
289.333 201.833 L
289.333 277.5 L
cp
f
GR
GS
[0.75 0 0 0.75 0 0.25] CT
0.502 GC
N
213.667 201.833 M
289.333 277.5 L
213.667 277.5 L
cp
f
GR
GS
[0.75 0 0 0.75 0 0.25] CT
2 setlinecap
10.0 ML
N
213.667 201.833 M
289.333 201.833 L
289.333 277.5 L
213.667 277.5 L
213.667 201.833 L
S
GR
GS
[0.75 0 0 0.75 188.625 180] CT
0 0.4 0 RC
/Helvetica 13 F
GS
[1 0 0 1 0 0] CT
-18.5 -3 moveto 
1 -1 scale
(73.3%) t 
GR
GR
GS
[0.75 0 0 0.75 188.625 180] CT
0.4 0 0 RC
/Helvetica 13 F
GS
[1 0 0 1 0 0] CT
-18.5 14 moveto 
1 -1 scale
(26.7%) t 
GR
GR
GS
[0.75 0 0 0.75 0 0.25] CT
0.502 GC
N
289.333 50.5 M
365 50.5 L
365 126.167 L
cp
f
GR
GS
[0.75 0 0 0.75 0 0.25] CT
0.502 GC
N
289.333 50.5 M
365 126.167 L
289.333 126.167 L
cp
f
GR
GS
[0.75 0 0 0.75 0 0.25] CT
2 setlinecap
10.0 ML
N
289.333 50.5 M
365 50.5 L
365 126.167 L
289.333 126.167 L
289.333 50.5 L
S
GR
GS
[0.75 0 0 0.75 245.37499 66.5] CT
0 0.4 0 RC
/Helvetica 13 F
GS
[1 0 0 1 0 0] CT
-18.5 -3 moveto 
1 -1 scale
(59.9%) t 
GR
GR
GS
[0.75 0 0 0.75 245.37499 66.5] CT
0.4 0 0 RC
/Helvetica 13 F
GS
[1 0 0 1 0 0] CT
-18.5 14 moveto 
1 -1 scale
(40.1%) t 
GR
GR
GS
[0.75 0 0 0.75 0 0.25] CT
0.502 GC
N
289.333 126.167 M
365 126.167 L
365 201.833 L
cp
f
GR
GS
[0.75 0 0 0.75 0 0.25] CT
0.502 GC
N
289.333 126.167 M
365 201.833 L
289.333 201.833 L
cp
f
GR
GS
[0.75 0 0 0.75 0 0.25] CT
2 setlinecap
10.0 ML
N
289.333 126.167 M
365 126.167 L
365 201.833 L
289.333 201.833 L
289.333 126.167 L
S
GR
GS
[0.75 0 0 0.75 245.37499 123.25] CT
0 0.4 0 RC
/Helvetica 13 F
GS
[1 0 0 1 0 0] CT
-18.5 -3 moveto 
1 -1 scale
(99.9%) t 
GR
GR
GS
[0.75 0 0 0.75 245.37499 123.25] CT
0.4 0 0 RC
/Helvetica 13 F
GS
[1 0 0 1 0 0] CT
-15 14 moveto 
1 -1 scale
(0.1%) t 
GR
GR
GS
[0.75 0 0 0.75 0 0.25] CT
0.471 0.588 0.902 RC
N
289.333 201.833 M
365 201.833 L
365 277.5 L
cp
f
GR
GS
[0.75 0 0 0.75 0 0.25] CT
0.471 0.588 0.902 RC
N
289.333 201.833 M
365 277.5 L
289.333 277.5 L
cp
f
GR
GS
[0.75 0 0 0.75 0 0.25] CT
2 setlinecap
10.0 ML
N
289.333 201.833 M
365 201.833 L
365 277.5 L
289.333 277.5 L
289.333 201.833 L
S
GR
GS
[0.75 0 0 0.75 245.37499 180] CT
0 0.4 0 RC
/Helvetica-Bold 13 F
GS
[1 0 0 1 0 0] CT
-18.5 -3 moveto 
1 -1 scale
(80.9%) t 
GR
GR
GS
[0.75 0 0 0.75 245.37499 180] CT
0.4 0 0 RC
/Helvetica-Bold 13 F
GS
[1 0 0 1 0 0] CT
-18.5 14 moveto 
1 -1 scale
(19.1%) t 
GR
GR
GS
[0.75 0 0 0.75 0 0.25] CT
0.251 GC
2 setlinecap
10.0 ML
2.667 LW
N
289.333 50.5 M
289.333 277.5 L
S
GR
GS
[0.75 0 0 0.75 0 0.25] CT
0.251 GC
2 setlinecap
10.0 ML
2.667 LW
N
138 201.833 M
365 201.833 L
S
GR
GS
[0.75 0 0 0.75 188.62517 35.875] CT
/Helvetica-Bold 16 F
GS
[1 0 0 1 0 0] CT
-109.5 -4 moveto 
1 -1 scale
(Matriz de Confus\343o \(M\355nimo\)) t 
GR
GR
GS
[0.75 0 0 0.75 0 0.25] CT
1 GC
N
663 50.5 M
436 50.5 L
436 277.5 L
663 277.5 L
cp
f
GR
GS
[0.75 0 0 0.75 412.12509 226.12499] CT
0.149 GC
/Helvetica-Bold 16 F
GS
[1 0 0 1 0 0] CT
-17.5 17 moveto 
1 -1 scale
(Alvo) t 
GR
GR
GS
[0.75 0 0 0.75 0 0.25] CT
0.149 GC
2 setlinecap
10.0 ML
N
436 277.5 M
663 277.5 L
S
GR
GS
[0.75 0 0 0.75 0 0.25] CT
0.149 GC
2 setlinecap
10.0 ML
N
436 50.5 M
663 50.5 L
S
GR
GS
[0.75 0 0 0.75 0 0.25] CT
0.149 GC
2 setlinecap
10.0 ML
N
473.833 277.5 M
473.833 277.5 L
S
GR
GS
[0.75 0 0 0.75 0 0.25] CT
0.149 GC
2 setlinecap
10.0 ML
N
549.5 277.5 M
549.5 277.5 L
S
GR
GS
[0.75 0 0 0.75 0 0.25] CT
0.149 GC
2 setlinecap
10.0 ML
N
625.167 277.5 M
625.167 277.5 L
S
GR
GS
[0.75 0 0 0.75 0 0.25] CT
0.149 GC
2 setlinecap
10.0 ML
N
473.833 50.5 M
473.833 50.5 L
S
GR
GS
[0.75 0 0 0.75 0 0.25] CT
0.149 GC
2 setlinecap
10.0 ML
N
549.5 50.5 M
549.5 50.5 L
S
GR
GS
[0.75 0 0 0.75 0 0.25] CT
0.149 GC
2 setlinecap
10.0 ML
N
625.167 50.5 M
625.167 50.5 L
S
GR
GS
[0.75 0 0 0.75 355.37501 212.37501] CT
0.149 GC
/Helvetica 13 F
GS
[1 0 0 1 0 0] CT
-4 14 moveto 
1 -1 scale
(0) t 
GR
GR
GS
[0.75 0 0 0.75 412.125 212.37501] CT
0.149 GC
/Helvetica 13 F
GS
[1 0 0 1 0 0] CT
-4 14 moveto 
1 -1 scale
(1) t 
GR
GR
GS
[0 -0.75 0.75 0 313.99999 123.24992] CT
0.149 GC
/Helvetica-Bold 16 F
GS
[1 0 0 1 0 0] CT
-21.5 -4 moveto 
1 -1 scale
(Sa\355da) t 
GR
GR
GS
[0.75 0 0 0.75 0 0.25] CT
0.149 GC
2 setlinecap
10.0 ML
N
436 50.5 M
436 277.5 L
S
GR
GS
[0.75 0 0 0.75 0 0.25] CT
0.149 GC
2 setlinecap
10.0 ML
N
663 50.5 M
663 277.5 L
S
GR
GS
[0.75 0 0 0.75 0 0.25] CT
0.149 GC
2 setlinecap
10.0 ML
N
436 88.333 M
436 88.333 L
S
GR
GS
[0.75 0 0 0.75 0 0.25] CT
0.149 GC
2 setlinecap
10.0 ML
N
436 164 M
436 164 L
S
GR
GS
[0.75 0 0 0.75 0 0.25] CT
0.149 GC
2 setlinecap
10.0 ML
N
436 239.667 M
436 239.667 L
S
GR
GS
[0.75 0 0 0.75 0 0.25] CT
0.149 GC
2 setlinecap
10.0 ML
N
663 88.333 M
663 88.333 L
S
GR
GS
[0.75 0 0 0.75 0 0.25] CT
0.149 GC
2 setlinecap
10.0 ML
N
663 164 M
663 164 L
S
GR
GS
[0.75 0 0 0.75 0 0.25] CT
0.149 GC
2 setlinecap
10.0 ML
N
663 239.667 M
663 239.667 L
S
GR
GS
[0.75 0 0 0.75 322.99999 66.5] CT
0.149 GC
/Helvetica 13 F
GS
[1 0 0 1 0 0] CT
-8 5.5 moveto 
1 -1 scale
(0) t 
GR
GR
GS
[0.75 0 0 0.75 322.99999 123.25] CT
0.149 GC
/Helvetica 13 F
GS
[1 0 0 1 0 0] CT
-8 5.5 moveto 
1 -1 scale
(1) t 
GR
GR
GS
[0.75 0 0 0.75 0 0.25] CT
0.471 0.902 0.706 RC
N
436 50.5 M
511.667 50.5 L
511.667 126.167 L
cp
f
GR
GS
[0.75 0 0 0.75 0 0.25] CT
0.471 0.902 0.706 RC
N
436 50.5 M
511.667 126.167 L
436 126.167 L
cp
f
GR
GS
[0.75 0 0 0.75 0 0.25] CT
2 setlinecap
10.0 ML
N
436 50.5 M
511.667 50.5 L
511.667 126.167 L
436 126.167 L
436 50.5 L
S
GR
GS
[0.75 0 0 0.75 355.37501 66.5] CT
/Helvetica-Bold 13 F
GS
[1 0 0 1 0 0] CT
-11 -3 moveto 
1 -1 scale
(714) t 
GR
GR
GS
[0.75 0 0 0.75 355.37501 66.5] CT
/Helvetica 13 F
GS
[1 0 0 1 0 0] CT
-18.5 14 moveto 
1 -1 scale
(51.0%) t 
GR
GR
GS
[0.75 0 0 0.75 0 0.25] CT
0.902 0.549 0.549 RC
N
436 126.167 M
511.667 126.167 L
511.667 201.833 L
cp
f
GR
GS
[0.75 0 0 0.75 0 0.25] CT
0.902 0.549 0.549 RC
N
436 126.167 M
511.667 201.833 L
436 201.833 L
cp
f
GR
GS
[0.75 0 0 0.75 0 0.25] CT
2 setlinecap
10.0 ML
N
436 126.167 M
511.667 126.167 L
511.667 201.833 L
436 201.833 L
436 126.167 L
S
GR
GS
[0.75 0 0 0.75 355.37501 123.25] CT
/Helvetica-Bold 13 F
GS
[1 0 0 1 0 0] CT
-7.5 -3 moveto 
1 -1 scale
(86) t 
GR
GR
GS
[0.75 0 0 0.75 355.37501 123.25] CT
/Helvetica 13 F
GS
[1 0 0 1 0 0] CT
-15 14 moveto 
1 -1 scale
(6.1%) t 
GR
GR
GS
[0.75 0 0 0.75 0 0.25] CT
0.502 GC
N
436 201.833 M
511.667 201.833 L
511.667 277.5 L
cp
f
GR
GS
[0.75 0 0 0.75 0 0.25] CT
0.502 GC
N
436 201.833 M
511.667 277.5 L
436 277.5 L
cp
f
GR
GS
[0.75 0 0 0.75 0 0.25] CT
2 setlinecap
10.0 ML
N
436 201.833 M
511.667 201.833 L
511.667 277.5 L
436 277.5 L
436 201.833 L
S
GR
GS
[0.75 0 0 0.75 355.37501 180] CT
0 0.4 0 RC
/Helvetica 13 F
GS
[1 0 0 1 0 0] CT
-18.5 -3 moveto 
1 -1 scale
(89.3%) t 
GR
GR
GS
[0.75 0 0 0.75 355.37501 180] CT
0.4 0 0 RC
/Helvetica 13 F
GS
[1 0 0 1 0 0] CT
-18.5 14 moveto 
1 -1 scale
(10.8%) t 
GR
GR
GS
[0.75 0 0 0.75 0 0.25] CT
0.902 0.549 0.549 RC
N
511.667 50.5 M
587.333 50.5 L
587.333 126.167 L
cp
f
GR
GS
[0.75 0 0 0.75 0 0.25] CT
0.902 0.549 0.549 RC
N
511.667 50.5 M
587.333 126.167 L
511.667 126.167 L
cp
f
GR
GS
[0.75 0 0 0.75 0 0.25] CT
2 setlinecap
10.0 ML
N
511.667 50.5 M
587.333 50.5 L
587.333 126.167 L
511.667 126.167 L
511.667 50.5 L
S
GR
GS
[0.75 0 0 0.75 412.125 66.5] CT
/Helvetica-Bold 13 F
GS
[1 0 0 1 0 0] CT
-7.5 -3 moveto 
1 -1 scale
(53) t 
GR
GR
GS
[0.75 0 0 0.75 412.125 66.5] CT
/Helvetica 13 F
GS
[1 0 0 1 0 0] CT
-15 14 moveto 
1 -1 scale
(3.8%) t 
GR
GR
GS
[0.75 0 0 0.75 0 0.25] CT
0.471 0.902 0.706 RC
N
511.667 126.167 M
587.333 126.167 L
587.333 201.833 L
cp
f
GR
GS
[0.75 0 0 0.75 0 0.25] CT
0.471 0.902 0.706 RC
N
511.667 126.167 M
587.333 201.833 L
511.667 201.833 L
cp
f
GR
GS
[0.75 0 0 0.75 0 0.25] CT
2 setlinecap
10.0 ML
N
511.667 126.167 M
587.333 126.167 L
587.333 201.833 L
511.667 201.833 L
511.667 126.167 L
S
GR
GS
[0.75 0 0 0.75 412.125 123.25] CT
/Helvetica-Bold 13 F
GS
[1 0 0 1 0 0] CT
-11 -3 moveto 
1 -1 scale
(547) t 
GR
GR
GS
[0.75 0 0 0.75 412.125 123.25] CT
/Helvetica 13 F
GS
[1 0 0 1 0 0] CT
-18.5 14 moveto 
1 -1 scale
(39.1%) t 
GR
GR
GS
[0.75 0 0 0.75 0 0.25] CT
0.502 GC
N
511.667 201.833 M
587.333 201.833 L
587.333 277.5 L
cp
f
GR
GS
[0.75 0 0 0.75 0 0.25] CT
0.502 GC
N
511.667 201.833 M
587.333 277.5 L
511.667 277.5 L
cp
f
GR
GS
[0.75 0 0 0.75 0 0.25] CT
2 setlinecap
10.0 ML
N
511.667 201.833 M
587.333 201.833 L
587.333 277.5 L
511.667 277.5 L
511.667 201.833 L
S
GR
GS
[0.75 0 0 0.75 412.125 180] CT
0 0.4 0 RC
/Helvetica 13 F
GS
[1 0 0 1 0 0] CT
-18.5 -3 moveto 
1 -1 scale
(91.2%) t 
GR
GR
GS
[0.75 0 0 0.75 412.125 180] CT
0.4 0 0 RC
/Helvetica 13 F
GS
[1 0 0 1 0 0] CT
-15 14 moveto 
1 -1 scale
(8.8%) t 
GR
GR
GS
[0.75 0 0 0.75 0 0.25] CT
0.502 GC
N
587.333 50.5 M
663 50.5 L
663 126.167 L
cp
f
GR
GS
[0.75 0 0 0.75 0 0.25] CT
0.502 GC
N
587.333 50.5 M
663 126.167 L
587.333 126.167 L
cp
f
GR
GS
[0.75 0 0 0.75 0 0.25] CT
2 setlinecap
10.0 ML
N
587.333 50.5 M
663 50.5 L
663 126.167 L
587.333 126.167 L
587.333 50.5 L
S
GR
GS
[0.75 0 0 0.75 468.87502 66.5] CT
0 0.4 0 RC
/Helvetica 13 F
GS
[1 0 0 1 0 0] CT
-18.5 -3 moveto 
1 -1 scale
(93.1%) t 
GR
GR
GS
[0.75 0 0 0.75 468.87502 66.5] CT
0.4 0 0 RC
/Helvetica 13 F
GS
[1 0 0 1 0 0] CT
-15 14 moveto 
1 -1 scale
(6.9%) t 
GR
GR
GS
[0.75 0 0 0.75 0 0.25] CT
0.502 GC
N
587.333 126.167 M
663 126.167 L
663 201.833 L
cp
f
GR
GS
[0.75 0 0 0.75 0 0.25] CT
0.502 GC
N
587.333 126.167 M
663 201.833 L
587.333 201.833 L
cp
f
GR
GS
[0.75 0 0 0.75 0 0.25] CT
2 setlinecap
10.0 ML
N
587.333 126.167 M
663 126.167 L
663 201.833 L
587.333 201.833 L
587.333 126.167 L
S
GR
GS
[0.75 0 0 0.75 468.87502 123.25] CT
0 0.4 0 RC
/Helvetica 13 F
GS
[1 0 0 1 0 0] CT
-18.5 -3 moveto 
1 -1 scale
(86.4%) t 
GR
GR
GS
[0.75 0 0 0.75 468.87502 123.25] CT
0.4 0 0 RC
/Helvetica 13 F
GS
[1 0 0 1 0 0] CT
-18.5 14 moveto 
1 -1 scale
(13.6%) t 
GR
GR
GS
[0.75 0 0 0.75 0 0.25] CT
0.471 0.588 0.902 RC
N
587.333 201.833 M
663 201.833 L
663 277.5 L
cp
f
GR
GS
[0.75 0 0 0.75 0 0.25] CT
0.471 0.588 0.902 RC
N
587.333 201.833 M
663 277.5 L
587.333 277.5 L
cp
f
GR
GS
[0.75 0 0 0.75 0 0.25] CT
2 setlinecap
10.0 ML
N
587.333 201.833 M
663 201.833 L
663 277.5 L
587.333 277.5 L
587.333 201.833 L
S
GR
GS
[0.75 0 0 0.75 468.87502 180] CT
0 0.4 0 RC
/Helvetica-Bold 13 F
GS
[1 0 0 1 0 0] CT
-18.5 -3 moveto 
1 -1 scale
(90.1%) t 
GR
GR
GS
[0.75 0 0 0.75 468.87502 180] CT
0.4 0 0 RC
/Helvetica-Bold 13 F
GS
[1 0 0 1 0 0] CT
-15 14 moveto 
1 -1 scale
(9.9%) t 
GR
GR
GS
[0.75 0 0 0.75 0 0.25] CT
0.251 GC
2 setlinecap
10.0 ML
2.667 LW
N
587.333 50.5 M
587.333 277.5 L
S
GR
GS
[0.75 0 0 0.75 0 0.25] CT
0.251 GC
2 setlinecap
10.0 ML
2.667 LW
N
436 201.833 M
663 201.833 L
S
GR
GS
[0.75 0 0 0.75 412.8923 35.82432] CT
/Helvetica-Bold 16 F
GS
[1 0 0 1 0 0] CT
-106.5 -4 moveto 
1 -1 scale
(Matriz de Confus\343o \(Anelar\)) t 
GR
GR
GS
[0.75 0 0 0.75 0 0.25] CT
1 GC
N
961 50.5 M
734 50.5 L
734 277.5 L
961 277.5 L
cp
f
GR
GS
[0.75 0 0 0.75 635.62509 226.12499] CT
0.149 GC
/Helvetica-Bold 16 F
GS
[1 0 0 1 0 0] CT
-17.5 17 moveto 
1 -1 scale
(Alvo) t 
GR
GR
GS
[0.75 0 0 0.75 0 0.25] CT
0.149 GC
2 setlinecap
10.0 ML
N
734 277.5 M
961 277.5 L
S
GR
GS
[0.75 0 0 0.75 0 0.25] CT
0.149 GC
2 setlinecap
10.0 ML
N
734 50.5 M
961 50.5 L
S
GR
GS
[0.75 0 0 0.75 0 0.25] CT
0.149 GC
2 setlinecap
10.0 ML
N
771.833 277.5 M
771.833 277.5 L
S
GR
GS
[0.75 0 0 0.75 0 0.25] CT
0.149 GC
2 setlinecap
10.0 ML
N
847.5 277.5 M
847.5 277.5 L
S
GR
GS
[0.75 0 0 0.75 0 0.25] CT
0.149 GC
2 setlinecap
10.0 ML
N
923.167 277.5 M
923.167 277.5 L
S
GR
GS
[0.75 0 0 0.75 0 0.25] CT
0.149 GC
2 setlinecap
10.0 ML
N
771.833 50.5 M
771.833 50.5 L
S
GR
GS
[0.75 0 0 0.75 0 0.25] CT
0.149 GC
2 setlinecap
10.0 ML
N
847.5 50.5 M
847.5 50.5 L
S
GR
GS
[0.75 0 0 0.75 0 0.25] CT
0.149 GC
2 setlinecap
10.0 ML
N
923.167 50.5 M
923.167 50.5 L
S
GR
GS
[0.75 0 0 0.75 578.87498 212.37501] CT
0.149 GC
/Helvetica 13 F
GS
[1 0 0 1 0 0] CT
-4 14 moveto 
1 -1 scale
(0) t 
GR
GR
GS
[0.75 0 0 0.75 635.625 212.37501] CT
0.149 GC
/Helvetica 13 F
GS
[1 0 0 1 0 0] CT
-4 14 moveto 
1 -1 scale
(1) t 
GR
GR
GS
[0 -0.75 0.75 0 537.50002 123.24992] CT
0.149 GC
/Helvetica-Bold 16 F
GS
[1 0 0 1 0 0] CT
-21.5 -4 moveto 
1 -1 scale
(Sa\355da) t 
GR
GR
GS
[0.75 0 0 0.75 0 0.25] CT
0.149 GC
2 setlinecap
10.0 ML
N
734 50.5 M
734 277.5 L
S
GR
GS
[0.75 0 0 0.75 0 0.25] CT
0.149 GC
2 setlinecap
10.0 ML
N
961 50.5 M
961 277.5 L
S
GR
GS
[0.75 0 0 0.75 0 0.25] CT
0.149 GC
2 setlinecap
10.0 ML
N
734 88.333 M
734 88.333 L
S
GR
GS
[0.75 0 0 0.75 0 0.25] CT
0.149 GC
2 setlinecap
10.0 ML
N
734 164 M
734 164 L
S
GR
GS
[0.75 0 0 0.75 0 0.25] CT
0.149 GC
2 setlinecap
10.0 ML
N
734 239.667 M
734 239.667 L
S
GR
GS
[0.75 0 0 0.75 0 0.25] CT
0.149 GC
2 setlinecap
10.0 ML
N
961 88.333 M
961 88.333 L
S
GR
GS
[0.75 0 0 0.75 0 0.25] CT
0.149 GC
2 setlinecap
10.0 ML
N
961 164 M
961 164 L
S
GR
GS
[0.75 0 0 0.75 0 0.25] CT
0.149 GC
2 setlinecap
10.0 ML
N
961 239.667 M
961 239.667 L
S
GR
GS
[0.75 0 0 0.75 546.50002 66.5] CT
0.149 GC
/Helvetica 13 F
GS
[1 0 0 1 0 0] CT
-8 5.5 moveto 
1 -1 scale
(0) t 
GR
GR
GS
[0.75 0 0 0.75 546.50002 123.25] CT
0.149 GC
/Helvetica 13 F
GS
[1 0 0 1 0 0] CT
-8 5.5 moveto 
1 -1 scale
(1) t 
GR
GR
GS
[0.75 0 0 0.75 0 0.25] CT
0.471 0.902 0.706 RC
N
734 50.5 M
809.667 50.5 L
809.667 126.167 L
cp
f
GR
GS
[0.75 0 0 0.75 0 0.25] CT
0.471 0.902 0.706 RC
N
734 50.5 M
809.667 126.167 L
734 126.167 L
cp
f
GR
GS
[0.75 0 0 0.75 0 0.25] CT
2 setlinecap
10.0 ML
N
734 50.5 M
809.667 50.5 L
809.667 126.167 L
734 126.167 L
734 50.5 L
S
GR
GS
[0.75 0 0 0.75 578.87498 66.5] CT
/Helvetica-Bold 13 F
GS
[1 0 0 1 0 0] CT
-11 -3 moveto 
1 -1 scale
(549) t 
GR
GR
GS
[0.75 0 0 0.75 578.87498 66.5] CT
/Helvetica 13 F
GS
[1 0 0 1 0 0] CT
-18.5 14 moveto 
1 -1 scale
(39.2%) t 
GR
GR
GS
[0.75 0 0 0.75 0 0.25] CT
0.902 0.549 0.549 RC
N
734 126.167 M
809.667 126.167 L
809.667 201.833 L
cp
f
GR
GS
[0.75 0 0 0.75 0 0.25] CT
0.902 0.549 0.549 RC
N
734 126.167 M
809.667 201.833 L
734 201.833 L
cp
f
GR
GS
[0.75 0 0 0.75 0 0.25] CT
2 setlinecap
10.0 ML
N
734 126.167 M
809.667 126.167 L
809.667 201.833 L
734 201.833 L
734 126.167 L
S
GR
GS
[0.75 0 0 0.75 578.87498 123.25] CT
/Helvetica-Bold 13 F
GS
[1 0 0 1 0 0] CT
-7.5 -3 moveto 
1 -1 scale
(51) t 
GR
GR
GS
[0.75 0 0 0.75 578.87498 123.25] CT
/Helvetica 13 F
GS
[1 0 0 1 0 0] CT
-15 14 moveto 
1 -1 scale
(3.6%) t 
GR
GR
GS
[0.75 0 0 0.75 0 0.25] CT
0.502 GC
N
734 201.833 M
809.667 201.833 L
809.667 277.5 L
cp
f
GR
GS
[0.75 0 0 0.75 0 0.25] CT
0.502 GC
N
734 201.833 M
809.667 277.5 L
734 277.5 L
cp
f
GR
GS
[0.75 0 0 0.75 0 0.25] CT
2 setlinecap
10.0 ML
N
734 201.833 M
809.667 201.833 L
809.667 277.5 L
734 277.5 L
734 201.833 L
S
GR
GS
[0.75 0 0 0.75 578.87498 180] CT
0 0.4 0 RC
/Helvetica 13 F
GS
[1 0 0 1 0 0] CT
-18.5 -3 moveto 
1 -1 scale
(91.5%) t 
GR
GR
GS
[0.75 0 0 0.75 578.87498 180] CT
0.4 0 0 RC
/Helvetica 13 F
GS
[1 0 0 1 0 0] CT
-15 14 moveto 
1 -1 scale
(8.5%) t 
GR
GR
GS
[0.75 0 0 0.75 0 0.25] CT
0.902 0.549 0.549 RC
N
809.667 50.5 M
885.333 50.5 L
885.333 126.167 L
cp
f
GR
GS
[0.75 0 0 0.75 0 0.25] CT
0.902 0.549 0.549 RC
N
809.667 50.5 M
885.333 126.167 L
809.667 126.167 L
cp
f
GR
GS
[0.75 0 0 0.75 0 0.25] CT
2 setlinecap
10.0 ML
N
809.667 50.5 M
885.333 50.5 L
885.333 126.167 L
809.667 126.167 L
809.667 50.5 L
S
GR
GS
[0.75 0 0 0.75 635.625 66.5] CT
/Helvetica-Bold 13 F
GS
[1 0 0 1 0 0] CT
-11 -3 moveto 
1 -1 scale
(153) t 
GR
GR
GS
[0.75 0 0 0.75 635.625 66.5] CT
/Helvetica 13 F
GS
[1 0 0 1 0 0] CT
-18.5 14 moveto 
1 -1 scale
(10.9%) t 
GR
GR
GS
[0.75 0 0 0.75 0 0.25] CT
0.471 0.902 0.706 RC
N
809.667 126.167 M
885.333 126.167 L
885.333 201.833 L
cp
f
GR
GS
[0.75 0 0 0.75 0 0.25] CT
0.471 0.902 0.706 RC
N
809.667 126.167 M
885.333 201.833 L
809.667 201.833 L
cp
f
GR
GS
[0.75 0 0 0.75 0 0.25] CT
2 setlinecap
10.0 ML
N
809.667 126.167 M
885.333 126.167 L
885.333 201.833 L
809.667 201.833 L
809.667 126.167 L
S
GR
GS
[0.75 0 0 0.75 635.625 123.25] CT
/Helvetica-Bold 13 F
GS
[1 0 0 1 0 0] CT
-11 -3 moveto 
1 -1 scale
(647) t 
GR
GR
GS
[0.75 0 0 0.75 635.625 123.25] CT
/Helvetica 13 F
GS
[1 0 0 1 0 0] CT
-18.5 14 moveto 
1 -1 scale
(46.2%) t 
GR
GR
GS
[0.75 0 0 0.75 0 0.25] CT
0.502 GC
N
809.667 201.833 M
885.333 201.833 L
885.333 277.5 L
cp
f
GR
GS
[0.75 0 0 0.75 0 0.25] CT
0.502 GC
N
809.667 201.833 M
885.333 277.5 L
809.667 277.5 L
cp
f
GR
GS
[0.75 0 0 0.75 0 0.25] CT
2 setlinecap
10.0 ML
N
809.667 201.833 M
885.333 201.833 L
885.333 277.5 L
809.667 277.5 L
809.667 201.833 L
S
GR
GS
[0.75 0 0 0.75 635.625 180] CT
0 0.4 0 RC
/Helvetica 13 F
GS
[1 0 0 1 0 0] CT
-18.5 -3 moveto 
1 -1 scale
(80.9%) t 
GR
GR
GS
[0.75 0 0 0.75 635.625 180] CT
0.4 0 0 RC
/Helvetica 13 F
GS
[1 0 0 1 0 0] CT
-18.5 14 moveto 
1 -1 scale
(19.1%) t 
GR
GR
GS
[0.75 0 0 0.75 0 0.25] CT
0.502 GC
N
885.333 50.5 M
961 50.5 L
961 126.167 L
cp
f
GR
GS
[0.75 0 0 0.75 0 0.25] CT
0.502 GC
N
885.333 50.5 M
961 126.167 L
885.333 126.167 L
cp
f
GR
GS
[0.75 0 0 0.75 0 0.25] CT
2 setlinecap
10.0 ML
N
885.333 50.5 M
961 50.5 L
961 126.167 L
885.333 126.167 L
885.333 50.5 L
S
GR
GS
[0.75 0 0 0.75 692.37502 66.5] CT
0 0.4 0 RC
/Helvetica 13 F
GS
[1 0 0 1 0 0] CT
-18.5 -3 moveto 
1 -1 scale
(78.2%) t 
GR
GR
GS
[0.75 0 0 0.75 692.37502 66.5] CT
0.4 0 0 RC
/Helvetica 13 F
GS
[1 0 0 1 0 0] CT
-18.5 14 moveto 
1 -1 scale
(21.8%) t 
GR
GR
GS
[0.75 0 0 0.75 0 0.25] CT
0.502 GC
N
885.333 126.167 M
961 126.167 L
961 201.833 L
cp
f
GR
GS
[0.75 0 0 0.75 0 0.25] CT
0.502 GC
N
885.333 126.167 M
961 201.833 L
885.333 201.833 L
cp
f
GR
GS
[0.75 0 0 0.75 0 0.25] CT
2 setlinecap
10.0 ML
N
885.333 126.167 M
961 126.167 L
961 201.833 L
885.333 201.833 L
885.333 126.167 L
S
GR
GS
[0.75 0 0 0.75 692.37502 123.25] CT
0 0.4 0 RC
/Helvetica 13 F
GS
[1 0 0 1 0 0] CT
-18.5 -3 moveto 
1 -1 scale
(92.7%) t 
GR
GR
GS
[0.75 0 0 0.75 692.37502 123.25] CT
0.4 0 0 RC
/Helvetica 13 F
GS
[1 0 0 1 0 0] CT
-15 14 moveto 
1 -1 scale
(7.3%) t 
GR
GR
GS
[0.75 0 0 0.75 0 0.25] CT
0.471 0.588 0.902 RC
N
885.333 201.833 M
961 201.833 L
961 277.5 L
cp
f
GR
GS
[0.75 0 0 0.75 0 0.25] CT
0.471 0.588 0.902 RC
N
885.333 201.833 M
961 277.5 L
885.333 277.5 L
cp
f
GR
GS
[0.75 0 0 0.75 0 0.25] CT
2 setlinecap
10.0 ML
N
885.333 201.833 M
961 201.833 L
961 277.5 L
885.333 277.5 L
885.333 201.833 L
S
GR
GS
[0.75 0 0 0.75 692.37502 180] CT
0 0.4 0 RC
/Helvetica-Bold 13 F
GS
[1 0 0 1 0 0] CT
-18.5 -3 moveto 
1 -1 scale
(85.4%) t 
GR
GR
GS
[0.75 0 0 0.75 692.37502 180] CT
0.4 0 0 RC
/Helvetica-Bold 13 F
GS
[1 0 0 1 0 0] CT
-18.5 14 moveto 
1 -1 scale
(14.6%) t 
GR
GR
GS
[0.75 0 0 0.75 0 0.25] CT
0.251 GC
2 setlinecap
10.0 ML
2.667 LW
N
885.333 50.5 M
885.333 277.5 L
S
GR
GS
[0.75 0 0 0.75 0 0.25] CT
0.251 GC
2 setlinecap
10.0 ML
2.667 LW
N
734 201.833 M
961 201.833 L
S
GR
GS
[0.75 0 0 0.75 635.6256 35.875] CT
/Helvetica-Bold 16 F
GS
[1 0 0 1 0 0] CT
-104.5 -4 moveto 
1 -1 scale
(Matriz de Confus\343o \(M\351dio\)) t 
GR
GR
GS
[0.75 0 0 0.75 0 0.25] CT
1 GC
N
365 367.5 M
138 367.5 L
138 594.5 L
365 594.5 L
cp
f
GR
GS
[0.75 0 0 0.75 188.62508 463.87502] CT
0.149 GC
/Helvetica-Bold 16 F
GS
[1 0 0 1 0 0] CT
-17.5 17 moveto 
1 -1 scale
(Alvo) t 
GR
GR
GS
[0.75 0 0 0.75 0 0.25] CT
0.149 GC
2 setlinecap
10.0 ML
N
138 594.5 M
365 594.5 L
S
GR
GS
[0.75 0 0 0.75 0 0.25] CT
0.149 GC
2 setlinecap
10.0 ML
N
138 367.5 M
365 367.5 L
S
GR
GS
[0.75 0 0 0.75 0 0.25] CT
0.149 GC
2 setlinecap
10.0 ML
N
175.833 594.5 M
175.833 594.5 L
S
GR
GS
[0.75 0 0 0.75 0 0.25] CT
0.149 GC
2 setlinecap
10.0 ML
N
251.5 594.5 M
251.5 594.5 L
S
GR
GS
[0.75 0 0 0.75 0 0.25] CT
0.149 GC
2 setlinecap
10.0 ML
N
327.167 594.5 M
327.167 594.5 L
S
GR
GS
[0.75 0 0 0.75 0 0.25] CT
0.149 GC
2 setlinecap
10.0 ML
N
175.833 367.5 M
175.833 367.5 L
S
GR
GS
[0.75 0 0 0.75 0 0.25] CT
0.149 GC
2 setlinecap
10.0 ML
N
251.5 367.5 M
251.5 367.5 L
S
GR
GS
[0.75 0 0 0.75 0 0.25] CT
0.149 GC
2 setlinecap
10.0 ML
N
327.167 367.5 M
327.167 367.5 L
S
GR
GS
[0.75 0 0 0.75 131.875 450.12498] CT
0.149 GC
/Helvetica 13 F
GS
[1 0 0 1 0 0] CT
-4 14 moveto 
1 -1 scale
(0) t 
GR
GR
GS
[0.75 0 0 0.75 188.625 450.12498] CT
0.149 GC
/Helvetica 13 F
GS
[1 0 0 1 0 0] CT
-4 14 moveto 
1 -1 scale
(1) t 
GR
GR
GS
[0 -0.75 0.75 0 90.5 360.99991] CT
0.149 GC
/Helvetica-Bold 16 F
GS
[1 0 0 1 0 0] CT
-21.5 -4 moveto 
1 -1 scale
(Sa\355da) t 
GR
GR
GS
[0.75 0 0 0.75 0 0.25] CT
0.149 GC
2 setlinecap
10.0 ML
N
138 367.5 M
138 594.5 L
S
GR
GS
[0.75 0 0 0.75 0 0.25] CT
0.149 GC
2 setlinecap
10.0 ML
N
365 367.5 M
365 594.5 L
S
GR
GS
[0.75 0 0 0.75 0 0.25] CT
0.149 GC
2 setlinecap
10.0 ML
N
138 405.333 M
138 405.333 L
S
GR
GS
[0.75 0 0 0.75 0 0.25] CT
0.149 GC
2 setlinecap
10.0 ML
N
138 481 M
138 481 L
S
GR
GS
[0.75 0 0 0.75 0 0.25] CT
0.149 GC
2 setlinecap
10.0 ML
N
138 556.667 M
138 556.667 L
S
GR
GS
[0.75 0 0 0.75 0 0.25] CT
0.149 GC
2 setlinecap
10.0 ML
N
365 405.333 M
365 405.333 L
S
GR
GS
[0.75 0 0 0.75 0 0.25] CT
0.149 GC
2 setlinecap
10.0 ML
N
365 481 M
365 481 L
S
GR
GS
[0.75 0 0 0.75 0 0.25] CT
0.149 GC
2 setlinecap
10.0 ML
N
365 556.667 M
365 556.667 L
S
GR
GS
[0.75 0 0 0.75 99.5 304.25001] CT
0.149 GC
/Helvetica 13 F
GS
[1 0 0 1 0 0] CT
-8 5.5 moveto 
1 -1 scale
(0) t 
GR
GR
GS
[0.75 0 0 0.75 99.5 361] CT
0.149 GC
/Helvetica 13 F
GS
[1 0 0 1 0 0] CT
-8 5.5 moveto 
1 -1 scale
(1) t 
GR
GR
GS
[0.75 0 0 0.75 0 0.25] CT
0.471 0.902 0.706 RC
N
138 367.5 M
213.667 367.5 L
213.667 443.167 L
cp
f
GR
GS
[0.75 0 0 0.75 0 0.25] CT
0.471 0.902 0.706 RC
N
138 367.5 M
213.667 443.167 L
138 443.167 L
cp
f
GR
GS
[0.75 0 0 0.75 0 0.25] CT
2 setlinecap
10.0 ML
N
138 367.5 M
213.667 367.5 L
213.667 443.167 L
138 443.167 L
138 367.5 L
S
GR
GS
[0.75 0 0 0.75 131.875 304.25001] CT
/Helvetica-Bold 13 F
GS
[1 0 0 1 0 0] CT
-11 -3 moveto 
1 -1 scale
(189) t 
GR
GR
GS
[0.75 0 0 0.75 131.875 304.25001] CT
/Helvetica 13 F
GS
[1 0 0 1 0 0] CT
-18.5 14 moveto 
1 -1 scale
(13.5%) t 
GR
GR
GS
[0.75 0 0 0.75 0 0.25] CT
0.902 0.549 0.549 RC
N
138 443.167 M
213.667 443.167 L
213.667 518.833 L
cp
f
GR
GS
[0.75 0 0 0.75 0 0.25] CT
0.902 0.549 0.549 RC
N
138 443.167 M
213.667 518.833 L
138 518.833 L
cp
f
GR
GS
[0.75 0 0 0.75 0 0.25] CT
2 setlinecap
10.0 ML
N
138 443.167 M
213.667 443.167 L
213.667 518.833 L
138 518.833 L
138 443.167 L
S
GR
GS
[0.75 0 0 0.75 131.875 361] CT
/Helvetica-Bold 13 F
GS
[1 0 0 1 0 0] CT
-7.5 -3 moveto 
1 -1 scale
(11) t 
GR
GR
GS
[0.75 0 0 0.75 131.875 361] CT
/Helvetica 13 F
GS
[1 0 0 1 0 0] CT
-15 14 moveto 
1 -1 scale
(0.8%) t 
GR
GR
GS
[0.75 0 0 0.75 0 0.25] CT
0.502 GC
N
138 518.833 M
213.667 518.833 L
213.667 594.5 L
cp
f
GR
GS
[0.75 0 0 0.75 0 0.25] CT
0.502 GC
N
138 518.833 M
213.667 594.5 L
138 594.5 L
cp
f
GR
GS
[0.75 0 0 0.75 0 0.25] CT
2 setlinecap
10.0 ML
N
138 518.833 M
213.667 518.833 L
213.667 594.5 L
138 594.5 L
138 518.833 L
S
GR
GS
[0.75 0 0 0.75 131.875 417.75002] CT
0 0.4 0 RC
/Helvetica 13 F
GS
[1 0 0 1 0 0] CT
-18.5 -3 moveto 
1 -1 scale
(94.5%) t 
GR
GR
GS
[0.75 0 0 0.75 131.875 417.75002] CT
0.4 0 0 RC
/Helvetica 13 F
GS
[1 0 0 1 0 0] CT
-15 14 moveto 
1 -1 scale
(5.5%) t 
GR
GR
GS
[0.75 0 0 0.75 0 0.25] CT
0.902 0.549 0.549 RC
N
213.667 367.5 M
289.333 367.5 L
289.333 443.167 L
cp
f
GR
GS
[0.75 0 0 0.75 0 0.25] CT
0.902 0.549 0.549 RC
N
213.667 367.5 M
289.333 443.167 L
213.667 443.167 L
cp
f
GR
GS
[0.75 0 0 0.75 0 0.25] CT
2 setlinecap
10.0 ML
N
213.667 367.5 M
289.333 367.5 L
289.333 443.167 L
213.667 443.167 L
213.667 367.5 L
S
GR
GS
[0.75 0 0 0.75 188.625 304.25001] CT
/Helvetica-Bold 13 F
GS
[1 0 0 1 0 0] CT
-11 -3 moveto 
1 -1 scale
(189) t 
GR
GR
GS
[0.75 0 0 0.75 188.625 304.25001] CT
/Helvetica 13 F
GS
[1 0 0 1 0 0] CT
-18.5 14 moveto 
1 -1 scale
(13.5%) t 
GR
GR
GS
[0.75 0 0 0.75 0 0.25] CT
0.471 0.902 0.706 RC
N
213.667 443.167 M
289.333 443.167 L
289.333 518.833 L
cp
f
GR
GS
[0.75 0 0 0.75 0 0.25] CT
0.471 0.902 0.706 RC
N
213.667 443.167 M
289.333 518.833 L
213.667 518.833 L
cp
f
GR
GS
[0.75 0 0 0.75 0 0.25] CT
2 setlinecap
10.0 ML
N
213.667 443.167 M
289.333 443.167 L
289.333 518.833 L
213.667 518.833 L
213.667 443.167 L
S
GR
GS
[0.75 0 0 0.75 188.625 361] CT
/Helvetica-Bold 13 F
GS
[1 0 0 1 0 0] CT
-14.5 -3 moveto 
1 -1 scale
(1011) t 
GR
GR
GS
[0.75 0 0 0.75 188.625 361] CT
/Helvetica 13 F
GS
[1 0 0 1 0 0] CT
-18.5 14 moveto 
1 -1 scale
(72.2%) t 
GR
GR
GS
[0.75 0 0 0.75 0 0.25] CT
0.502 GC
N
213.667 518.833 M
289.333 518.833 L
289.333 594.5 L
cp
f
GR
GS
[0.75 0 0 0.75 0 0.25] CT
0.502 GC
N
213.667 518.833 M
289.333 594.5 L
213.667 594.5 L
cp
f
GR
GS
[0.75 0 0 0.75 0 0.25] CT
2 setlinecap
10.0 ML
N
213.667 518.833 M
289.333 518.833 L
289.333 594.5 L
213.667 594.5 L
213.667 518.833 L
S
GR
GS
[0.75 0 0 0.75 188.625 417.75002] CT
0 0.4 0 RC
/Helvetica 13 F
GS
[1 0 0 1 0 0] CT
-18.5 -3 moveto 
1 -1 scale
(84.3%) t 
GR
GR
GS
[0.75 0 0 0.75 188.625 417.75002] CT
0.4 0 0 RC
/Helvetica 13 F
GS
[1 0 0 1 0 0] CT
-18.5 14 moveto 
1 -1 scale
(15.7%) t 
GR
GR
GS
[0.75 0 0 0.75 0 0.25] CT
0.502 GC
N
289.333 367.5 M
365 367.5 L
365 443.167 L
cp
f
GR
GS
[0.75 0 0 0.75 0 0.25] CT
0.502 GC
N
289.333 367.5 M
365 443.167 L
289.333 443.167 L
cp
f
GR
GS
[0.75 0 0 0.75 0 0.25] CT
2 setlinecap
10.0 ML
N
289.333 367.5 M
365 367.5 L
365 443.167 L
289.333 443.167 L
289.333 367.5 L
S
GR
GS
[0.75 0 0 0.75 245.37499 304.25001] CT
0 0.4 0 RC
/Helvetica 13 F
GS
[1 0 0 1 0 0] CT
-18.5 -3 moveto 
1 -1 scale
(50.0%) t 
GR
GR
GS
[0.75 0 0 0.75 245.37499 304.25001] CT
0.4 0 0 RC
/Helvetica 13 F
GS
[1 0 0 1 0 0] CT
-18.5 14 moveto 
1 -1 scale
(50.0%) t 
GR
GR
GS
[0.75 0 0 0.75 0 0.25] CT
0.502 GC
N
289.333 443.167 M
365 443.167 L
365 518.833 L
cp
f
GR
GS
[0.75 0 0 0.75 0 0.25] CT
0.502 GC
N
289.333 443.167 M
365 518.833 L
289.333 518.833 L
cp
f
GR
GS
[0.75 0 0 0.75 0 0.25] CT
2 setlinecap
10.0 ML
N
289.333 443.167 M
365 443.167 L
365 518.833 L
289.333 518.833 L
289.333 443.167 L
S
GR
GS
[0.75 0 0 0.75 245.37499 361] CT
0 0.4 0 RC
/Helvetica 13 F
GS
[1 0 0 1 0 0] CT
-18.5 -3 moveto 
1 -1 scale
(98.9%) t 
GR
GR
GS
[0.75 0 0 0.75 245.37499 361] CT
0.4 0 0 RC
/Helvetica 13 F
GS
[1 0 0 1 0 0] CT
-15 14 moveto 
1 -1 scale
(1.1%) t 
GR
GR
GS
[0.75 0 0 0.75 0 0.25] CT
0.471 0.588 0.902 RC
N
289.333 518.833 M
365 518.833 L
365 594.5 L
cp
f
GR
GS
[0.75 0 0 0.75 0 0.25] CT
0.471 0.588 0.902 RC
N
289.333 518.833 M
365 594.5 L
289.333 594.5 L
cp
f
GR
GS
[0.75 0 0 0.75 0 0.25] CT
2 setlinecap
10.0 ML
N
289.333 518.833 M
365 518.833 L
365 594.5 L
289.333 594.5 L
289.333 518.833 L
S
GR
GS
[0.75 0 0 0.75 245.37499 417.75002] CT
0 0.4 0 RC
/Helvetica-Bold 13 F
GS
[1 0 0 1 0 0] CT
-18.5 -3 moveto 
1 -1 scale
(85.7%) t 
GR
GR
GS
[0.75 0 0 0.75 245.37499 417.75002] CT
0.4 0 0 RC
/Helvetica-Bold 13 F
GS
[1 0 0 1 0 0] CT
-18.5 14 moveto 
1 -1 scale
(14.3%) t 
GR
GR
GS
[0.75 0 0 0.75 0 0.25] CT
0.251 GC
2 setlinecap
10.0 ML
2.667 LW
N
289.333 367.5 M
289.333 594.5 L
S
GR
GS
[0.75 0 0 0.75 0 0.25] CT
0.251 GC
2 setlinecap
10.0 ML
2.667 LW
N
138 518.833 M
365 518.833 L
S
GR
GS
[0.75 0 0 0.75 188.62517 273.625] CT
/Helvetica-Bold 16 F
GS
[1 0 0 1 0 0] CT
-117.5 -4 moveto 
1 -1 scale
(Matriz de Confus\343o \(Indicador\)) t 
GR
GR
GS
[0.75 0 0 0.75 0 0.25] CT
1 GC
N
663 367.5 M
436 367.5 L
436 594.5 L
663 594.5 L
cp
f
GR
GS
[0.75 0 0 0.75 412.12509 463.87502] CT
0.149 GC
/Helvetica-Bold 16 F
GS
[1 0 0 1 0 0] CT
-17.5 17 moveto 
1 -1 scale
(Alvo) t 
GR
GR
GS
[0.75 0 0 0.75 0 0.25] CT
0.149 GC
2 setlinecap
10.0 ML
N
436 594.5 M
663 594.5 L
S
GR
GS
[0.75 0 0 0.75 0 0.25] CT
0.149 GC
2 setlinecap
10.0 ML
N
436 367.5 M
663 367.5 L
S
GR
GS
[0.75 0 0 0.75 0 0.25] CT
0.149 GC
2 setlinecap
10.0 ML
N
473.833 594.5 M
473.833 594.5 L
S
GR
GS
[0.75 0 0 0.75 0 0.25] CT
0.149 GC
2 setlinecap
10.0 ML
N
549.5 594.5 M
549.5 594.5 L
S
GR
GS
[0.75 0 0 0.75 0 0.25] CT
0.149 GC
2 setlinecap
10.0 ML
N
625.167 594.5 M
625.167 594.5 L
S
GR
GS
[0.75 0 0 0.75 0 0.25] CT
0.149 GC
2 setlinecap
10.0 ML
N
473.833 367.5 M
473.833 367.5 L
S
GR
GS
[0.75 0 0 0.75 0 0.25] CT
0.149 GC
2 setlinecap
10.0 ML
N
549.5 367.5 M
549.5 367.5 L
S
GR
GS
[0.75 0 0 0.75 0 0.25] CT
0.149 GC
2 setlinecap
10.0 ML
N
625.167 367.5 M
625.167 367.5 L
S
GR
GS
[0.75 0 0 0.75 355.37501 450.12498] CT
0.149 GC
/Helvetica 13 F
GS
[1 0 0 1 0 0] CT
-4 14 moveto 
1 -1 scale
(0) t 
GR
GR
GS
[0.75 0 0 0.75 412.125 450.12498] CT
0.149 GC
/Helvetica 13 F
GS
[1 0 0 1 0 0] CT
-4 14 moveto 
1 -1 scale
(1) t 
GR
GR
GS
[0 -0.75 0.75 0 313.99999 360.99991] CT
0.149 GC
/Helvetica-Bold 16 F
GS
[1 0 0 1 0 0] CT
-21.5 -4 moveto 
1 -1 scale
(Sa\355da) t 
GR
GR
GS
[0.75 0 0 0.75 0 0.25] CT
0.149 GC
2 setlinecap
10.0 ML
N
436 367.5 M
436 594.5 L
S
GR
GS
[0.75 0 0 0.75 0 0.25] CT
0.149 GC
2 setlinecap
10.0 ML
N
663 367.5 M
663 594.5 L
S
GR
GS
[0.75 0 0 0.75 0 0.25] CT
0.149 GC
2 setlinecap
10.0 ML
N
436 405.333 M
436 405.333 L
S
GR
GS
[0.75 0 0 0.75 0 0.25] CT
0.149 GC
2 setlinecap
10.0 ML
N
436 481 M
436 481 L
S
GR
GS
[0.75 0 0 0.75 0 0.25] CT
0.149 GC
2 setlinecap
10.0 ML
N
436 556.667 M
436 556.667 L
S
GR
GS
[0.75 0 0 0.75 0 0.25] CT
0.149 GC
2 setlinecap
10.0 ML
N
663 405.333 M
663 405.333 L
S
GR
GS
[0.75 0 0 0.75 0 0.25] CT
0.149 GC
2 setlinecap
10.0 ML
N
663 481 M
663 481 L
S
GR
GS
[0.75 0 0 0.75 0 0.25] CT
0.149 GC
2 setlinecap
10.0 ML
N
663 556.667 M
663 556.667 L
S
GR
GS
[0.75 0 0 0.75 322.99999 304.25001] CT
0.149 GC
/Helvetica 13 F
GS
[1 0 0 1 0 0] CT
-8 5.5 moveto 
1 -1 scale
(0) t 
GR
GR
GS
[0.75 0 0 0.75 322.99999 361] CT
0.149 GC
/Helvetica 13 F
GS
[1 0 0 1 0 0] CT
-8 5.5 moveto 
1 -1 scale
(1) t 
GR
GR
GS
[0.75 0 0 0.75 0 0.25] CT
0.471 0.902 0.706 RC
N
436 367.5 M
511.667 367.5 L
511.667 443.167 L
cp
f
GR
GS
[0.75 0 0 0.75 0 0.25] CT
0.471 0.902 0.706 RC
N
436 367.5 M
511.667 443.167 L
436 443.167 L
cp
f
GR
GS
[0.75 0 0 0.75 0 0.25] CT
2 setlinecap
10.0 ML
N
436 367.5 M
511.667 367.5 L
511.667 443.167 L
436 443.167 L
436 367.5 L
S
GR
GS
[0.75 0 0 0.75 355.37501 304.25001] CT
/Helvetica-Bold 13 F
GS
[1 0 0 1 0 0] CT
-11 -3 moveto 
1 -1 scale
(594) t 
GR
GR
GS
[0.75 0 0 0.75 355.37501 304.25001] CT
/Helvetica 13 F
GS
[1 0 0 1 0 0] CT
-18.5 14 moveto 
1 -1 scale
(42.4%) t 
GR
GR
GS
[0.75 0 0 0.75 0 0.25] CT
0.902 0.549 0.549 RC
N
436 443.167 M
511.667 443.167 L
511.667 518.833 L
cp
f
GR
GS
[0.75 0 0 0.75 0 0.25] CT
0.902 0.549 0.549 RC
N
436 443.167 M
511.667 518.833 L
436 518.833 L
cp
f
GR
GS
[0.75 0 0 0.75 0 0.25] CT
2 setlinecap
10.0 ML
N
436 443.167 M
511.667 443.167 L
511.667 518.833 L
436 518.833 L
436 443.167 L
S
GR
GS
[0.75 0 0 0.75 355.37501 361] CT
/Helvetica-Bold 13 F
GS
[1 0 0 1 0 0] CT
-11 -3 moveto 
1 -1 scale
(206) t 
GR
GR
GS
[0.75 0 0 0.75 355.37501 361] CT
/Helvetica 13 F
GS
[1 0 0 1 0 0] CT
-18.5 14 moveto 
1 -1 scale
(14.7%) t 
GR
GR
GS
[0.75 0 0 0.75 0 0.25] CT
0.502 GC
N
436 518.833 M
511.667 518.833 L
511.667 594.5 L
cp
f
GR
GS
[0.75 0 0 0.75 0 0.25] CT
0.502 GC
N
436 518.833 M
511.667 594.5 L
436 594.5 L
cp
f
GR
GS
[0.75 0 0 0.75 0 0.25] CT
2 setlinecap
10.0 ML
N
436 518.833 M
511.667 518.833 L
511.667 594.5 L
436 594.5 L
436 518.833 L
S
GR
GS
[0.75 0 0 0.75 355.37501 417.75002] CT
0 0.4 0 RC
/Helvetica 13 F
GS
[1 0 0 1 0 0] CT
-18.5 -3 moveto 
1 -1 scale
(74.3%) t 
GR
GR
GS
[0.75 0 0 0.75 355.37501 417.75002] CT
0.4 0 0 RC
/Helvetica 13 F
GS
[1 0 0 1 0 0] CT
-18.5 14 moveto 
1 -1 scale
(25.7%) t 
GR
GR
GS
[0.75 0 0 0.75 0 0.25] CT
0.902 0.549 0.549 RC
N
511.667 367.5 M
587.333 367.5 L
587.333 443.167 L
cp
f
GR
GS
[0.75 0 0 0.75 0 0.25] CT
0.902 0.549 0.549 RC
N
511.667 367.5 M
587.333 443.167 L
511.667 443.167 L
cp
f
GR
GS
[0.75 0 0 0.75 0 0.25] CT
2 setlinecap
10.0 ML
N
511.667 367.5 M
587.333 367.5 L
587.333 443.167 L
511.667 443.167 L
511.667 367.5 L
S
GR
GS
[0.75 0 0 0.75 412.125 304.25001] CT
/Helvetica-Bold 13 F
GS
[1 0 0 1 0 0] CT
-7.5 -3 moveto 
1 -1 scale
(11) t 
GR
GR
GS
[0.75 0 0 0.75 412.125 304.25001] CT
/Helvetica 13 F
GS
[1 0 0 1 0 0] CT
-15 14 moveto 
1 -1 scale
(0.8%) t 
GR
GR
GS
[0.75 0 0 0.75 0 0.25] CT
0.471 0.902 0.706 RC
N
511.667 443.167 M
587.333 443.167 L
587.333 518.833 L
cp
f
GR
GS
[0.75 0 0 0.75 0 0.25] CT
0.471 0.902 0.706 RC
N
511.667 443.167 M
587.333 518.833 L
511.667 518.833 L
cp
f
GR
GS
[0.75 0 0 0.75 0 0.25] CT
2 setlinecap
10.0 ML
N
511.667 443.167 M
587.333 443.167 L
587.333 518.833 L
511.667 518.833 L
511.667 443.167 L
S
GR
GS
[0.75 0 0 0.75 412.125 361] CT
/Helvetica-Bold 13 F
GS
[1 0 0 1 0 0] CT
-11 -3 moveto 
1 -1 scale
(589) t 
GR
GR
GS
[0.75 0 0 0.75 412.125 361] CT
/Helvetica 13 F
GS
[1 0 0 1 0 0] CT
-18.5 14 moveto 
1 -1 scale
(42.1%) t 
GR
GR
GS
[0.75 0 0 0.75 0 0.25] CT
0.502 GC
N
511.667 518.833 M
587.333 518.833 L
587.333 594.5 L
cp
f
GR
GS
[0.75 0 0 0.75 0 0.25] CT
0.502 GC
N
511.667 518.833 M
587.333 594.5 L
511.667 594.5 L
cp
f
GR
GS
[0.75 0 0 0.75 0 0.25] CT
2 setlinecap
10.0 ML
N
511.667 518.833 M
587.333 518.833 L
587.333 594.5 L
511.667 594.5 L
511.667 518.833 L
S
GR
GS
[0.75 0 0 0.75 412.125 417.75002] CT
0 0.4 0 RC
/Helvetica 13 F
GS
[1 0 0 1 0 0] CT
-18.5 -3 moveto 
1 -1 scale
(98.2%) t 
GR
GR
GS
[0.75 0 0 0.75 412.125 417.75002] CT
0.4 0 0 RC
/Helvetica 13 F
GS
[1 0 0 1 0 0] CT
-15 14 moveto 
1 -1 scale
(1.8%) t 
GR
GR
GS
[0.75 0 0 0.75 0 0.25] CT
0.502 GC
N
587.333 367.5 M
663 367.5 L
663 443.167 L
cp
f
GR
GS
[0.75 0 0 0.75 0 0.25] CT
0.502 GC
N
587.333 367.5 M
663 443.167 L
587.333 443.167 L
cp
f
GR
GS
[0.75 0 0 0.75 0 0.25] CT
2 setlinecap
10.0 ML
N
587.333 367.5 M
663 367.5 L
663 443.167 L
587.333 443.167 L
587.333 367.5 L
S
GR
GS
[0.75 0 0 0.75 468.87502 304.25001] CT
0 0.4 0 RC
/Helvetica 13 F
GS
[1 0 0 1 0 0] CT
-18.5 -3 moveto 
1 -1 scale
(98.2%) t 
GR
GR
GS
[0.75 0 0 0.75 468.87502 304.25001] CT
0.4 0 0 RC
/Helvetica 13 F
GS
[1 0 0 1 0 0] CT
-15 14 moveto 
1 -1 scale
(1.8%) t 
GR
GR
GS
[0.75 0 0 0.75 0 0.25] CT
0.502 GC
N
587.333 443.167 M
663 443.167 L
663 518.833 L
cp
f
GR
GS
[0.75 0 0 0.75 0 0.25] CT
0.502 GC
N
587.333 443.167 M
663 518.833 L
587.333 518.833 L
cp
f
GR
GS
[0.75 0 0 0.75 0 0.25] CT
2 setlinecap
10.0 ML
N
587.333 443.167 M
663 443.167 L
663 518.833 L
587.333 518.833 L
587.333 443.167 L
S
GR
GS
[0.75 0 0 0.75 468.87502 361] CT
0 0.4 0 RC
/Helvetica 13 F
GS
[1 0 0 1 0 0] CT
-18.5 -3 moveto 
1 -1 scale
(74.1%) t 
GR
GR
GS
[0.75 0 0 0.75 468.87502 361] CT
0.4 0 0 RC
/Helvetica 13 F
GS
[1 0 0 1 0 0] CT
-18.5 14 moveto 
1 -1 scale
(25.9%) t 
GR
GR
GS
[0.75 0 0 0.75 0 0.25] CT
0.471 0.588 0.902 RC
N
587.333 518.833 M
663 518.833 L
663 594.5 L
cp
f
GR
GS
[0.75 0 0 0.75 0 0.25] CT
0.471 0.588 0.902 RC
N
587.333 518.833 M
663 594.5 L
587.333 594.5 L
cp
f
GR
GS
[0.75 0 0 0.75 0 0.25] CT
2 setlinecap
10.0 ML
N
587.333 518.833 M
663 518.833 L
663 594.5 L
587.333 594.5 L
587.333 518.833 L
S
GR
GS
[0.75 0 0 0.75 468.87502 417.75002] CT
0 0.4 0 RC
/Helvetica-Bold 13 F
GS
[1 0 0 1 0 0] CT
-18.5 -3 moveto 
1 -1 scale
(84.5%) t 
GR
GR
GS
[0.75 0 0 0.75 468.87502 417.75002] CT
0.4 0 0 RC
/Helvetica-Bold 13 F
GS
[1 0 0 1 0 0] CT
-18.5 14 moveto 
1 -1 scale
(15.5%) t 
GR
GR
GS
[0.75 0 0 0.75 0 0.25] CT
0.251 GC
2 setlinecap
10.0 ML
2.667 LW
N
587.333 367.5 M
587.333 594.5 L
S
GR
GS
[0.75 0 0 0.75 0 0.25] CT
0.251 GC
2 setlinecap
10.0 ML
2.667 LW
N
436 518.833 M
663 518.833 L
S
GR
GS
[0.75 0 0 0.75 412.12541 273.625] CT
/Helvetica-Bold 16 F
GS
[1 0 0 1 0 0] CT
-115.5 -4 moveto 
1 -1 scale
(Matriz de Cconfus\343o \(Polegar\)) t 
GR
GR
%%Trailer
%%Pages: 1
%%EOF
