\relax 
\providecommand\hyper@newdestlabel[2]{}
\providecommand\BKM@entry[2]{}
\providecommand*{\memsetcounter}[2]{}
\providecommand\HyperFirstAtBeginDocument{\AtBeginDocument}
\HyperFirstAtBeginDocument{\ifx\hyper@anchor\@undefined
\global\let\oldcontentsline\contentsline
\gdef\contentsline#1#2#3#4{\oldcontentsline{#1}{#2}{#3}}
\global\let\oldnewlabel\newlabel
\gdef\newlabel#1#2{\newlabelxx{#1}#2}
\gdef\newlabelxx#1#2#3#4#5#6{\oldnewlabel{#1}{{#2}{#3}}}
\AtEndDocument{\ifx\hyper@anchor\@undefined
\let\contentsline\oldcontentsline
\let\newlabel\oldnewlabel
\fi}
\fi}
\global\let\hyper@last\relax 
\gdef\HyperFirstAtBeginDocument#1{#1}
\providecommand\HyField@AuxAddToFields[1]{}
\providecommand\HyField@AuxAddToCoFields[2]{}
\@nameuse{bbl@beforestart}
\catcode `:\active 
\catcode `;\active 
\catcode `!\active 
\catcode `?\active 
\catcode `"\active 
\catcode `<\active 
\catcode `>\active 
\@nameuse{es@quoting}
\citation{abnt-url-package=url}
\@input{Elementos_Pretextuais/1-capa.aux}
\@writefile{toc}{\changetocdepth  {4}}
\providecommand \oddpage@label [2]{}
\babel@aux{brazil}{}
\@input{Elementos_Pretextuais/2-folha_de_rosto.aux}
\@input{Elementos_Pretextuais/9-resumo.aux}
\BKM@entry{id=1,dest={6368617074657262312E30},srcline={3}}{526573756D6F}
\@input{Elementos_Pretextuais/10-abstract.aux}
\BKM@entry{id=2,dest={6368617074657262322E30},srcline={5}}{4162737472616374}
\@writefile{toc}{\setlength  {\cftchapterindent }{\cftlastnumwidth } \setlength  {\cftchapternumwidth }{2em}}
\@input{Cap1_Introducao/introducao.aux}
\BKM@entry{id=3,dest={636861707465722E31},srcline={1}}{496E74726F64755C3334375C3334336F}
\BKM@entry{id=4,dest={73656374696F6E2E312E31},srcline={7}}{4F205045535155495341444F5220452053455520434F4E544558544F}
\BKM@entry{id=5,dest={73656374696F6E2E312E32},srcline={11}}{4150524553454E54414E444F2041205045535155495341}
\BKM@entry{id=6,dest={73656374696F6E2E312E33},srcline={13}}{50524F424C454D41204445205045535155495341}
\BKM@entry{id=7,dest={73656374696F6E2E312E34},srcline={15}}{4A555354494649434154495641}
\BKM@entry{id=8,dest={73656374696F6E2E312E35},srcline={17}}{4849505C3332335445534553}
\BKM@entry{id=9,dest={73656374696F6E2E312E36},srcline={19}}{4F424A455449564F53}
\BKM@entry{id=10,dest={73756273656374696F6E2E312E362E31},srcline={20}}{4F626A657469766F20476572616C}
\BKM@entry{id=11,dest={73756273656374696F6E2E312E362E32},srcline={24}}{4F626A657469766F732045737065635C3335356669636F}
\@input{Cap2_Revisao_Teorica/ref_teorico.aux}
\BKM@entry{id=12,dest={636861707465722E32},srcline={1}}{5245464552454E4349414C2054455C3332335249434F}
\BKM@entry{id=13,dest={73656374696F6E2E322E31},srcline={4}}{54454E445C3331324E4349412050454441475C33323347494341}
\BKM@entry{id=14,dest={73656374696F6E2E322E32},srcline={6}}{54454F52494120444520415052454E44495A4147454D}
\BKM@entry{id=15,dest={73656374696F6E2E322E33},srcline={8}}{50525C333031544943412050454441475C33323347494341204441205045535155495341}
\BKM@entry{id=16,dest={73656374696F6E2E322E34},srcline={10}}{434F4E54455C333332444F2041205345522054524142414C4841444F204E41205045535155495341}
\BKM@entry{id=17,dest={73656374696F6E2E322E35},srcline={12}}{5445434E4F4C4F47494120454455434143494F4E414C205554494C495A414441204E41205045535155495341}
\@input{Cap3_Prop_Inter_Pedag/proposta_intervencao_pedag.aux}
\BKM@entry{id=18,dest={636861707465722E33},srcline={1}}{494E54455256454E5C3330375C3330334F2050454441475C33323347494341}
\@input{Cap4_Rev_Literatura/revisao_literatura.aux}
\BKM@entry{id=19,dest={636861707465722E34},srcline={1}}{52455649535C3330334F204445204C495445524154555241}
\@input{Cap5_Metodologia/metodologia.aux}
\BKM@entry{id=20,dest={636861707465722E35},srcline={1}}{4D45544F444F4C4F474941}
\BKM@entry{id=21,dest={73656374696F6E2E352E31},srcline={4}}{4C4F43555320452053554A4549544F53204441205045535155495341}
\BKM@entry{id=22,dest={73656374696F6E2E352E32},srcline={6}}{4D45544F444F4C4F474941204441205045535155495341}
\BKM@entry{id=23,dest={73656374696F6E2E352E33},srcline={8}}{494E535452554D454E544F5320444520434F4C45544120452050524F44555C3330375C3330334F204445204441444F53}
\BKM@entry{id=24,dest={73656374696F6E2E352E34},srcline={10}}{4D45544F444F4C4F4749415320444520414E5C3330314C495345204445204441444F53}
\@input{Cap6_Disc_dados/discussao_dados.aux}
\BKM@entry{id=25,dest={636861707465722E36},srcline={1}}{444953435553535C3330334F20444F53204441444F53}
\@input{Cap7_Consideracoes_finais/consideracoes_finais.aux}
\BKM@entry{id=26,dest={636861707465722E37},srcline={1}}{434F4E5349444552415C3330375C33323545532046494E414953}
\@input{referencias.aux}
\BKM@entry{id=27,dest={73656374696F6E2A2E35},srcline={3}}{52656665725C3335326E63696173}
\@input{anexos.aux}
\newlabel{LastPage}{{}{15}{}{page.15}{}}
\xdef\lastpage@lastpage{15}
\xdef\lastpage@lastpageHy{15}
\bibstyle{abntex2-alf}
\memsetcounter{lastsheet}{14}
\memsetcounter{lastpage}{15}
