/home/cril/wwf/Campaigns/CP/COP/Approximation/AllXCSP22/input_set/AircraftLanding-table-airland01_c22.xml.lzma
/home/cril/wwf/Campaigns/CP/COP/Approximation/AllXCSP22/input_set/AircraftLanding-table-airland02_c22.xml.lzma
/home/cril/wwf/Campaigns/CP/COP/Approximation/AllXCSP22/input_set/AircraftLanding-table-airland03_c22.xml.lzma
/home/cril/wwf/Campaigns/CP/COP/Approximation/AllXCSP22/input_set/AircraftLanding-table-airland04_c22.xml.lzma
/home/cril/wwf/Campaigns/CP/COP/Approximation/AllXCSP22/input_set/AircraftLanding-table-airland05_c22.xml.lzma
/home/cril/wwf/Campaigns/CP/COP/Approximation/AllXCSP22/input_set/AircraftLanding-table-airland06_c22.xml.lzma
/home/cril/wwf/Campaigns/CP/COP/Approximation/AllXCSP22/input_set/AircraftLanding-table-airland07_c22.xml.lzma
/home/cril/wwf/Campaigns/CP/COP/Approximation/AllXCSP22/input_set/AircraftLanding-table-airland08_c22.xml.lzma
/home/cril/wwf/Campaigns/CP/COP/Approximation/AllXCSP22/input_set/AircraftLanding-table-airland09_c22.xml.lzma
/home/cril/wwf/Campaigns/CP/COP/Approximation/AllXCSP22/input_set/AircraftLanding-table-airland10_c22.xml.lzma
/home/cril/wwf/Campaigns/CP/COP/Approximation/AllXCSP22/input_set/AircraftLanding-table-airland11_c22.xml.lzma
/home/cril/wwf/Campaigns/CP/COP/Approximation/AllXCSP22/input_set/AircraftLanding-table-airland12_c22.xml.lzma
/home/cril/wwf/Campaigns/CP/COP/Approximation/AllXCSP22/input_set/AircraftLanding-table-airland13_c22.xml.lzma
/home/cril/wwf/Campaigns/CP/COP/Approximation/AllXCSP22/input_set/ClockTriplet-03-12_c22.xml.lzma
/home/cril/wwf/Campaigns/CP/COP/Approximation/AllXCSP22/input_set/ClockTriplet-05-15_c22.xml.lzma
/home/cril/wwf/Campaigns/CP/COP/Approximation/AllXCSP22/input_set/ClockTriplet-07-15_c22.xml.lzma
/home/cril/wwf/Campaigns/CP/COP/Approximation/AllXCSP22/input_set/ClockTriplet-07-20_c22.xml.lzma
/home/cril/wwf/Campaigns/CP/COP/Approximation/AllXCSP22/input_set/ClockTriplet-10-15_c22.xml.lzma
/home/cril/wwf/Campaigns/CP/COP/Approximation/AllXCSP22/input_set/ClockTriplet-10-20_c22.xml.lzma
/home/cril/wwf/Campaigns/CP/COP/Approximation/AllXCSP22/input_set/ClockTriplet-15-20_c22.xml.lzma
/home/cril/wwf/Campaigns/CP/COP/Approximation/AllXCSP22/input_set/ClockTriplet-15-30_c22.xml.lzma
/home/cril/wwf/Campaigns/CP/COP/Approximation/AllXCSP22/input_set/ClockTriplet-20-25_c22.xml.lzma
/home/cril/wwf/Campaigns/CP/COP/Approximation/AllXCSP22/input_set/ClockTriplet-20-35_c22.xml.lzma
/home/cril/wwf/Campaigns/CP/COP/Approximation/AllXCSP22/input_set/CoinsGrid-08-04_c22.xml.lzma
/home/cril/wwf/Campaigns/CP/COP/Approximation/AllXCSP22/input_set/CoinsGrid-10-05_c22.xml.lzma
/home/cril/wwf/Campaigns/CP/COP/Approximation/AllXCSP22/input_set/CoinsGrid-12-06_c22.xml.lzma
/home/cril/wwf/Campaigns/CP/COP/Approximation/AllXCSP22/input_set/CoinsGrid-14-07_c22.xml.lzma
/home/cril/wwf/Campaigns/CP/COP/Approximation/AllXCSP22/input_set/CoinsGrid-16-08_c22.xml.lzma
/home/cril/wwf/Campaigns/CP/COP/Approximation/AllXCSP22/input_set/CoinsGrid-19-09_c22.xml.lzma
/home/cril/wwf/Campaigns/CP/COP/Approximation/AllXCSP22/input_set/CoinsGrid-22-10_c22.xml.lzma
/home/cril/wwf/Campaigns/CP/COP/Approximation/AllXCSP22/input_set/CoinsGrid-25-11_c22.xml.lzma
/home/cril/wwf/Campaigns/CP/COP/Approximation/AllXCSP22/input_set/CoinsGrid-28-12_c22.xml.lzma
/home/cril/wwf/Campaigns/CP/COP/Approximation/AllXCSP22/input_set/CoinsGrid-31-14_c22.xml.lzma
/home/cril/wwf/Campaigns/CP/COP/Approximation/AllXCSP22/input_set/CVRP-A-n32-k5_c22.xml.lzma
/home/cril/wwf/Campaigns/CP/COP/Approximation/AllXCSP22/input_set/CVRP-A-n33-k5_c22.xml.lzma
/home/cril/wwf/Campaigns/CP/COP/Approximation/AllXCSP22/input_set/CVRP-A-n33-k6_c22.xml.lzma
/home/cril/wwf/Campaigns/CP/COP/Approximation/AllXCSP22/input_set/CVRP-A-n34-k5_c22.xml.lzma
/home/cril/wwf/Campaigns/CP/COP/Approximation/AllXCSP22/input_set/CVRP-A-n36-k5_c22.xml.lzma
/home/cril/wwf/Campaigns/CP/COP/Approximation/AllXCSP22/input_set/CVRP-A-n37-k5_c22.xml.lzma
/home/cril/wwf/Campaigns/CP/COP/Approximation/AllXCSP22/input_set/CVRP-A-n37-k6_c22.xml.lzma
/home/cril/wwf/Campaigns/CP/COP/Approximation/AllXCSP22/input_set/CVRP-A-n38-k5_c22.xml.lzma
/home/cril/wwf/Campaigns/CP/COP/Approximation/AllXCSP22/input_set/CVRP-A-n39-k5_c22.xml.lzma
/home/cril/wwf/Campaigns/CP/COP/Approximation/AllXCSP22/input_set/CVRP-A-n39-k6_c22.xml.lzma
/home/cril/wwf/Campaigns/CP/COP/Approximation/AllXCSP22/input_set/CyclicBandwidth-caterpillar13_c22.xml.lzma
/home/cril/wwf/Campaigns/CP/COP/Approximation/AllXCSP22/input_set/CyclicBandwidth-caterpillar16_c22.xml.lzma
/home/cril/wwf/Campaigns/CP/COP/Approximation/AllXCSP22/input_set/CyclicBandwidth-caterpillar19_c22.xml.lzma
/home/cril/wwf/Campaigns/CP/COP/Approximation/AllXCSP22/input_set/CyclicBandwidth-caterpillar23_c22.xml.lzma
/home/cril/wwf/Campaigns/CP/COP/Approximation/AllXCSP22/input_set/CyclicBandwidth-caterpillar29_c22.xml.lzma
/home/cril/wwf/Campaigns/CP/COP/Approximation/AllXCSP22/input_set/CyclicBandwidth-caterpillar35_c22.xml.lzma
/home/cril/wwf/Campaigns/CP/COP/Approximation/AllXCSP22/input_set/CyclicBandwidth-mesh2D05x08_c22.xml.lzma
/home/cril/wwf/Campaigns/CP/COP/Approximation/AllXCSP22/input_set/CyclicBandwidth-mesh2D10x10_c22.xml.lzma
/home/cril/wwf/Campaigns/CP/COP/Approximation/AllXCSP22/input_set/CyclicBandwidth-mesh2D25x26_c22.xml.lzma
/home/cril/wwf/Campaigns/CP/COP/Approximation/AllXCSP22/input_set/CyclicBandwidth-path100_c22.xml.lzma
/home/cril/wwf/Campaigns/CP/COP/Approximation/AllXCSP22/input_set/CyclicBandwidth-path200_c22.xml.lzma
/home/cril/wwf/Campaigns/CP/COP/Approximation/AllXCSP22/input_set/CyclicBandwidth-path300_c22.xml.lzma
/home/cril/wwf/Campaigns/CP/COP/Approximation/AllXCSP22/input_set/DC-midori-xor4-d1-t0-r03-v128_c22.xml.lzma
/home/cril/wwf/Campaigns/CP/COP/Approximation/AllXCSP22/input_set/DC-midori-xor4-d1-t0-r04-v128_c22.xml.lzma
/home/cril/wwf/Campaigns/CP/COP/Approximation/AllXCSP22/input_set/DC-midori-xor4-d1-t0-r05-v128_c22.xml.lzma
/home/cril/wwf/Campaigns/CP/COP/Approximation/AllXCSP22/input_set/DC-midori-xor4-d1-t0-r06-v128_c22.xml.lzma
/home/cril/wwf/Campaigns/CP/COP/Approximation/AllXCSP22/input_set/DC-midori-xor4-d1-t0-r08-v128_c22.xml.lzma
/home/cril/wwf/Campaigns/CP/COP/Approximation/AllXCSP22/input_set/DC-midori-xor4-d1-t0-r09-v128_c22.xml.lzma
/home/cril/wwf/Campaigns/CP/COP/Approximation/AllXCSP22/input_set/DC-midori-xor4-d1-t0-r14-v128_c22.xml.lzma
/home/cril/wwf/Campaigns/CP/COP/Approximation/AllXCSP22/input_set/DC-rijndael-xor5-d1-t0-r03-keysize7-plainsize4_c22.xml.lzma
/home/cril/wwf/Campaigns/CP/COP/Approximation/AllXCSP22/input_set/DC-rijndael-xor5-d1-t0-r04-keysize7-plainsize4_c22.xml.lzma
/home/cril/wwf/Campaigns/CP/COP/Approximation/AllXCSP22/input_set/DC-rijndael-xor5-d1-t0-r05-keysize7-plainsize4_c22.xml.lzma
/home/cril/wwf/Campaigns/CP/COP/Approximation/AllXCSP22/input_set/DC-rijndael-xor5-d1-t0-r06-keysize7-plainsize4_c22.xml.lzma
/home/cril/wwf/Campaigns/CP/COP/Approximation/AllXCSP22/input_set/DC-rijndael-xor5-d1-t0-r07-keysize7-plainsize4_c22.xml.lzma
/home/cril/wwf/Campaigns/CP/COP/Approximation/AllXCSP22/input_set/DC-rijndael-xor5-d1-t0-r08-keysize7-plainsize4_c22.xml.lzma
/home/cril/wwf/Campaigns/CP/COP/Approximation/AllXCSP22/input_set/DC-skinny-xor0-d0-t0-r06-v64-z0_c22.xml.lzma
/home/cril/wwf/Campaigns/CP/COP/Approximation/AllXCSP22/input_set/DC-skinny-xor0-d0-t0-r07-v64-z0_c22.xml.lzma
/home/cril/wwf/Campaigns/CP/COP/Approximation/AllXCSP22/input_set/DC-skinny-xor0-d0-t0-r08-v64-z0_c22.xml.lzma
/home/cril/wwf/Campaigns/CP/COP/Approximation/AllXCSP22/input_set/DC-skinny-xor0-d0-t0-r09-v64-z0_c22.xml.lzma
/home/cril/wwf/Campaigns/CP/COP/Approximation/AllXCSP22/input_set/DC-skinny-xor0-d0-t0-r10-v64-z0_c22.xml.lzma
/home/cril/wwf/Campaigns/CP/COP/Approximation/AllXCSP22/input_set/DC-skinny-xor0-d0-t0-r11-v64-z0_c22.xml.lzma
/home/cril/wwf/Campaigns/CP/COP/Approximation/AllXCSP22/input_set/DC-skinny-xor0-d0-t0-r12-v64-z0_c22.xml.lzma
/home/cril/wwf/Campaigns/CP/COP/Approximation/AllXCSP22/input_set/DC-skinny-xor0-d0-t0-r13-v64-z0_c22.xml.lzma
/home/cril/wwf/Campaigns/CP/COP/Approximation/AllXCSP22/input_set/DC-skinny-xor0-d0-t0-r14-v64-z0_c22.xml.lzma
/home/cril/wwf/Campaigns/CP/COP/Approximation/AllXCSP22/input_set/DC-skinny-xor0-d0-t0-r15-v64-z0_c22.xml.lzma
/home/cril/wwf/Campaigns/CP/COP/Approximation/AllXCSP22/input_set/DC-skinny-xor0-d0-t0-r16-v64-z0_c22.xml.lzma
/home/cril/wwf/Campaigns/CP/COP/Approximation/AllXCSP22/input_set/DC-skinny-xor0-d0-t0-r17-v64-z0_c22.xml.lzma
/home/cril/wwf/Campaigns/CP/COP/Approximation/AllXCSP22/input_set/DC-skinny-xor0-d0-t0-r18-v64-z0_c22.xml.lzma
/home/cril/wwf/Campaigns/CP/COP/Approximation/AllXCSP22/input_set/EchelonStock2-A01_c22.xml.lzma
/home/cril/wwf/Campaigns/CP/COP/Approximation/AllXCSP22/input_set/EchelonStock2-A02_c22.xml.lzma
/home/cril/wwf/Campaigns/CP/COP/Approximation/AllXCSP22/input_set/EchelonStock2-A03_c22.xml.lzma
/home/cril/wwf/Campaigns/CP/COP/Approximation/AllXCSP22/input_set/EchelonStock2-A04_c22.xml.lzma
/home/cril/wwf/Campaigns/CP/COP/Approximation/AllXCSP22/input_set/EchelonStock2-A05_c22.xml.lzma
/home/cril/wwf/Campaigns/CP/COP/Approximation/AllXCSP22/input_set/EchelonStock2-A06_c22.xml.lzma
/home/cril/wwf/Campaigns/CP/COP/Approximation/AllXCSP22/input_set/EchelonStock2-A07_c22.xml.lzma
/home/cril/wwf/Campaigns/CP/COP/Approximation/AllXCSP22/input_set/EchelonStock2-A08_c22.xml.lzma
/home/cril/wwf/Campaigns/CP/COP/Approximation/AllXCSP22/input_set/EchelonStock2-A09_c22.xml.lzma
/home/cril/wwf/Campaigns/CP/COP/Approximation/AllXCSP22/input_set/EchelonStock2-A10_c22.xml.lzma
/home/cril/wwf/Campaigns/CP/COP/Approximation/AllXCSP22/input_set/Filters-dct-1-1_c22.xml.lzma
/home/cril/wwf/Campaigns/CP/COP/Approximation/AllXCSP22/input_set/Filters-dct-1-2_c22.xml.lzma
/home/cril/wwf/Campaigns/CP/COP/Approximation/AllXCSP22/input_set/Filters-dct-1-3_c22.xml.lzma
/home/cril/wwf/Campaigns/CP/COP/Approximation/AllXCSP22/input_set/Filters-dct-2-2_c22.xml.lzma
/home/cril/wwf/Campaigns/CP/COP/Approximation/AllXCSP22/input_set/Filters-dct-2-3_c22.xml.lzma
/home/cril/wwf/Campaigns/CP/COP/Approximation/AllXCSP22/input_set/Filters-ewf-1-1_c22.xml.lzma
/home/cril/wwf/Campaigns/CP/COP/Approximation/AllXCSP22/input_set/Filters-ewf-1-2_c22.xml.lzma
/home/cril/wwf/Campaigns/CP/COP/Approximation/AllXCSP22/input_set/Filters-fir16-1-1_c22.xml.lzma
/home/cril/wwf/Campaigns/CP/COP/Approximation/AllXCSP22/input_set/ItemsetMining-k1-anneal_c22.xml.lzma
/home/cril/wwf/Campaigns/CP/COP/Approximation/AllXCSP22/input_set/ItemsetMining-k1-german-credit_c22.xml.lzma
/home/cril/wwf/Campaigns/CP/COP/Approximation/AllXCSP22/input_set/ItemsetMining-k1-hypothyroid_c22.xml.lzma
/home/cril/wwf/Campaigns/CP/COP/Approximation/AllXCSP22/input_set/ItemsetMining-k1-ionosphere_c22.xml.lzma
/home/cril/wwf/Campaigns/CP/COP/Approximation/AllXCSP22/input_set/ItemsetMining-k1-mushroom_c22.xml.lzma
/home/cril/wwf/Campaigns/CP/COP/Approximation/AllXCSP22/input_set/ItemsetMining-k1-pendigits_c22.xml.lzma
/home/cril/wwf/Campaigns/CP/COP/Approximation/AllXCSP22/input_set/ItemsetMining-k1-splice-1_c22.xml.lzma
/home/cril/wwf/Campaigns/CP/COP/Approximation/AllXCSP22/input_set/ItemsetMining-k1-vehicle_c22.xml.lzma
/home/cril/wwf/Campaigns/CP/COP/Approximation/AllXCSP22/input_set/ItemsetMining-k2-audiology_c22.xml.lzma
/home/cril/wwf/Campaigns/CP/COP/Approximation/AllXCSP22/input_set/ItemsetMining-k2-german-credit_c22.xml.lzma
/home/cril/wwf/Campaigns/CP/COP/Approximation/AllXCSP22/input_set/ItemsetMining-k2-hepatitis_c22.xml.lzma
/home/cril/wwf/Campaigns/CP/COP/Approximation/AllXCSP22/input_set/ItemsetMining-k2-kr-vs-kp_c22.xml.lzma
/home/cril/wwf/Campaigns/CP/COP/Approximation/AllXCSP22/input_set/ItemsetMining-k2-segment_c22.xml.lzma
/home/cril/wwf/Campaigns/CP/COP/Approximation/AllXCSP22/input_set/ItemsetMining-k2-sonar_c22.xml.lzma
/home/cril/wwf/Campaigns/CP/COP/Approximation/AllXCSP22/input_set/ItemsetMining-k2-yeast_c22.xml.lzma
/home/cril/wwf/Campaigns/CP/COP/Approximation/AllXCSP22/input_set/MultiAgentPathFinding-table-g16-p10-a05_c22.xml.lzma
/home/cril/wwf/Campaigns/CP/COP/Approximation/AllXCSP22/input_set/MultiAgentPathFinding-table-g16-p10-a10_c22.xml.lzma
/home/cril/wwf/Campaigns/CP/COP/Approximation/AllXCSP22/input_set/MultiAgentPathFinding-table-g16-p10-a20_c22.xml.lzma
/home/cril/wwf/Campaigns/CP/COP/Approximation/AllXCSP22/input_set/MultiAgentPathFinding-table-g16-p20-a20_c22.xml.lzma
/home/cril/wwf/Campaigns/CP/COP/Approximation/AllXCSP22/input_set/MultiAgentPathFinding-table-g16-p20-a30_c22.xml.lzma
/home/cril/wwf/Campaigns/CP/COP/Approximation/AllXCSP22/input_set/MultiAgentPathFinding-table-g32-p10-a05_c22.xml.lzma
/home/cril/wwf/Campaigns/CP/COP/Approximation/AllXCSP22/input_set/MultiAgentPathFinding-table-g32-p10-a10_c22.xml.lzma
/home/cril/wwf/Campaigns/CP/COP/Approximation/AllXCSP22/input_set/MultiAgentPathFinding-table-g32-p10-a20_c22.xml.lzma
/home/cril/wwf/Campaigns/CP/COP/Approximation/AllXCSP22/input_set/MultiAgentPathFinding-table-g32-p20-a20_c22.xml.lzma
/home/cril/wwf/Campaigns/CP/COP/Approximation/AllXCSP22/input_set/MultiAgentPathFinding-table-g32-p20-a30_c22.xml.lzma
/home/cril/wwf/Campaigns/CP/COP/Approximation/AllXCSP22/input_set/MultiAgentPathFinding-table-mks-g16-p10-a05_c22.xml.lzma
/home/cril/wwf/Campaigns/CP/COP/Approximation/AllXCSP22/input_set/MultiAgentPathFinding-table-mks-g16-p10-a10_c22.xml.lzma
/home/cril/wwf/Campaigns/CP/COP/Approximation/AllXCSP22/input_set/MultiAgentPathFinding-table-mks-g16-p10-a20_c22.xml.lzma
/home/cril/wwf/Campaigns/CP/COP/Approximation/AllXCSP22/input_set/MultiAgentPathFinding-table-mks-g16-p20-a20_c22.xml.lzma
/home/cril/wwf/Campaigns/CP/COP/Approximation/AllXCSP22/input_set/MultiAgentPathFinding-table-mks-g16-p20-a30_c22.xml.lzma
/home/cril/wwf/Campaigns/CP/COP/Approximation/AllXCSP22/input_set/MultiAgentPathFinding-table-mks-g32-p10-a05_c22.xml.lzma
/home/cril/wwf/Campaigns/CP/COP/Approximation/AllXCSP22/input_set/MultiAgentPathFinding-table-mks-g32-p10-a10_c22.xml.lzma
/home/cril/wwf/Campaigns/CP/COP/Approximation/AllXCSP22/input_set/MultiAgentPathFinding-table-mks-g32-p10-a20_c22.xml.lzma
/home/cril/wwf/Campaigns/CP/COP/Approximation/AllXCSP22/input_set/MultiAgentPathFinding-table-mks-g32-p20-a20_c22.xml.lzma
/home/cril/wwf/Campaigns/CP/COP/Approximation/AllXCSP22/input_set/MultiAgentPathFinding-table-mks-g32-p20-a30_c22.xml.lzma
/home/cril/wwf/Campaigns/CP/COP/Approximation/AllXCSP22/input_set/NurseRostering-01_c18.xml.lzma
/home/cril/wwf/Campaigns/CP/COP/Approximation/AllXCSP22/input_set/NurseRostering-02_c18.xml.lzma
/home/cril/wwf/Campaigns/CP/COP/Approximation/AllXCSP22/input_set/NurseRostering-03_c18.xml.lzma
/home/cril/wwf/Campaigns/CP/COP/Approximation/AllXCSP22/input_set/NurseRostering-04_c18.xml.lzma
/home/cril/wwf/Campaigns/CP/COP/Approximation/AllXCSP22/input_set/NurseRostering-05_c18.xml.lzma
/home/cril/wwf/Campaigns/CP/COP/Approximation/AllXCSP22/input_set/NurseRostering-06_c18.xml.lzma
/home/cril/wwf/Campaigns/CP/COP/Approximation/AllXCSP22/input_set/NurseRostering-07_c18.xml.lzma
/home/cril/wwf/Campaigns/CP/COP/Approximation/AllXCSP22/input_set/NurseRostering-08_c18.xml.lzma
/home/cril/wwf/Campaigns/CP/COP/Approximation/AllXCSP22/input_set/NurseRostering-09_c18.xml.lzma
/home/cril/wwf/Campaigns/CP/COP/Approximation/AllXCSP22/input_set/NurseRostering-10_c18.xml.lzma
/home/cril/wwf/Campaigns/CP/COP/Approximation/AllXCSP22/input_set/NurseRostering-11_c18.xml.lzma
/home/cril/wwf/Campaigns/CP/COP/Approximation/AllXCSP22/input_set/NurseRostering-12_c18.xml.lzma
/home/cril/wwf/Campaigns/CP/COP/Approximation/AllXCSP22/input_set/NurseRostering-13_c18.xml.lzma
/home/cril/wwf/Campaigns/CP/COP/Approximation/AllXCSP22/input_set/NurseRostering-14_c18.xml.lzma
/home/cril/wwf/Campaigns/CP/COP/Approximation/AllXCSP22/input_set/NurseRostering-15_c18.xml.lzma
/home/cril/wwf/Campaigns/CP/COP/Approximation/AllXCSP22/input_set/NurseRostering-16_c18.xml.lzma
/home/cril/wwf/Campaigns/CP/COP/Approximation/AllXCSP22/input_set/NurseRostering-17_c18.xml.lzma
/home/cril/wwf/Campaigns/CP/COP/Approximation/AllXCSP22/input_set/NurseRostering-18_c18.xml.lzma
/home/cril/wwf/Campaigns/CP/COP/Approximation/AllXCSP22/input_set/NurseRostering-19_c18.xml.lzma
/home/cril/wwf/Campaigns/CP/COP/Approximation/AllXCSP22/input_set/NurseRostering-20_c18.xml.lzma
/home/cril/wwf/Campaigns/CP/COP/Approximation/AllXCSP22/input_set/NursingWorkload-15zones_c22.xml.lzma
/home/cril/wwf/Campaigns/CP/COP/Approximation/AllXCSP22/input_set/NursingWorkload-2zones0_c22.xml.lzma
/home/cril/wwf/Campaigns/CP/COP/Approximation/AllXCSP22/input_set/NursingWorkload-2zones1_c22.xml.lzma
/home/cril/wwf/Campaigns/CP/COP/Approximation/AllXCSP22/input_set/NursingWorkload-2zones2_c22.xml.lzma
/home/cril/wwf/Campaigns/CP/COP/Approximation/AllXCSP22/input_set/NursingWorkload-2zones3_c22.xml.lzma
/home/cril/wwf/Campaigns/CP/COP/Approximation/AllXCSP22/input_set/NursingWorkload-2zones4_c22.xml.lzma
/home/cril/wwf/Campaigns/CP/COP/Approximation/AllXCSP22/input_set/NursingWorkload-3zones0_c22.xml.lzma
/home/cril/wwf/Campaigns/CP/COP/Approximation/AllXCSP22/input_set/NursingWorkload-3zones1_c22.xml.lzma
/home/cril/wwf/Campaigns/CP/COP/Approximation/AllXCSP22/input_set/NursingWorkload-3zones2_c22.xml.lzma
/home/cril/wwf/Campaigns/CP/COP/Approximation/AllXCSP22/input_set/NursingWorkload-3zones3_c22.xml.lzma
/home/cril/wwf/Campaigns/CP/COP/Approximation/AllXCSP22/input_set/NursingWorkload-3zones4_c22.xml.lzma
/home/cril/wwf/Campaigns/CP/COP/Approximation/AllXCSP22/input_set/NursingWorkload-6zones_c22.xml.lzma
/home/cril/wwf/Campaigns/CP/COP/Approximation/AllXCSP22/input_set/Rcpsp-j120-01-01_c22.xml.lzma
/home/cril/wwf/Campaigns/CP/COP/Approximation/AllXCSP22/input_set/Rcpsp-j120-01-02_c22.xml.lzma
/home/cril/wwf/Campaigns/CP/COP/Approximation/AllXCSP22/input_set/Rcpsp-j120-01-03_c22.xml.lzma
/home/cril/wwf/Campaigns/CP/COP/Approximation/AllXCSP22/input_set/Rcpsp-j120-01-04_c22.xml.lzma
/home/cril/wwf/Campaigns/CP/COP/Approximation/AllXCSP22/input_set/Rcpsp-j120-01-05_c22.xml.lzma
/home/cril/wwf/Campaigns/CP/COP/Approximation/AllXCSP22/input_set/Rcpsp-j120-01-06_c22.xml.lzma
/home/cril/wwf/Campaigns/CP/COP/Approximation/AllXCSP22/input_set/Rcpsp-j120-01-07_c22.xml.lzma
/home/cril/wwf/Campaigns/CP/COP/Approximation/AllXCSP22/input_set/Rcpsp-j120-01-08_c22.xml.lzma
/home/cril/wwf/Campaigns/CP/COP/Approximation/AllXCSP22/input_set/Rcpsp-j120-01-09_c22.xml.lzma
/home/cril/wwf/Campaigns/CP/COP/Approximation/AllXCSP22/input_set/Rcpsp-j120-01-10_c22.xml.lzma
/home/cril/wwf/Campaigns/CP/COP/Approximation/AllXCSP22/input_set/Rlfap-graph-01-opt_c18.xml.lzma
/home/cril/wwf/Campaigns/CP/COP/Approximation/AllXCSP22/input_set/Rlfap-graph-02-opt_c18.xml.lzma
/home/cril/wwf/Campaigns/CP/COP/Approximation/AllXCSP22/input_set/Rlfap-graph-03-opt_c18.xml.lzma
/home/cril/wwf/Campaigns/CP/COP/Approximation/AllXCSP22/input_set/Rlfap-graph-04-opt_c18.xml.lzma
/home/cril/wwf/Campaigns/CP/COP/Approximation/AllXCSP22/input_set/Rlfap-graph-05-opt_c18.xml.lzma
/home/cril/wwf/Campaigns/CP/COP/Approximation/AllXCSP22/input_set/Rlfap-graph-06-opt_c18.xml.lzma
/home/cril/wwf/Campaigns/CP/COP/Approximation/AllXCSP22/input_set/Rlfap-graph-07-opt_c18.xml.lzma
/home/cril/wwf/Campaigns/CP/COP/Approximation/AllXCSP22/input_set/Rlfap-graph-08-opt_c18.xml.lzma
/home/cril/wwf/Campaigns/CP/COP/Approximation/AllXCSP22/input_set/Rlfap-graph-09-opt_c18.xml.lzma
/home/cril/wwf/Campaigns/CP/COP/Approximation/AllXCSP22/input_set/Rlfap-graph-10-opt_c18.xml.lzma
/home/cril/wwf/Campaigns/CP/COP/Approximation/AllXCSP22/input_set/Rlfap-graph-11-opt_c18.xml.lzma
/home/cril/wwf/Campaigns/CP/COP/Approximation/AllXCSP22/input_set/Rlfap-graph-12-opt_c18.xml.lzma
/home/cril/wwf/Campaigns/CP/COP/Approximation/AllXCSP22/input_set/Rlfap-graph-13-opt_c18.xml.lzma
/home/cril/wwf/Campaigns/CP/COP/Approximation/AllXCSP22/input_set/Rlfap-graph-14-opt_c18.xml.lzma
/home/cril/wwf/Campaigns/CP/COP/Approximation/AllXCSP22/input_set/Rlfap-scen-01-opt_c18.xml.lzma
/home/cril/wwf/Campaigns/CP/COP/Approximation/AllXCSP22/input_set/Rlfap-scen-02-opt_c18.xml.lzma
/home/cril/wwf/Campaigns/CP/COP/Approximation/AllXCSP22/input_set/Rlfap-scen-03-opt_c18.xml.lzma
/home/cril/wwf/Campaigns/CP/COP/Approximation/AllXCSP22/input_set/Rlfap-scen-04-opt_c18.xml.lzma
/home/cril/wwf/Campaigns/CP/COP/Approximation/AllXCSP22/input_set/Rlfap-scen-05-opt_c18.xml.lzma
/home/cril/wwf/Campaigns/CP/COP/Approximation/AllXCSP22/input_set/Rlfap-scen-06-opt_c18.xml.lzma
/home/cril/wwf/Campaigns/CP/COP/Approximation/AllXCSP22/input_set/Rlfap-scen-07-opt_c18.xml.lzma
/home/cril/wwf/Campaigns/CP/COP/Approximation/AllXCSP22/input_set/Rlfap-scen-08-opt_c18.xml.lzma
/home/cril/wwf/Campaigns/CP/COP/Approximation/AllXCSP22/input_set/Rlfap-scen-09-opt_c18.xml.lzma
/home/cril/wwf/Campaigns/CP/COP/Approximation/AllXCSP22/input_set/Rlfap-scen-10-opt_c18.xml.lzma
/home/cril/wwf/Campaigns/CP/COP/Approximation/AllXCSP22/input_set/Rlfap-scen-11-opt_c18.xml.lzma
/home/cril/wwf/Campaigns/CP/COP/Approximation/AllXCSP22/input_set/Spot5-0005_c22.xml.lzma
/home/cril/wwf/Campaigns/CP/COP/Approximation/AllXCSP22/input_set/Spot5-0028_c22.xml.lzma
/home/cril/wwf/Campaigns/CP/COP/Approximation/AllXCSP22/input_set/Spot5-0029_c22.xml.lzma
/home/cril/wwf/Campaigns/CP/COP/Approximation/AllXCSP22/input_set/Spot5-0042_c22.xml.lzma
/home/cril/wwf/Campaigns/CP/COP/Approximation/AllXCSP22/input_set/Spot5-0054_c22.xml.lzma
/home/cril/wwf/Campaigns/CP/COP/Approximation/AllXCSP22/input_set/Spot5-0412_c22.xml.lzma
/home/cril/wwf/Campaigns/CP/COP/Approximation/AllXCSP22/input_set/Spot5-0414_c22.xml.lzma
/home/cril/wwf/Campaigns/CP/COP/Approximation/AllXCSP22/input_set/Spot5-0503_c22.xml.lzma
/home/cril/wwf/Campaigns/CP/COP/Approximation/AllXCSP22/input_set/Spot5-1401_c22.xml.lzma
/home/cril/wwf/Campaigns/CP/COP/Approximation/AllXCSP22/input_set/Spot5-1502_c22.xml.lzma
/home/cril/wwf/Campaigns/CP/COP/Approximation/AllXCSP22/input_set/Tal-01_c18.xml.lzma
/home/cril/wwf/Campaigns/CP/COP/Approximation/AllXCSP22/input_set/Tal-02_c18.xml.lzma
/home/cril/wwf/Campaigns/CP/COP/Approximation/AllXCSP22/input_set/Tal-03_c18.xml.lzma
/home/cril/wwf/Campaigns/CP/COP/Approximation/AllXCSP22/input_set/Tal-04_c18.xml.lzma
/home/cril/wwf/Campaigns/CP/COP/Approximation/AllXCSP22/input_set/Tal-05_c18.xml.lzma
/home/cril/wwf/Campaigns/CP/COP/Approximation/AllXCSP22/input_set/Tal-06_c18.xml.lzma
/home/cril/wwf/Campaigns/CP/COP/Approximation/AllXCSP22/input_set/Tal-07_c18.xml.lzma
/home/cril/wwf/Campaigns/CP/COP/Approximation/AllXCSP22/input_set/Tal-08_c18.xml.lzma
/home/cril/wwf/Campaigns/CP/COP/Approximation/AllXCSP22/input_set/Tal-09_c18.xml.lzma
/home/cril/wwf/Campaigns/CP/COP/Approximation/AllXCSP22/input_set/Tal-10_c18.xml.lzma
/home/cril/wwf/Campaigns/CP/COP/Approximation/AllXCSP22/input_set/Triangular-10_c22.xml.lzma
/home/cril/wwf/Campaigns/CP/COP/Approximation/AllXCSP22/input_set/Triangular-15_c22.xml.lzma
/home/cril/wwf/Campaigns/CP/COP/Approximation/AllXCSP22/input_set/Triangular-20_c22.xml.lzma
/home/cril/wwf/Campaigns/CP/COP/Approximation/AllXCSP22/input_set/Triangular-22_c22.xml.lzma
/home/cril/wwf/Campaigns/CP/COP/Approximation/AllXCSP22/input_set/Triangular-25_c22.xml.lzma
/home/cril/wwf/Campaigns/CP/COP/Approximation/AllXCSP22/input_set/Triangular-28_c22.xml.lzma
/home/cril/wwf/Campaigns/CP/COP/Approximation/AllXCSP22/input_set/Triangular-30_c22.xml.lzma
/home/cril/wwf/Campaigns/CP/COP/Approximation/AllXCSP22/input_set/Triangular-32_c22.xml.lzma
/home/cril/wwf/Campaigns/CP/COP/Approximation/AllXCSP22/input_set/Triangular-35_c22.xml.lzma
/home/cril/wwf/Campaigns/CP/COP/Approximation/AllXCSP22/input_set/Triangular-38_c22.xml.lzma
/home/cril/wwf/Campaigns/CP/COP/Approximation/AllXCSP22/input_set/Warehouse-40-80-00_c22.xml.lzma
/home/cril/wwf/Campaigns/CP/COP/Approximation/AllXCSP22/input_set/Warehouse-40-80-01_c22.xml.lzma
/home/cril/wwf/Campaigns/CP/COP/Approximation/AllXCSP22/input_set/Warehouse-40-80-02_c22.xml.lzma
/home/cril/wwf/Campaigns/CP/COP/Approximation/AllXCSP22/input_set/Warehouse-50-100-00_c22.xml.lzma
/home/cril/wwf/Campaigns/CP/COP/Approximation/AllXCSP22/input_set/Warehouse-50-100-01_c22.xml.lzma
/home/cril/wwf/Campaigns/CP/COP/Approximation/AllXCSP22/input_set/Warehouse-50-100-02_c22.xml.lzma
/home/cril/wwf/Campaigns/CP/COP/Approximation/AllXCSP22/input_set/Warehouse-60-120-00_c22.xml.lzma
/home/cril/wwf/Campaigns/CP/COP/Approximation/AllXCSP22/input_set/Warehouse-60-120-01_c22.xml.lzma
/home/cril/wwf/Campaigns/CP/COP/Approximation/AllXCSP22/input_set/Warehouse-60-120-02_c22.xml.lzma
/home/cril/wwf/Campaigns/CP/COP/Approximation/AllXCSP22/input_set/WarOrPeace-08_c22.xml.lzma
/home/cril/wwf/Campaigns/CP/COP/Approximation/AllXCSP22/input_set/WarOrPeace-09_c22.xml.lzma
/home/cril/wwf/Campaigns/CP/COP/Approximation/AllXCSP22/input_set/WarOrPeace-10_c22.xml.lzma
/home/cril/wwf/Campaigns/CP/COP/Approximation/AllXCSP22/input_set/WarOrPeace-12_c22.xml.lzma
/home/cril/wwf/Campaigns/CP/COP/Approximation/AllXCSP22/input_set/WarOrPeace-14_c22.xml.lzma
/home/cril/wwf/Campaigns/CP/COP/Approximation/AllXCSP22/input_set/WarOrPeace-or-08_c22.xml.lzma
/home/cril/wwf/Campaigns/CP/COP/Approximation/AllXCSP22/input_set/WarOrPeace-or-09_c22.xml.lzma
/home/cril/wwf/Campaigns/CP/COP/Approximation/AllXCSP22/input_set/WarOrPeace-or-10_c22.xml.lzma
/home/cril/wwf/Campaigns/CP/COP/Approximation/AllXCSP22/input_set/WarOrPeace-or-12_c22.xml.lzma
/home/cril/wwf/Campaigns/CP/COP/Approximation/AllXCSP22/input_set/WarOrPeace-or-14_c22.xml.lzma
